FailedOk

th/SRPMS[OK]
th/x32[OK]
th/i686[OK]
th/x86_64[OK]

ac/SRPMS[OK]
ac/i386[OK]
ac/i586[OK]
ac/i686[OK]
ac/alpha[OK]
ac/amd64[OK]
ac/athlon[OK]
ac/ppc[OK]
ac/sparc[OK]
ac/sparc64[OK]

Advanced Search
main()
Powered by PLD Linux
(c) 2002-2021 PLD Team
$Revision: 1.37 $
Powered by sfistak.
Your IP: 3.238.204.31

exim 1656B87D-B958-4D21-9882-DBC8C7C18690

Status:Failed
Source URL:https://buildlogs.pld-linux.org/pld/th/x86_64/FAIL/exim,1656B87D-B958-4D21-9882-DBC8C7C18690.bz2
text/plain URL:View!
full text:View!
rpm -qa of builder:View!
Date:2021/10/05 19:12:18
Runtime:0:00:02.768460

Toc:

  • error 1
  • tls-openssl.c:235:6: error: missing binary operator before token "1"
  • error 2
  • make[1]: *** [Makefile:338: macro-tls.o] Error 1
  • error 3
  • error: Bad exit status from /tmp/B._wsv1qis/BUILD/tmp/rpm-tmp.1dQ5ob (%build)
  • error 4
  • RPM build errors:
  • error 5
  • error: No files produced.

Content:

LOOKUP_LIBS+=-lspf2
EXPERIMENTAL_SRS_ALT=yes
LOOKUP_LIBS+=-lsrs_alt
LOOKUP_REDIS=yes
LOOKUP_LIBS+=-lhiredis
LOOKUP_MYSQL=yes
# for dynamic
LOOKUP_MYSQL_INCLUDE=-I/usr/include/mysql
LOOKUP_MYSQL_LIBS=-lmysqlclient
# for static
LOOKUP_INCLUDE+=-I/usr/include/mysql
LOOKUP_LIBS+=-lmysqlclient
LOOKUP_PGSQL=yes
# for dynamic
LOOKUP_PGSQL_INCLUDE=-I/usr/include/pgsql
LOOKUP_PGSQL_LIBS=-lpq
# for static
LOOKUP_INCLUDE+=-I/usr/include/pgsql
LOOKUP_LIBS+=-lpq
LOOKUP_SQLITE=yes
# for dynamic
LOOKUP_SQLITE_LIBS=-lsqlite3
# for static
LOOKUP_LIBS+=-lsqlite3
LOOKUP_WHOSON=yes
# for dynamic
LOOKUP_WHOSON_LIBS=-lwhoson
# for static
LOOKUP_LIBS+=-lwhoson
AUTH_CYRUS_SASL=yes
LOOKUP_LIBS+=-lsasl2
LOOKUP_LDAP=yes
LDAP_LIB_TYPE=OPENLDAP2
# for dynamic
LOOKUP_LDAP_LIBS=-lldap -llber
# for static
LOOKUP_LIBS+=-lldap -llber
EXPERIMENTAL_LMDB=yes
LOOKUP_LIBS+=-llmdb
DLOPEN_LOCAL_SCAN=yes
EOF

+ >>Local/Makefile-Linux 
+ cat
+ cp -f src/EDITME Local/Makefile
+ cp -f exim_monitor/EDITME Local/eximon.conf
+ RPM_EC=0 
+ jobs -p
+ exit 0
Executing(%build): /bin/sh -e /tmp/B._wsv1qis/BUILD/tmp/rpm-tmp.1dQ5ob
TMP=/home/users/builder/tmp
HOME=/home/users/builder
PATH=/home/users/builder/GNUstep/Tools:/bin:/usr/bin:/usr/local/bin:/home/users/builder/bin
TMPDIR=/tmp/B._wsv1qis/BUILD/tmp
+ umask 022
+ cd /tmp/B._wsv1qis/BUILD
+ cd exim-4.95
+ /usr/bin/make -Otarget -j9 -e 'FULLECHO='
/bin/sh scripts/source_checks

>>> Creating links to source files...
>>> Creating lookups/Makefile for building dynamic modules
>>> New Makefile & lookups/Makefile installed
>>> Use "make makefile" if you need to force rebuilding of the makefile
 
make[1]: Entering directory '/tmp/B._wsv1qis/BUILD/exim-4.95/build-Linux-IntelR_XeonR_CPU___________X5482___3.20GHz'
make[1]: warning: -j9 forced in submake: resetting jobserver mode.
make[1]: Leaving directory '/tmp/B._wsv1qis/BUILD/exim-4.95/build-Linux-IntelR_XeonR_CPU___________X5482___3.20GHz'
make[1]: Entering directory '/tmp/B._wsv1qis/BUILD/exim-4.95/build-Linux-IntelR_XeonR_CPU___________X5482___3.20GHz'
/bin/sh ../scripts/Configure-os.c
make[1]: Leaving directory '/tmp/B._wsv1qis/BUILD/exim-4.95/build-Linux-IntelR_XeonR_CPU___________X5482___3.20GHz'
make[1]: Entering directory '/tmp/B._wsv1qis/BUILD/exim-4.95/build-Linux-IntelR_XeonR_CPU___________X5482___3.20GHz'
/bin/sh ../scripts/Configure-os.h
make[1]: Leaving directory '/tmp/B._wsv1qis/BUILD/exim-4.95/build-Linux-IntelR_XeonR_CPU___________X5482___3.20GHz'
make[1]: Entering directory '/tmp/B._wsv1qis/BUILD/exim-4.95/build-Linux-IntelR_XeonR_CPU___________X5482___3.20GHz'
x86_64-pld-linux-gcc exim_lock.c
x86_64-pld-linux-gcc -c -D_FILE_OFFSET_BITS=64 -D_LARGEFILE_SOURCE -O2 -fwrapv -pipe -Wformat -Werror=format-security -gdwarf-4 -fno-debug-types-section -fvar-tracking-assignments -g2 -Wp,-D_FORTIFY_SOURCE=2 -fstack-protector-strong --param=ssp-buffer-size=4 -Werror=trampolines -fPIC -march=x86-64 -mtune=generic -gdwarf-4 -fno-debug-types-section -fvar-tracking-assignments -g2 -fvisibility=hidden  exim_lock.c
x86_64-pld-linux-gcc -o exim_lock
x86_64-pld-linux-gcc -o exim_lock  exim_lock.o  \
  -lcrypt -lm -lpam -ldl
>>> exim_lock utility built
 
make[1]: Leaving directory '/tmp/B._wsv1qis/BUILD/exim-4.95/build-Linux-IntelR_XeonR_CPU___________X5482___3.20GHz'
make[1]: Entering directory '/tmp/B._wsv1qis/BUILD/exim-4.95/build-Linux-IntelR_XeonR_CPU___________X5482___3.20GHz'
x86_64-pld-linux-gcc buildconfig.c
x86_64-pld-linux-gcc -D_FILE_OFFSET_BITS=64 -D_LARGEFILE_SOURCE -O2 -fwrapv -pipe -Wformat -Werror=format-security -gdwarf-4 -fno-debug-types-section -fvar-tracking-assignments -g2 -Wp,-D_FORTIFY_SOURCE=2 -fstack-protector-strong --param=ssp-buffer-size=4 -Werror=trampolines -fPIC -march=x86-64 -mtune=generic -gdwarf-4 -fno-debug-types-section -fvar-tracking-assignments -g2 -fvisibility=hidden  -o buildconfig buildconfig.c -lcrypt -lm
make[1]: Leaving directory '/tmp/B._wsv1qis/BUILD/exim-4.95/build-Linux-IntelR_XeonR_CPU___________X5482___3.20GHz'
/bin/sh ../scripts/Configure-config.h "/usr/bin/make"
make[2]: 'buildconfig' is up to date.
Building configuration file config.h
>>> config.h built

make[1]: Entering directory '/tmp/B._wsv1qis/BUILD/exim-4.95/build-Linux-IntelR_XeonR_CPU___________X5482___3.20GHz'
x86_64-pld-linux-gcc -DMACRO_PREDEF tls.c
x86_64-pld-linux-gcc -c -D_FILE_OFFSET_BITS=64 -D_LARGEFILE_SOURCE -O2 -fwrapv -pipe -Wformat -Werror=format-security -gdwarf-4 -fno-debug-types-section -fvar-tracking-assignments -g2 -Wp,-D_FORTIFY_SOURCE=2 -fstack-protector-strong --param=ssp-buffer-size=4 -Werror=trampolines -fPIC -march=x86-64 -mtune=generic -gdwarf-4 -fno-debug-types-section -fvar-tracking-assignments -g2 -fvisibility=hidden -DMACRO_PREDEF  -o macro-tls.o tls.c
In file included from sha_ver.h:38,
                 from hash.h:14,
                 from exim.h:537,
                 from tls.c:20:
tls-openssl.c:235:6: error: missing binary operator before token "1"
  235 | # if SSL_OP_NO_TLSv1_1 == 0x00000400L
      |      ^~~~~~~~~~~~~~~~~
make[1]: *** [Makefile:338: macro-tls.o] Error 1
make[1]: Leaving directory '/tmp/B._wsv1qis/BUILD/exim-4.95/build-Linux-IntelR_XeonR_CPU___________X5482___3.20GHz'
make[1]: *** Waiting for unfinished jobs....
make[1]: Entering directory '/tmp/B._wsv1qis/BUILD/exim-4.95/build-Linux-IntelR_XeonR_CPU___________X5482___3.20GHz'
x86_64-pld-linux-gcc -DMACRO_PREDEF transport.c
x86_64-pld-linux-gcc -c -D_FILE_OFFSET_BITS=64 -D_LARGEFILE_SOURCE -O2 -fwrapv -pipe -Wformat -Werror=format-security -gdwarf-4 -fno-debug-types-section -fvar-tracking-assignments -g2 -Wp,-D_FORTIFY_SOURCE=2 -fstack-protector-strong --param=ssp-buffer-size=4 -Werror=trampolines -fPIC -march=x86-64 -mtune=generic -gdwarf-4 -fno-debug-types-section -fvar-tracking-assignments -g2 -fvisibility=hidden -DMACRO_PREDEF  -o macro-transport.o transport.c
make[1]: Leaving directory '/tmp/B._wsv1qis/BUILD/exim-4.95/build-Linux-IntelR_XeonR_CPU___________X5482___3.20GHz'
make[1]: Entering directory '/tmp/B._wsv1qis/BUILD/exim-4.95/build-Linux-IntelR_XeonR_CPU___________X5482___3.20GHz'
x86_64-pld-linux-gcc -DMACRO_PREDEF drtables.c
x86_64-pld-linux-gcc -c -D_FILE_OFFSET_BITS=64 -D_LARGEFILE_SOURCE -O2 -fwrapv -pipe -Wformat -Werror=format-security -gdwarf-4 -fno-debug-types-section -fvar-tracking-assignments -g2 -Wp,-D_FORTIFY_SOURCE=2 -fstack-protector-strong --param=ssp-buffer-size=4 -Werror=trampolines -fPIC -march=x86-64 -mtune=generic -gdwarf-4 -fno-debug-types-section -fvar-tracking-assignments -g2 -fvisibility=hidden -DMACRO_PREDEF  -o macro-drtables.o drtables.c
make[1]: Leaving directory '/tmp/B._wsv1qis/BUILD/exim-4.95/build-Linux-IntelR_XeonR_CPU___________X5482___3.20GHz'
make[1]: Entering directory '/tmp/B._wsv1qis/BUILD/exim-4.95/build-Linux-IntelR_XeonR_CPU___________X5482___3.20GHz'
x86_64-pld-linux-gcc -DMACRO_PREDEF route.c
x86_64-pld-linux-gcc -c -D_FILE_OFFSET_BITS=64 -D_LARGEFILE_SOURCE -O2 -fwrapv -pipe -Wformat -Werror=format-security -gdwarf-4 -fno-debug-types-section -fvar-tracking-assignments -g2 -Wp,-D_FORTIFY_SOURCE=2 -fstack-protector-strong --param=ssp-buffer-size=4 -Werror=trampolines -fPIC -march=x86-64 -mtune=generic -gdwarf-4 -fno-debug-types-section -fvar-tracking-assignments -g2 -fvisibility=hidden -DMACRO_PREDEF  -o macro-route.o route.c
make[1]: Leaving directory '/tmp/B._wsv1qis/BUILD/exim-4.95/build-Linux-IntelR_XeonR_CPU___________X5482___3.20GHz'
make[1]: Entering directory '/tmp/B._wsv1qis/BUILD/exim-4.95/build-Linux-IntelR_XeonR_CPU___________X5482___3.20GHz'
x86_64-pld-linux-gcc -DMACRO_PREDEF globals.c
x86_64-pld-linux-gcc -c -D_FILE_OFFSET_BITS=64 -D_LARGEFILE_SOURCE -O2 -fwrapv -pipe -Wformat -Werror=format-security -gdwarf-4 -fno-debug-types-section -fvar-tracking-assignments -g2 -Wp,-D_FORTIFY_SOURCE=2 -fstack-protector-strong --param=ssp-buffer-size=4 -Werror=trampolines -fPIC -march=x86-64 -mtune=generic -gdwarf-4 -fno-debug-types-section -fvar-tracking-assignments -g2 -fvisibility=hidden -DMACRO_PREDEF  -o macro-globals.o globals.c
make[1]: Leaving directory '/tmp/B._wsv1qis/BUILD/exim-4.95/build-Linux-IntelR_XeonR_CPU___________X5482___3.20GHz'
make[1]: Entering directory '/tmp/B._wsv1qis/BUILD/exim-4.95/build-Linux-IntelR_XeonR_CPU___________X5482___3.20GHz'
x86_64-pld-linux-gcc -DMACRO_PREDEF readconf.c
x86_64-pld-linux-gcc -c -D_FILE_OFFSET_BITS=64 -D_LARGEFILE_SOURCE -O2 -fwrapv -pipe -Wformat -Werror=format-security -gdwarf-4 -fno-debug-types-section -fvar-tracking-assignments -g2 -Wp,-D_FORTIFY_SOURCE=2 -fstack-protector-strong --param=ssp-buffer-size=4 -Werror=trampolines -fPIC -march=x86-64 -mtune=generic -gdwarf-4 -fno-debug-types-section -fvar-tracking-assignments -g2 -fvisibility=hidden -DMACRO_PREDEF  -o macro-readconf.o readconf.c
make[1]: Leaving directory '/tmp/B._wsv1qis/BUILD/exim-4.95/build-Linux-IntelR_XeonR_CPU___________X5482___3.20GHz'
make[1]: Entering directory '/tmp/B._wsv1qis/BUILD/exim-4.95/build-Linux-IntelR_XeonR_CPU___________X5482___3.20GHz'
x86_64-pld-linux-gcc -DMACRO_PREDEF acl.c
x86_64-pld-linux-gcc -c -D_FILE_OFFSET_BITS=64 -D_LARGEFILE_SOURCE -O2 -fwrapv -pipe -Wformat -Werror=format-security -gdwarf-4 -fno-debug-types-section -fvar-tracking-assignments -g2 -Wp,-D_FORTIFY_SOURCE=2 -fstack-protector-strong --param=ssp-buffer-size=4 -Werror=trampolines -fPIC -march=x86-64 -mtune=generic -gdwarf-4 -fno-debug-types-section -fvar-tracking-assignments -g2 -fvisibility=hidden -DMACRO_PREDEF  -o macro-acl.o acl.c
make[1]: Leaving directory '/tmp/B._wsv1qis/BUILD/exim-4.95/build-Linux-IntelR_XeonR_CPU___________X5482___3.20GHz'
make[1]: Entering directory '/tmp/B._wsv1qis/BUILD/exim-4.95/build-Linux-IntelR_XeonR_CPU___________X5482___3.20GHz'
x86_64-pld-linux-gcc -DMACRO_PREDEF transports/appendfile.c
x86_64-pld-linux-gcc -c -D_FILE_OFFSET_BITS=64 -D_LARGEFILE_SOURCE -O2 -fwrapv -pipe -Wformat -Werror=format-security -gdwarf-4 -fno-debug-types-section -fvar-tracking-assignments -g2 -Wp,-D_FORTIFY_SOURCE=2 -fstack-protector-strong --param=ssp-buffer-size=4 -Werror=trampolines -fPIC -march=x86-64 -mtune=generic -gdwarf-4 -fno-debug-types-section -fvar-tracking-assignments -g2 -fvisibility=hidden -DMACRO_PREDEF  -o macro-appendfile.o transports/appendfile.c
make[1]: Leaving directory '/tmp/B._wsv1qis/BUILD/exim-4.95/build-Linux-IntelR_XeonR_CPU___________X5482___3.20GHz'
make[1]: Entering directory '/tmp/B._wsv1qis/BUILD/exim-4.95/build-Linux-IntelR_XeonR_CPU___________X5482___3.20GHz'
x86_64-pld-linux-gcc -DMACRO_PREDEF macro_predef.c
x86_64-pld-linux-gcc -c -D_FILE_OFFSET_BITS=64 -D_LARGEFILE_SOURCE -O2 -fwrapv -pipe -Wformat -Werror=format-security -gdwarf-4 -fno-debug-types-section -fvar-tracking-assignments -g2 -Wp,-D_FORTIFY_SOURCE=2 -fstack-protector-strong --param=ssp-buffer-size=4 -Werror=trampolines -fPIC -march=x86-64 -mtune=generic -gdwarf-4 -fno-debug-types-section -fvar-tracking-assignments -g2 -fvisibility=hidden -DMACRO_PREDEF  -o macro_predef.o macro_predef.c
make[1]: Leaving directory '/tmp/B._wsv1qis/BUILD/exim-4.95/build-Linux-IntelR_XeonR_CPU___________X5482___3.20GHz'
make: *** [Makefile:35: all] Error 2
error: Bad exit status from /tmp/B._wsv1qis/BUILD/tmp/rpm-tmp.1dQ5ob (%build)


RPM build errors:
    line 110: It's not recommended to have unversioned Obsoletes: Obsoletes:	exipick
    line 111: It's not recommended to have unversioned Obsoletes: Obsoletes:	smtpdaemon
    Could not canonicalize hostname: ymir
    Bad exit status from /tmp/B._wsv1qis/BUILD/tmp/rpm-tmp.1dQ5ob (%build)
ended at: Tue Oct  5 19:12:18 2021, done in 0:00:02.768460
error: No files produced.
+ chmod -R u+rwX /tmp/B._wsv1qis/BUILD
+ rm -rf /tmp/B._wsv1qis/tmp /tmp/B._wsv1qis/BUILD
+ rm -rf /tmp/B._wsv1qis
Begin-PLD-Builder-Info
Build-Time: user:5.45s sys:1.53s real:4.79s (faults io:6 non-io:334352)

End-PLD-Builder-Info
[Back to list of logs] [View rpm -qa of builder]