FailedOk

th/SRPMS[OK]
th/x32[OK]
th/i686[OK]
th/x86_64[OK]

ac/SRPMS[OK]
ac/i386[OK]
ac/i586[OK]
ac/i686[OK]
ac/alpha[OK]
ac/amd64[OK]
ac/athlon[OK]
ac/ppc[OK]
ac/sparc[OK]
ac/sparc64[OK]

Advanced Search
main()
Powered by PLD Linux
(c) 2002-2021 PLD Team
$Revision: 1.37 $
Powered by six Cray XMT Supercomputers.
Your IP: 3.236.239.91

exim 93FDFB30-7FF1-47BA-B388-661FA0C33421

Status:Failed
Source URL:https://buildlogs.pld-linux.org/pld/th/x86_64/FAIL/exim,93FDFB30-7FF1-47BA-B388-661FA0C33421.bz2
text/plain URL:View!
rpm -qa of builder:View!
Date:2021/10/06 08:22:39
Runtime:0:00:02.736096

Toc:

  • prep
  • Executing(%prep): /bin/sh -e /tmp/B.fj1cxj3t/BUILD/tmp/rpm-tmp.bwDtxL
  • build
  • Executing(%build): /bin/sh -e /tmp/B.fj1cxj3t/BUILD/tmp/rpm-tmp.c70aSR
  • error 1
  • tls-openssl.c:235:50: error: missing binary operator before token "1"
  • error 2
  • make[1]: *** [Makefile:338: macro-tls.o] Error 1
  • error 3
  • error: Bad exit status from /tmp/B.fj1cxj3t/BUILD/tmp/rpm-tmp.c70aSR (%build)
  • error 4
  • RPM build errors:
  • error 5
  • error: No files produced.

Content:

request from: arekm
checking if we should skip the build
started at: Wed Oct  6 08:22:34 2021
killing old processes on a builder
sending signal 9 to pid -1
cleaning up /tmp
fetching https://srcbuilder.pld-linux.org/th//srpms/93FDFB30-7FF1-47BA-B388-661FA0C33421/exim-4.95-1.src.rpm
fetched 2766162 bytes, 5687.3 K/s
installing srpm: exim-4.95-1.src.rpm
+ install -d /tmp/B.fj1cxj3t/BUILD /tmp/B.fj1cxj3t/RPMS
+ LC_ALL=en_US.UTF-8
+ rpm -qp --changelog exim-4.95-1.src.rpm
* Wed Oct 06 2021 PLD Linux Team <feedback@pld-linux.org>
- For complete changelog see: http://git.pld-linux.org/?p=packages/exim.git;a=log;h=master
* Wed Oct 06 2021 Arkadiusz Miśkiewicz <arekm@maven.pl> fa4f082
- Build fixes for openssl 3. * Tue Oct 05 2021 Arkadiusz Miśkiewicz <arekm@maven.pl> b3e9324
- Up to 4.95; still using SRS_ALT implementation over new, native one (need migration guide first) * Sun Sep 05 2021 Arkadiusz Miśkiewicz <arekm@maven.pl> 16a62dd
- Rel 6; upstream fixes and also fix logging of message-id * Tue Aug 10 2021 Arkadiusz Miśkiewicz <arekm@maven.pl> 8b7bebb
- Rel 5; fixes fakereject taint * Tue Jun 22 2021 Arkadiusz Miśkiewicz <arekm@maven.pl> 324d5d7
- Rel 4; more from upstream default config; fix local_delivery that was using tainted data (and thus preventing mail delivery) * Mon May 17 2021 Arkadiusz Miśkiewicz <arekm@maven.pl> 28c6a75
- rel 3; upstream fixes * Thu May 13 2021 Arkadiusz Miśkiewicz <arekm@maven.pl> e26ce42
- Upstream Fix ${ipv6norm:} * Fri May 07 2021 Jan Rękorajski <baggins@pld-linux.org> 783e1ea
- rebuild with perl 5.32 * Tue May 04 2021 Arkadiusz Miśkiewicz <arekm@maven.pl> acd0d13
- switch to 4.94.2 tarballs; SECURITY fixes * Tue May 04 2021 Arkadiusz Miśkiewicz <arekm@maven.pl> a05609c
- rel 18; tiny upstream fixes * Wed Mar 03 2021 Arkadiusz Miśkiewicz <arekm@maven.pl> c769f58
- rel 17; small fixes from upstream * Fri Feb 19 2021 Arkadiusz Miśkiewicz <arekm@maven.pl> 80897ef
- rel 16; fix spamd even loadbalancing * Tue Feb 09 2021 Arkadiusz Miśkiewicz <arekm@maven.pl> 3cad492
- rel 15; fixes problem with missing/duplicate remote deliveries when using pipelining * Thu Jan 21 2021 Arkadiusz Miśkiewicz <arekm@maven.pl> 5436445
- rel 14; tiny upstream fixes * Tue Jan 05 2021 Arkadiusz Miśkiewicz <arekm@maven.pl> f6c4b74
- rel 13; fixes from upstream * Fri Nov 27 2020 Arkadiusz Miśkiewicz <arekm@maven.pl> 0473fda
- rel 12; fixes from upstream (+ rediff for rpm.org) * Sun Oct 25 2020 Jakub Bogusz <qboosh@pld-linux.org> b7810a9
- release 11 (hiredis 1.0.0) * Sun Oct 25 2020 Jakub Bogusz <qboosh@pld-linux.org> c4782b5
- BR and files order cleanup (inc. moving eximon(8) page to proper package) - GPL version * Thu Sep 10 2020 Arkadiusz Miśkiewicz <arekm@maven.pl> e3a2f82
- rel 10; upstream fixes * Thu Aug 27 2020 Arkadiusz Miśkiewicz <arekm@maven.pl> 41f4ccd
- rel 9; fixes from upstream + rpm -Uhv --nodeps --define '_topdir /tmp/B.fj1cxj3t' --define '_specdir %{_topdir}' --define '_sourcedir %{_specdir}' --define '_rpmdir %{_topdir}/RPMS' --define '_builddir %{_topdir}/BUILD' exim-4.95-1.src.rpm Updating / installing... exim-2:4.95-1 ######################################## + rm -f exim-4.95-1.src.rpm + install -m 700 -d /tmp/B.fj1cxj3t/BUILD/tmp + TMPDIR=/tmp/B.fj1cxj3t/BUILD/tmp + exec nice -n 0 rpmbuild -bp --short-circuit --nodeps --define '_topdir /tmp/B.fj1cxj3t' --define '_specdir %{_topdir}' --define '_sourcedir %{_specdir}' --define '_rpmdir %{_topdir}/RPMS' --define '_builddir %{_topdir}/BUILD' --target x86_64-pld-linux --define 'prep exit 0' /tmp/B.fj1cxj3t/exim.spec warning: line 111: It's not recommended to have unversioned Obsoletes: Obsoletes: exipick warning: line 112: It's not recommended to have unversioned Obsoletes: Obsoletes: smtpdaemon warning: Could not canonicalize hostname: ymir Building target platforms: x86_64-pld-linux Building for target x86_64-pld-linux checking BuildConflict-ing packages rpm: warning: line 111: It's not recommended to have unversioned Obsoletes: Obsoletes: exipick rpm: warning: line 112: It's not recommended to have unversioned Obsoletes: Obsoletes: smtpdaemon rpm: warning: Could not canonicalize hostname: ymir rpm: Building target platforms: x86_64-pld-linux rpm: Building for target x86_64-pld-linux no BuildConflicts found checking BR rpm: warning: line 111: It's not recommended to have unversioned Obsoletes: Obsoletes: exipick rpm: warning: line 112: It's not recommended to have unversioned Obsoletes: Obsoletes: smtpdaemon rpm: warning: Could not canonicalize hostname: ymir rpm: Building target platforms: x86_64-pld-linux rpm: Building for target x86_64-pld-linux no BR needed building RPM using: set -ex; : build-id: 93FDFB30-7FF1-47BA-B388-661FA0C33421; TMPDIR=/tmp/B.fj1cxj3t/BUILD/tmp exec nice -n 0 rpmbuild -bb --define '_smp_mflags -j9' --define '_make_opts -Otarget' --define '_pld_builder 1' --define '_topdir /tmp/B.fj1cxj3t' --define '_specdir %{_topdir}' --define '_sourcedir %{_specdir}' --define '_rpmdir %{_topdir}/RPMS' --define '_builddir %{_topdir}/BUILD' --target x86_64-pld-linux /tmp/B.fj1cxj3t/exim.spec + : build-id: 93FDFB30-7FF1-47BA-B388-661FA0C33421 + TMPDIR=/tmp/B.fj1cxj3t/BUILD/tmp + exec nice -n 0 rpmbuild -bb --define '_smp_mflags -j9' --define '_make_opts -Otarget' --define '_pld_builder 1' --define '_topdir /tmp/B.fj1cxj3t' --define '_specdir %{_topdir}' --define '_sourcedir %{_specdir}' --define '_rpmdir %{_topdir}/RPMS' --define '_builddir %{_topdir}/BUILD' --target x86_64-pld-linux /tmp/B.fj1cxj3t/exim.spec warning: line 111: It's not recommended to have unversioned Obsoletes: Obsoletes: exipick warning: line 112: It's not recommended to have unversioned Obsoletes: Obsoletes: smtpdaemon warning: Could not canonicalize hostname: ymir Building target platforms: x86_64-pld-linux Building for target x86_64-pld-linux Executing(%prep): /bin/sh -e /tmp/B.fj1cxj3t/BUILD/tmp/rpm-tmp.bwDtxL + umask 022 + cd /tmp/B.fj1cxj3t/BUILD + cd /tmp/B.fj1cxj3t/BUILD + rm -rf exim-4.95 + /usr/bin/bzip2 -dc /tmp/B.fj1cxj3t/exim-4.95.tar.bz2 + /bin/tar -xof - + STATUS=0 + '[' 0 -ne 0 ']' + cd exim-4.95 + /usr/bin/bzip2 -dc /tmp/B.fj1cxj3t/exim-html-4.95.tar.bz2 + /bin/tar -xof - + STATUS=0 + '[' 0 -ne 0 ']' + /usr/bin/bzip2 -dc /tmp/B.fj1cxj3t/exim4-man-021016.tar.bz2 + /bin/tar -xof - + STATUS=0 + '[' 0 -ne 0 ']' + /bin/chmod -Rf a+rX,u+w,g-w,o-w . + echo 'Patch #0 (exim4-EDITME.patch):' Patch #0 (exim4-EDITME.patch): + </tmp/B.fj1cxj3t/exim4-EDITME.patch + /usr/bin/patch -s -p1 '--fuzz=0' + echo 'Patch #1 (exim4-monitor-EDITME.patch):' Patch #1 (exim4-monitor-EDITME.patch): + </tmp/B.fj1cxj3t/exim4-monitor-EDITME.patch + /usr/bin/patch -s -p1 '--fuzz=0' + echo 'Patch #2 (exim4-cflags.patch):' Patch #2 (exim4-cflags.patch): + </tmp/B.fj1cxj3t/exim4-cflags.patch + /usr/bin/patch -s -p1 '--fuzz=0' + echo 'Patch #3 (exim-defs.patch):' Patch #3 (exim-defs.patch): + </tmp/B.fj1cxj3t/exim-defs.patch + /usr/bin/patch -s -p1 '--fuzz=0' + echo 'Patch #4 (exim4-Makefile-Default.patch):' Patch #4 (exim4-Makefile-Default.patch): + </tmp/B.fj1cxj3t/exim4-Makefile-Default.patch + /usr/bin/patch -s -p1 '--fuzz=0' + echo 'Patch #5 (localscan_dlopen_exim_4.20_or_better.patch):' Patch #5 (localscan_dlopen_exim_4.20_or_better.patch): + </tmp/B.fj1cxj3t/localscan_dlopen_exim_4.20_or_better.patch + /usr/bin/patch -s -p1 '--fuzz=0' + echo 'Patch #6 (ssl.patch):' Patch #6 (ssl.patch): + </tmp/B.fj1cxj3t/ssl.patch + /usr/bin/patch -s -p1 '--fuzz=0' + echo 'Patch #8 (exim-spam-timeout.patch):' Patch #8 (exim-spam-timeout.patch): + </tmp/B.fj1cxj3t/exim-spam-timeout.patch + /usr/bin/patch -s -p1 '--fuzz=0' + install /tmp/B.fj1cxj3t/exim4.conf exim4.conf + install /tmp/B.fj1cxj3t/config.samples.tar.bz2 doc/config.samples.tar.bz2 + echo 'Patch #20 (exim4-disableSSLv3.patch):' Patch #20 (exim4-disableSSLv3.patch): + </tmp/B.fj1cxj3t/exim4-disableSSLv3.patch + /usr/bin/patch -s -p1 '--fuzz=0' + install -d Local + <<"EOF" CC=x86_64-pld-linux-gcc CUSTOM_CFLAGS= -O2 -fwrapv -pipe -Wformat -Werror=format-security -gdwarf-4 -fno-debug-types-section -fvar-tracking-assignments -g2 -Wp,-D_FORTIFY_SOURCE=2 -fstack-protector-strong --param=ssp-buffer-size=4 -Werror=trampolines -fPIC -march=x86-64 -mtune=generic -gdwarf-4 -fno-debug-types-section -fvar-tracking-assignments -g2 CFLAGS_DYNAMIC=-shared -rdynamic -fPIC -Wl,--as-needed -Wl,--no-copy-dt-needed-entries -Wl,-z,relro -Wl,-z,combreloc LOOKUP_CDB=yes XLFLAGS=-L/usr/X11R6/lib64 X11_LD_LIB=/usr/X11R6/lib64 EXPERIMENTAL_ARC=yes EXPERIMENTAL_DCC=yes EXPERIMENTAL_PRDR=yes EXPERIMENTAL_DSN_INFO=yes EXPERIMENTAL_QUEUEFILE=yes SUPPORT_DANE=yes SUPPORT_I18N=yes SUPPORT_I18N_2008=yes LDFLAGS+= -lidn -lidn2 SUPPORT_PROXY=yes SUPPORT_SPF=yes LOOKUP_LIBS+=-lspf2 EXPERIMENTAL_SRS_ALT=yes LOOKUP_LIBS+=-lsrs_alt LOOKUP_REDIS=yes LOOKUP_LIBS+=-lhiredis LOOKUP_MYSQL=yes # for dynamic LOOKUP_MYSQL_INCLUDE=-I/usr/include/mysql LOOKUP_MYSQL_LIBS=-lmysqlclient # for static LOOKUP_INCLUDE+=-I/usr/include/mysql LOOKUP_LIBS+=-lmysqlclient LOOKUP_PGSQL=yes # for dynamic LOOKUP_PGSQL_INCLUDE=-I/usr/include/pgsql LOOKUP_PGSQL_LIBS=-lpq # for static LOOKUP_INCLUDE+=-I/usr/include/pgsql LOOKUP_LIBS+=-lpq LOOKUP_SQLITE=yes # for dynamic LOOKUP_SQLITE_LIBS=-lsqlite3 # for static LOOKUP_LIBS+=-lsqlite3 LOOKUP_WHOSON=yes # for dynamic LOOKUP_WHOSON_LIBS=-lwhoson # for static LOOKUP_LIBS+=-lwhoson AUTH_CYRUS_SASL=yes LOOKUP_LIBS+=-lsasl2 LOOKUP_LDAP=yes LDAP_LIB_TYPE=OPENLDAP2 # for dynamic LOOKUP_LDAP_LIBS=-lldap -llber # for static LOOKUP_LIBS+=-lldap -llber EXPERIMENTAL_LMDB=yes LOOKUP_LIBS+=-llmdb DLOPEN_LOCAL_SCAN=yes EOF + >>Local/Makefile-Linux + cat + cp -f src/EDITME Local/Makefile + cp -f exim_monitor/EDITME Local/eximon.conf + RPM_EC=0 + jobs -p + exit 0 Executing(%build): /bin/sh -e /tmp/B.fj1cxj3t/BUILD/tmp/rpm-tmp.c70aSR TMP=/home/users/builder/tmp HOME=/home/users/builder PATH=/home/users/builder/GNUstep/Tools:/bin:/usr/bin:/usr/local/bin:/home/users/builder/bin TMPDIR=/tmp/B.fj1cxj3t/BUILD/tmp + umask 022 + cd /tmp/B.fj1cxj3t/BUILD + cd exim-4.95 + /usr/bin/make -Otarget -j9 -e 'FULLECHO=' /bin/sh scripts/source_checks >>> Creating links to source files... >>> Creating lookups/Makefile for building dynamic modules >>> New Makefile & lookups/Makefile installed >>> Use "make makefile" if you need to force rebuilding of the makefile make[1]: Entering directory '/tmp/B.fj1cxj3t/BUILD/exim-4.95/build-Linux-IntelR_XeonR_CPU___________X5482___3.20GHz' make[1]: warning: -j9 forced in submake: resetting jobserver mode. make[1]: Leaving directory '/tmp/B.fj1cxj3t/BUILD/exim-4.95/build-Linux-IntelR_XeonR_CPU___________X5482___3.20GHz' make[1]: Entering directory '/tmp/B.fj1cxj3t/BUILD/exim-4.95/build-Linux-IntelR_XeonR_CPU___________X5482___3.20GHz' /bin/sh ../scripts/Configure-os.c make[1]: Leaving directory '/tmp/B.fj1cxj3t/BUILD/exim-4.95/build-Linux-IntelR_XeonR_CPU___________X5482___3.20GHz' make[1]: Entering directory '/tmp/B.fj1cxj3t/BUILD/exim-4.95/build-Linux-IntelR_XeonR_CPU___________X5482___3.20GHz' /bin/sh ../scripts/Configure-os.h make[1]: Leaving directory '/tmp/B.fj1cxj3t/BUILD/exim-4.95/build-Linux-IntelR_XeonR_CPU___________X5482___3.20GHz' make[1]: Entering directory '/tmp/B.fj1cxj3t/BUILD/exim-4.95/build-Linux-IntelR_XeonR_CPU___________X5482___3.20GHz' x86_64-pld-linux-gcc exim_lock.c x86_64-pld-linux-gcc -c -D_FILE_OFFSET_BITS=64 -D_LARGEFILE_SOURCE -O2 -fwrapv -pipe -Wformat -Werror=format-security -gdwarf-4 -fno-debug-types-section -fvar-tracking-assignments -g2 -Wp,-D_FORTIFY_SOURCE=2 -fstack-protector-strong --param=ssp-buffer-size=4 -Werror=trampolines -fPIC -march=x86-64 -mtune=generic -gdwarf-4 -fno-debug-types-section -fvar-tracking-assignments -g2 -fvisibility=hidden exim_lock.c x86_64-pld-linux-gcc -o exim_lock x86_64-pld-linux-gcc -o exim_lock exim_lock.o \ -lcrypt -lm -lpam -ldl >>> exim_lock utility built make[1]: Leaving directory '/tmp/B.fj1cxj3t/BUILD/exim-4.95/build-Linux-IntelR_XeonR_CPU___________X5482___3.20GHz' make[1]: Entering directory '/tmp/B.fj1cxj3t/BUILD/exim-4.95/build-Linux-IntelR_XeonR_CPU___________X5482___3.20GHz' x86_64-pld-linux-gcc buildconfig.c x86_64-pld-linux-gcc -D_FILE_OFFSET_BITS=64 -D_LARGEFILE_SOURCE -O2 -fwrapv -pipe -Wformat -Werror=format-security -gdwarf-4 -fno-debug-types-section -fvar-tracking-assignments -g2 -Wp,-D_FORTIFY_SOURCE=2 -fstack-protector-strong --param=ssp-buffer-size=4 -Werror=trampolines -fPIC -march=x86-64 -mtune=generic -gdwarf-4 -fno-debug-types-section -fvar-tracking-assignments -g2 -fvisibility=hidden -o buildconfig buildconfig.c -lcrypt -lm make[1]: Leaving directory '/tmp/B.fj1cxj3t/BUILD/exim-4.95/build-Linux-IntelR_XeonR_CPU___________X5482___3.20GHz' /bin/sh ../scripts/Configure-config.h "/usr/bin/make" make[2]: 'buildconfig' is up to date. Building configuration file config.h >>> config.h built make[1]: Entering directory '/tmp/B.fj1cxj3t/BUILD/exim-4.95/build-Linux-IntelR_XeonR_CPU___________X5482___3.20GHz' x86_64-pld-linux-gcc -DMACRO_PREDEF route.c x86_64-pld-linux-gcc -c -D_FILE_OFFSET_BITS=64 -D_LARGEFILE_SOURCE -O2 -fwrapv -pipe -Wformat -Werror=format-security -gdwarf-4 -fno-debug-types-section -fvar-tracking-assignments -g2 -Wp,-D_FORTIFY_SOURCE=2 -fstack-protector-strong --param=ssp-buffer-size=4 -Werror=trampolines -fPIC -march=x86-64 -mtune=generic -gdwarf-4 -fno-debug-types-section -fvar-tracking-assignments -g2 -fvisibility=hidden -DMACRO_PREDEF -o macro-route.o route.c make[1]: Leaving directory '/tmp/B.fj1cxj3t/BUILD/exim-4.95/build-Linux-IntelR_XeonR_CPU___________X5482___3.20GHz' make[1]: Entering directory '/tmp/B.fj1cxj3t/BUILD/exim-4.95/build-Linux-IntelR_XeonR_CPU___________X5482___3.20GHz' x86_64-pld-linux-gcc -DMACRO_PREDEF drtables.c x86_64-pld-linux-gcc -c -D_FILE_OFFSET_BITS=64 -D_LARGEFILE_SOURCE -O2 -fwrapv -pipe -Wformat -Werror=format-security -gdwarf-4 -fno-debug-types-section -fvar-tracking-assignments -g2 -Wp,-D_FORTIFY_SOURCE=2 -fstack-protector-strong --param=ssp-buffer-size=4 -Werror=trampolines -fPIC -march=x86-64 -mtune=generic -gdwarf-4 -fno-debug-types-section -fvar-tracking-assignments -g2 -fvisibility=hidden -DMACRO_PREDEF -o macro-drtables.o drtables.c make[1]: Leaving directory '/tmp/B.fj1cxj3t/BUILD/exim-4.95/build-Linux-IntelR_XeonR_CPU___________X5482___3.20GHz' make[1]: Entering directory '/tmp/B.fj1cxj3t/BUILD/exim-4.95/build-Linux-IntelR_XeonR_CPU___________X5482___3.20GHz' x86_64-pld-linux-gcc -DMACRO_PREDEF tls.c x86_64-pld-linux-gcc -c -D_FILE_OFFSET_BITS=64 -D_LARGEFILE_SOURCE -O2 -fwrapv -pipe -Wformat -Werror=format-security -gdwarf-4 -fno-debug-types-section -fvar-tracking-assignments -g2 -Wp,-D_FORTIFY_SOURCE=2 -fstack-protector-strong --param=ssp-buffer-size=4 -Werror=trampolines -fPIC -march=x86-64 -mtune=generic -gdwarf-4 -fno-debug-types-section -fvar-tracking-assignments -g2 -fvisibility=hidden -DMACRO_PREDEF -o macro-tls.o tls.c In file included from sha_ver.h:38, from hash.h:14, from exim.h:537, from tls.c:20: tls-openssl.c:235:50: error: missing binary operator before token "1" 235 | # if (OPENSSL_VERSION_NUMBER < 0x30000000fL) && (SSL_OP_NO_TLSv1_1 == 0x00000400L) | ^~~~~~~~~~~~~~~~~ make[1]: *** [Makefile:338: macro-tls.o] Error 1 make[1]: Leaving directory '/tmp/B.fj1cxj3t/BUILD/exim-4.95/build-Linux-IntelR_XeonR_CPU___________X5482___3.20GHz' make[1]: *** Waiting for unfinished jobs.... make[1]: Entering directory '/tmp/B.fj1cxj3t/BUILD/exim-4.95/build-Linux-IntelR_XeonR_CPU___________X5482___3.20GHz' x86_64-pld-linux-gcc -DMACRO_PREDEF globals.c x86_64-pld-linux-gcc -c -D_FILE_OFFSET_BITS=64 -D_LARGEFILE_SOURCE -O2 -fwrapv -pipe -Wformat -Werror=format-security -gdwarf-4 -fno-debug-types-section -fvar-tracking-assignments -g2 -Wp,-D_FORTIFY_SOURCE=2 -fstack-protector-strong --param=ssp-buffer-size=4 -Werror=trampolines -fPIC -march=x86-64 -mtune=generic -gdwarf-4 -fno-debug-types-section -fvar-tracking-assignments -g2 -fvisibility=hidden -DMACRO_PREDEF -o macro-globals.o globals.c make[1]: Leaving directory '/tmp/B.fj1cxj3t/BUILD/exim-4.95/build-Linux-IntelR_XeonR_CPU___________X5482___3.20GHz' make[1]: Entering directory '/tmp/B.fj1cxj3t/BUILD/exim-4.95/build-Linux-IntelR_XeonR_CPU___________X5482___3.20GHz' x86_64-pld-linux-gcc -DMACRO_PREDEF acl.c x86_64-pld-linux-gcc -c -D_FILE_OFFSET_BITS=64 -D_LARGEFILE_SOURCE -O2 -fwrapv -pipe -Wformat -Werror=format-security -gdwarf-4 -fno-debug-types-section -fvar-tracking-assignments -g2 -Wp,-D_FORTIFY_SOURCE=2 -fstack-protector-strong --param=ssp-buffer-size=4 -Werror=trampolines -fPIC -march=x86-64 -mtune=generic -gdwarf-4 -fno-debug-types-section -fvar-tracking-assignments -g2 -fvisibility=hidden -DMACRO_PREDEF -o macro-acl.o acl.c make[1]: Leaving directory '/tmp/B.fj1cxj3t/BUILD/exim-4.95/build-Linux-IntelR_XeonR_CPU___________X5482___3.20GHz' make[1]: Entering directory '/tmp/B.fj1cxj3t/BUILD/exim-4.95/build-Linux-IntelR_XeonR_CPU___________X5482___3.20GHz' x86_64-pld-linux-gcc -DMACRO_PREDEF macro_predef.c x86_64-pld-linux-gcc -c -D_FILE_OFFSET_BITS=64 -D_LARGEFILE_SOURCE -O2 -fwrapv -pipe -Wformat -Werror=format-security -gdwarf-4 -fno-debug-types-section -fvar-tracking-assignments -g2 -Wp,-D_FORTIFY_SOURCE=2 -fstack-protector-strong --param=ssp-buffer-size=4 -Werror=trampolines -fPIC -march=x86-64 -mtune=generic -gdwarf-4 -fno-debug-types-section -fvar-tracking-assignments -g2 -fvisibility=hidden -DMACRO_PREDEF -o macro_predef.o macro_predef.c make[1]: Leaving directory '/tmp/B.fj1cxj3t/BUILD/exim-4.95/build-Linux-IntelR_XeonR_CPU___________X5482___3.20GHz' make[1]: Entering directory '/tmp/B.fj1cxj3t/BUILD/exim-4.95/build-Linux-IntelR_XeonR_CPU___________X5482___3.20GHz' x86_64-pld-linux-gcc -DMACRO_PREDEF transport.c x86_64-pld-linux-gcc -c -D_FILE_OFFSET_BITS=64 -D_LARGEFILE_SOURCE -O2 -fwrapv -pipe -Wformat -Werror=format-security -gdwarf-4 -fno-debug-types-section -fvar-tracking-assignments -g2 -Wp,-D_FORTIFY_SOURCE=2 -fstack-protector-strong --param=ssp-buffer-size=4 -Werror=trampolines -fPIC -march=x86-64 -mtune=generic -gdwarf-4 -fno-debug-types-section -fvar-tracking-assignments -g2 -fvisibility=hidden -DMACRO_PREDEF -o macro-transport.o transport.c make[1]: Leaving directory '/tmp/B.fj1cxj3t/BUILD/exim-4.95/build-Linux-IntelR_XeonR_CPU___________X5482___3.20GHz' make[1]: Entering directory '/tmp/B.fj1cxj3t/BUILD/exim-4.95/build-Linux-IntelR_XeonR_CPU___________X5482___3.20GHz' x86_64-pld-linux-gcc -DMACRO_PREDEF readconf.c x86_64-pld-linux-gcc -c -D_FILE_OFFSET_BITS=64 -D_LARGEFILE_SOURCE -O2 -fwrapv -pipe -Wformat -Werror=format-security -gdwarf-4 -fno-debug-types-section -fvar-tracking-assignments -g2 -Wp,-D_FORTIFY_SOURCE=2 -fstack-protector-strong --param=ssp-buffer-size=4 -Werror=trampolines -fPIC -march=x86-64 -mtune=generic -gdwarf-4 -fno-debug-types-section -fvar-tracking-assignments -g2 -fvisibility=hidden -DMACRO_PREDEF -o macro-readconf.o readconf.c make[1]: Leaving directory '/tmp/B.fj1cxj3t/BUILD/exim-4.95/build-Linux-IntelR_XeonR_CPU___________X5482___3.20GHz' make[1]: Entering directory '/tmp/B.fj1cxj3t/BUILD/exim-4.95/build-Linux-IntelR_XeonR_CPU___________X5482___3.20GHz' x86_64-pld-linux-gcc -DMACRO_PREDEF transports/appendfile.c x86_64-pld-linux-gcc -c -D_FILE_OFFSET_BITS=64 -D_LARGEFILE_SOURCE -O2 -fwrapv -pipe -Wformat -Werror=format-security -gdwarf-4 -fno-debug-types-section -fvar-tracking-assignments -g2 -Wp,-D_FORTIFY_SOURCE=2 -fstack-protector-strong --param=ssp-buffer-size=4 -Werror=trampolines -fPIC -march=x86-64 -mtune=generic -gdwarf-4 -fno-debug-types-section -fvar-tracking-assignments -g2 -fvisibility=hidden -DMACRO_PREDEF -o macro-appendfile.o transports/appendfile.c make[1]: Leaving directory '/tmp/B.fj1cxj3t/BUILD/exim-4.95/build-Linux-IntelR_XeonR_CPU___________X5482___3.20GHz' make: *** [Makefile:35: all] Error 2 error: Bad exit status from /tmp/B.fj1cxj3t/BUILD/tmp/rpm-tmp.c70aSR (%build) RPM build errors: line 111: It's not recommended to have unversioned Obsoletes: Obsoletes: exipick line 112: It's not recommended to have unversioned Obsoletes: Obsoletes: smtpdaemon Could not canonicalize hostname: ymir Bad exit status from /tmp/B.fj1cxj3t/BUILD/tmp/rpm-tmp.c70aSR (%build) ended at: Wed Oct 6 08:22:39 2021, done in 0:00:02.736096 error: No files produced. + chmod -R u+rwX /tmp/B.fj1cxj3t/BUILD + rm -rf /tmp/B.fj1cxj3t/tmp /tmp/B.fj1cxj3t/BUILD + rm -rf /tmp/B.fj1cxj3t Begin-PLD-Builder-Info Build-Time: user:5.35s sys:1.65s real:4.75s (faults io:5 non-io:335264) End-PLD-Builder-Info
[Back to list of logs] [View rpm -qa of builder]