FailedOk

th/SRPMS[OK]
th/x32[OK]
th/i686[OK]
th/x86_64[OK]

ac/SRPMS[OK]
ac/i386[OK]
ac/i586[OK]
ac/i686[OK]
ac/alpha[OK]
ac/amd64[OK]
ac/athlon[OK]
ac/ppc[OK]
ac/sparc[OK]
ac/sparc64[OK]

Advanced Search
main()
Powered by PLD Linux
(c) 2002-2021 PLD Team
$Revision: 1.37 $
Powered by /dev/null.
Your IP: 18.204.2.146

kismet e680bef6-df98-4211-9837-8708ee1fc68f

Status:Failed
Source URL:https://buildlogs.pld-linux.org/pld/th/x86_64/FAIL/kismet,e680bef6-df98-4211-9837-8708ee1fc68f.bz2
text/plain URL:View!
rpm -qa of builder:View!
Date:2021/05/23 13:38:29
Runtime:0:00:21.594554

Toc:

  • prep
  • Executing(%prep): /bin/sh -e /tmp/B.4ei3Jc/BUILD/tmp/rpm-tmp.HaEoju
  • build
  • Executing(%build): /bin/sh -e /tmp/B.4ei3Jc/BUILD/tmp/rpm-tmp.1YtAlL
  • error 1
  • /usr/include/bits/socket.h:285:33: error: flexible array member 'cmsghdr::__cmsg_data' not at end of 'struct<unnamed>'
  • error 2
  • error: Bad exit status from /tmp/B.4ei3Jc/BUILD/tmp/rpm-tmp.1YtAlL (%build)
  • error 3
  • RPM build errors:
  • error 4
  • error: No files produced.

Content:

request from: baggins
checking if we should skip the build
started at: Sun May 23 13:38:06 2021
killing old processes on a builder
sending signal 9 to pid -1
cleaning up /tmp
fetching https://srcbuilder.pld-linux.org/th//srpms/e680bef6-df98-4211-9837-8708ee1fc68f/kismet-2016_07_R1-4.src.rpm
fetched 722822 bytes, 1641.2 K/s
installing srpm: kismet-2016_07_R1-4.src.rpm
+ install -d /tmp/B.4ei3Jc/BUILD /tmp/B.4ei3Jc/RPMS
+ LC_ALL=en_US.UTF-8
+ rpm -qp --changelog kismet-2016_07_R1-4.src.rpm
* Sun May 23 2021 PLD Linux Team <feedback@pld-linux.org>
- For complete changelog see: http://git.pld-linux.org/?p=packages/kismet.git;a=log;h=master
* Sun Oct 06 2019 Jan Rękorajski <baggins@pld-linux.org> 54c9ca4
- release 4 (by relup.sh) * Tue Aug 07 2018 Jan Rękorajski <baggins@pld-linux.org> 37e10c8
- release 3 (by relup.sh) * Sat Jan 21 2017 Jan Rękorajski <baggins@pld-linux.org> d079bec
- release 2 (by relup.sh) * Tue Jan 17 2017 Łukasz Maśko <lmasko@pld-linux.org> 4c554ce
- Up to the latest 2016_07_R1. Compiles on current Th+test+ready. * Thu Jul 09 2015 Jan Rękorajski <baggins@pld-linux.org> 71f9f83
- release 10 (by relup.sh) * Thu Sep 11 2014 Jan Rękorajski <baggins@pld-linux.org> 0bb8c59
- release 9 (by relup.sh) * Sat Jul 26 2014 Jan Rękorajski <baggins@pld-linux.org> 171b10e
- release 8 (by relup.sh) * Fri Jan 24 2014 Jan Rękorajski <baggins@pld-linux.org> 816f828
- release 7 (by relup.sh) * Fri Jan 03 2014 Jan Rękorajski <baggins@pld-linux.org> f0fb96a
- release 6 (by relup.sh) * Sat Nov 30 2013 Jan Rękorajski <baggins@pld-linux.org> 8837464
- release 5 (by relup.sh) * Mon Jun 10 2013 Jan Rękorajski <baggins@pld-linux.org> 05807b3
- release 4 (by relup.sh) * Thu Jun 28 2012 Łukasz Kieś <kiesiu@pld-linux.org> ef8cdce
- rel. 3; rebuild with libpcap-1.3.0 * Fri Apr 20 2012 Elan Ruusamäe <glen@pld-linux.org> 2c4da6e
- release 2 * Wed Apr 04 2012 hawk <hawk@pld-linux.org> 6086de0
- libtinfo is no more - release 1 * Thu Dec 01 2011 lmasko <lmasko@pld-linux.org> d360bfd
- Up to the latest version 2011-03-R2. * Wed Aug 31 2011 Arkadiusz Miśkiewicz <arekm@maven.pl> 67a6a54
- release 3 * Sun Mar 27 2011 Arkadiusz Miśkiewicz <arekm@maven.pl> a3143a1
- release 2 * Fri Jan 14 2011 Elan Ruusamäe <glen@pld-linux.org> f9f9f5f
- release 1 * Thu Jan 13 2011 Elan Ruusamäe <glen@pld-linux.org> 9128618
- server subpackage, add kismet user * Thu Jan 13 2011 Elan Ruusamäe <glen@pld-linux.org> 5396ded
- gps off on drone too + rpm -Uhv --nodeps --define '_topdir /tmp/B.4ei3Jc' --define '_specdir %{_topdir}' --define '_sourcedir %{_specdir}' --define '_rpmdir %{_topdir}/RPMS' --define '_builddir %{_topdir}/BUILD' kismet-2016_07_R1-4.src.rpm Updating / installing... kismet-2016_07_R1-4 ######################################## + rm -f kismet-2016_07_R1-4.src.rpm + install -m 700 -d /tmp/B.4ei3Jc/BUILD/tmp + TMPDIR=/tmp/B.4ei3Jc/BUILD/tmp + exec nice -n 0 rpmbuild -bp --short-circuit --nodeps --define '_topdir /tmp/B.4ei3Jc' --define '_specdir %{_topdir}' --define '_sourcedir %{_specdir}' --define '_rpmdir %{_topdir}/RPMS' --define '_builddir %{_topdir}/BUILD' --target x86_64-pld-linux --define 'prep exit 0' /tmp/B.4ei3Jc/kismet.spec warning: Could not canonicalize hostname: ymir Building target platforms: x86_64-pld-linux Building for target x86_64-pld-linux checking BuildConflict-ing packages no BuildConflicts found checking BR rpm: warning: Could not canonicalize hostname: ymir rpm: Building target platforms: x86_64-pld-linux rpm: Building for target x86_64-pld-linux no BR needed building RPM using: set -ex; : build-id: e680bef6-df98-4211-9837-8708ee1fc68f; TMPDIR=/tmp/B.4ei3Jc/BUILD/tmp exec nice -n 0 rpmbuild -bb --define '_smp_mflags -j9' --define '_make_opts -Otarget' --define '_pld_builder 1' --define '_topdir /tmp/B.4ei3Jc' --define '_specdir %{_topdir}' --define '_sourcedir %{_specdir}' --define '_rpmdir %{_topdir}/RPMS' --define '_builddir %{_topdir}/BUILD' --target x86_64-pld-linux /tmp/B.4ei3Jc/kismet.spec + : build-id: e680bef6-df98-4211-9837-8708ee1fc68f + TMPDIR=/tmp/B.4ei3Jc/BUILD/tmp + exec nice -n 0 rpmbuild -bb --define '_smp_mflags -j9' --define '_make_opts -Otarget' --define '_pld_builder 1' --define '_topdir /tmp/B.4ei3Jc' --define '_specdir %{_topdir}' --define '_sourcedir %{_specdir}' --define '_rpmdir %{_topdir}/RPMS' --define '_builddir %{_topdir}/BUILD' --target x86_64-pld-linux /tmp/B.4ei3Jc/kismet.spec warning: Could not canonicalize hostname: ymir Building target platforms: x86_64-pld-linux Building for target x86_64-pld-linux Executing(%prep): /bin/sh -e /tmp/B.4ei3Jc/BUILD/tmp/rpm-tmp.HaEoju + umask 022 + cd /tmp/B.4ei3Jc/BUILD + cd /tmp/B.4ei3Jc/BUILD + rm -rf kismet-2016-07-R1 + /usr/bin/xz -dc /tmp/B.4ei3Jc/kismet-2016-07-R1.tar.xz + /bin/tar -xof - + STATUS=0 + '[' 0 -ne 0 ']' + cd kismet-2016-07-R1 + /bin/chmod -Rf a+rX,u+w,g-w,o-w . + echo 'Patch #0 (config.patch):' Patch #0 (config.patch): + </tmp/B.4ei3Jc/config.patch + /usr/bin/patch -s -p1 '--fuzz=0' + /bin/sed -i -e 's!\$(prefix)/lib/!/usr/lib64/!g' plugin-alertsyslog/Makefile plugin-btscan/Makefile plugin-spectools/Makefile plugin-syslog/Makefile + /bin/sed -i -e '/install/ s!-m644!-m755!' plugin-alertsyslog/Makefile plugin-btscan/Makefile plugin-spectools/Makefile plugin-syslog/Makefile + mv plugin-alertsyslog/README README.plugin-alertsyslog + mv plugin-btscan/README README.plugin-btscan + mv plugin-spectools/README README.plugin-spectools + mv plugin-syslog/README README.plugin-syslog + RPM_EC=0 + jobs -p + exit 0 Executing(%build): /bin/sh -e /tmp/B.4ei3Jc/BUILD/tmp/rpm-tmp.1YtAlL TMP=/home/users/builder/tmp HOME=/home/users/builder PATH=/home/users/builder/GNUstep/Tools:/bin:/usr/bin:/usr/local/bin:/home/users/builder/bin TMPDIR=/tmp/B.4ei3Jc/BUILD/tmp + umask 022 + cd /tmp/B.4ei3Jc/BUILD + cd kismet-2016-07-R1 + cp -f /usr/share/automake/config.guess /usr/share/automake/config.sub . + aclocal + autoconf configure.ac:174: warning: The macro `AC_CONFIG_HEADER' is obsolete. configure.ac:174: You should run autoupdate. ./lib/autoconf/status.m4:719: AC_CONFIG_HEADER is expanded from... configure.ac:174: the top level configure.ac:229: warning: The macro `AC_HEADER_TIME' is obsolete. configure.ac:229: You should run autoupdate. ./lib/autoconf/headers.m4:743: AC_HEADER_TIME is expanded from... configure.ac:229: the top level configure.ac:233: warning: The macro `AC_HEADER_STDC' is obsolete. configure.ac:233: You should run autoupdate. ./lib/autoconf/headers.m4:704: AC_HEADER_STDC is expanded from... configure.ac:233: the top level configure.ac:234: warning: The macro `AC_TYPE_SIGNAL' is obsolete. configure.ac:234: You should run autoupdate. ./lib/autoconf/types.m4:776: AC_TYPE_SIGNAL is expanded from... configure.ac:234: the top level configure.ac:510: warning: The macro `AC_TRY_LINK' is obsolete. configure.ac:510: You should run autoupdate. ./lib/autoconf/general.m4:2920: AC_TRY_LINK is expanded from... configure.ac:510: the top level + ./configure 'LDFLAGS=-Wl,--as-needed -Wl,--no-copy-dt-needed-entries -Wl,-z,relro -Wl,-z,combreloc ' 'CFLAGS=-O2 -fwrapv -pipe -Wformat -Werror=format-security -gdwarf-4 -fno-debug-types-section -fvar-tracking-assignments -g2 -Wp,-D_FORTIFY_SOURCE=2 -fstack-protector-strong --param=ssp-buffer-size=4 -Werror=trampolines -fPIC -march=x86-64 -mtune=generic -gdwarf-4 -fno-debug-types-section -fvar-tracking-assignments -g2 ' 'CXXFLAGS=-O2 -fwrapv -pipe -Wformat -Werror=format-security -gdwarf-4 -fno-debug-types-section -fvar-tracking-assignments -g2 -Wp,-D_FORTIFY_SOURCE=2 -fstack-protector-strong --param=ssp-buffer-size=4 -Werror=trampolines -fPIC -march=x86-64 -mtune=generic -gdwarf-4 -fno-debug-types-section -fvar-tracking-assignments -g2 ' 'FFLAGS=-O2 -fwrapv -pipe -Wformat -Werror=format-security -gdwarf-4 -fno-debug-types-section -fvar-tracking-assignments -g2 -Wp,-D_FORTIFY_SOURCE=2 -fstack-protector-strong --param=ssp-buffer-size=4 -Werror=trampolines -fPIC -march=x86-64 -mtune=generic -gdwarf-4 -fno-debug-types-section -fvar-tracking-assignments -g2 ' 'FCFLAGS=-O2 -fwrapv -pipe -Wformat -Werror=format-security -gdwarf-4 -fno-debug-types-section -fvar-tracking-assignments -g2 -Wp,-D_FORTIFY_SOURCE=2 -fstack-protector-strong --param=ssp-buffer-size=4 -Werror=trampolines -fPIC -march=x86-64 -mtune=generic -gdwarf-4 -fno-debug-types-section -fvar-tracking-assignments -g2 ' 'CPPFLAGS=' 'CC=x86_64-pld-linux-gcc' 'CXX=x86_64-pld-linux-g++' '--host=x86_64-pld-linux' '--build=x86_64-pld-linux' '--prefix=/usr' '--exec-prefix=/usr' '--bindir=/usr/bin' '--sbindir=/usr/sbin' '--sysconfdir=/etc' '--datadir=/usr/share' '--includedir=/usr/include' '--libdir=/usr/lib64' '--libexecdir=/usr/libexec' '--localstatedir=/var' '--sharedstatedir=/var/lib' '--mandir=/usr/share/man' '--infodir=/usr/share/info' '--x-libraries=/usr/lib64' checking build system type... x86_64-pld-linux-gnu checking host system type... x86_64-pld-linux-gnu checking for x86_64-pld-linux-gcc... x86_64-pld-linux-gcc checking whether the C compiler works... yes checking for C compiler default output file name... a.out checking for suffix of executables... checking whether we are cross compiling... no checking for suffix of object files... o checking whether the compiler supports GNU C... yes checking whether x86_64-pld-linux-gcc accepts -g... yes checking for x86_64-pld-linux-gcc option to enable C11 features... none needed checking whether the compiler supports GNU C++... yes checking whether x86_64-pld-linux-g++ accepts -g... yes checking for x86_64-pld-linux-g++ option to enable C++11 features... none needed checking for a BSD-compatible install... /usr/bin/install -c checking whether make sets $(MAKE)... yes checking how to run the C preprocessor... x86_64-pld-linux-gcc -E checking for platform-specific compiler flags... none needed checking for stdio.h... yes checking for stdlib.h... yes checking for string.h... yes checking for inttypes.h... yes checking for stdint.h... yes checking for strings.h... yes checking for sys/stat.h... yes checking for sys/types.h... yes checking for unistd.h... yes checking for sys/time.h... yes checking whether byte ordering is bigendian... no checking for errno.h... yes checking for stdlib.h... (cached) yes checking for string.h... (cached) yes checking for sys/socket.h... yes checking for sys/time.h... (cached) yes checking for sys/wait.h... yes checking for unistd.h... (cached) yes checking for sys/types.h... (cached) yes checking for netdb.h... yes checking for getopt.h... yes checking for an ANSI C-conforming const... yes checking whether struct tm is in sys/time.h or time.h... time.h checking for grep that handles long lines and -e... /bin/grep checking for egrep... /bin/grep -E checking return type of signal handlers... void checking whether lstat correctly handles trailing slash... yes checking whether stat accepts an empty string... no checking for gettimeofday... yes checking for memset... yes checking for select... yes checking for socket... yes checking for strcasecmp... yes checking for strftime... yes checking for strstr... yes checking for system-level getopt_long()... yes checking for stdint.h... (cached) yes checking for accept() addrlen type... socklen_t checking for special C compiler options needed for large files... no checking for _FILE_OFFSET_BITS value needed for large files... no checking for dlopen in -ldl... yes checking for the pthreads library -lpthreads... no checking whether pthreads work without any flags... no checking whether pthreads work with -Kthread... no checking whether pthreads work with -kthread... no checking for the pthreads library -llthread... no checking whether pthreads work with -pthread... yes checking for joinable pthread attribute... PTHREAD_CREATE_JOINABLE checking if more special flags are required for pthreads... no checking for PTHREAD_PRIO_INHERIT... yes checking for libm math function in std libs... no checking for pow in -lm... yes checking for main in -luClibc++... no checking for main in -lstdc++... yes checking for group 'root'... yes checking for group 'man'... checking for initscr in -lncurses... yes checking for library containing stdscr... -ltinfo checking for ncurses.h... yes checking for new_panel in -lpanel... yes checking for panel.h... yes checking for setproctitle... no checking for libutil.h... no checking for setproctitle in -lutil... no checking for sys/pstat.h... no checking whether __progname and __progname_full are available... yes checking which argv replacement method to use... writeable checking for linux/wireless.h... yes checking that linux/wireless.h is what we expect... yes checking can we use iw_freq.flags... yes checking for cap_init in -lcap... yes checking for sys/prctl.h... yes checking for sys/capability.h... yes checking for pcre_compile in -lpcre... yes checking for pcre.h... yes checking for pcap_open_live in -lpcap... yes checking for pcap.h... yes checking for pcap_setnonblock in -lpcap... yes checking for pcap_get_selectable_fd in -lpcap... yes checking for PPI support in libpcap... yes configure: WARNING: Using local radiotap headers checking for pkg-config... yes checking for x86_64-pld-linux-pkg-config... no checking for pkg-config... /usr/bin/pkg-config checking pkg-config is at least version 0.9.0... yes checking for libnl-3.0... yes checking for libnl-genl-3.0... yes checking for libnl-2.0... no checking for libnl-1... yes checking For mac80211 support in netlink library... yes configure: creating ./config.status config.status: creating Makefile config.status: creating Makefile.inc config.status: WARNING: 'Makefile.inc.in' seems to ignore the --datarootdir setting config.status: creating scripts/kismet config.status: creating conf/kismet.conf config.status: creating config.h Configuration complete: Compiling for: linux-gnu (x86_64) C++ Library: stdc++ Installing as group: root Man pages owned by: man Installing into: /usr Setuid group: kismet Terminal Control: ncurses Linux WEXT capture : yes OSX/Darwin capture : n/a (only OSX/Darwin) PCRE Regex Filters : yes pcap capture: yes airpcap control: n/a (only Cygwin/Win32) PPI log format: yes LibCapability (enhanced privilege dropping): yes Linux Netlink: yes (mac80211 VAP creation) - libnl-3.0 libnl-genl-3.0 Configuration complete. Run 'make dep' to generate dependencies and 'make' followed by 'make install' to compile and install. *** WARNING *** In some situations, libpcap links to libnl. If Kismet finds a newer libnl, it can cause an immediate segfault when starting Kismet. It is very hard to test at compile time (and run-time changes can cause it to break). If you experience immediate segfaults when trying to start kismet_server, check your libpcap.so with 'ldd' and either install a libpcap which does not link libnl1, or force Kismet to compile with a degraded libnl via ./configure --with-netlink-version=1 + /usr/bin/make -Otarget -j9 Makefile:314: warning: ignoring prerequisites on suffix rule definition Makefile:314: warning: ignoring prerequisites on suffix rule definition Makefile:317: warning: ignoring prerequisites on suffix rule definition Makefile:317: warning: ignoring prerequisites on suffix rule definition Makefile:320: warning: ignoring prerequisites on suffix rule definition Makefile:314: warning: ignoring prerequisites on suffix rule definition Makefile:314: warning: ignoring prerequisites on suffix rule definition Makefile:317: warning: ignoring prerequisites on suffix rule definition Makefile:317: warning: ignoring prerequisites on suffix rule definition Makefile:320: warning: ignoring prerequisites on suffix rule definition Generating dependencies... Makefile:314: warning: ignoring prerequisites on suffix rule definition Makefile:314: warning: ignoring prerequisites on suffix rule definition Makefile:317: warning: ignoring prerequisites on suffix rule definition Makefile:317: warning: ignoring prerequisites on suffix rule definition Makefile:320: warning: ignoring prerequisites on suffix rule definition Makefile:314: warning: ignoring prerequisites on suffix rule definition Makefile:314: warning: ignoring prerequisites on suffix rule definition Makefile:317: warning: ignoring prerequisites on suffix rule definition Makefile:317: warning: ignoring prerequisites on suffix rule definition Makefile:320: warning: ignoring prerequisites on suffix rule definition x86_64-pld-linux-g++ -pthread -I/usr/include/ncurses -I/usr/include/libnl3 -Wall -O2 -fwrapv -pipe -Wformat -Werror=format-security -gdwarf-4 -fno-debug-types-section -fvar-tracking-assignments -g2 -Wp,-D_FORTIFY_SOURCE=2 -fstack-protector-strong --param=ssp-buffer-size=4 -Werror=trampolines -fPIC -march=x86-64 -mtune=generic -gdwarf-4 -fno-debug-types-section -fvar-tracking-assignments -g2 -c cygwin_utils.cc -o cygwin_utils.o x86_64-pld-linux-g++ -pthread -I/usr/include/ncurses -I/usr/include/libnl3 -Wall -O2 -fwrapv -pipe -Wformat -Werror=format-security -gdwarf-4 -fno-debug-types-section -fvar-tracking-assignments -g2 -Wp,-D_FORTIFY_SOURCE=2 -fstack-protector-strong --param=ssp-buffer-size=4 -Werror=trampolines -fPIC -march=x86-64 -mtune=generic -gdwarf-4 -fno-debug-types-section -fvar-tracking-assignments -g2 -c getopt.cc -o getopt.o x86_64-pld-linux-g++ -pthread -I/usr/include/ncurses -I/usr/include/libnl3 -Wall -O2 -fwrapv -pipe -Wformat -Werror=format-security -gdwarf-4 -fno-debug-types-section -fvar-tracking-assignments -g2 -Wp,-D_FORTIFY_SOURCE=2 -fstack-protector-strong --param=ssp-buffer-size=4 -Werror=trampolines -fPIC -march=x86-64 -mtune=generic -gdwarf-4 -fno-debug-types-section -fvar-tracking-assignments -g2 -c ringbuf.cc -o ringbuf.o x86_64-pld-linux-g++ -pthread -I/usr/include/ncurses -I/usr/include/libnl3 -Wall -O2 -fwrapv -pipe -Wformat -Werror=format-security -gdwarf-4 -fno-debug-types-section -fvar-tracking-assignments -g2 -Wp,-D_FORTIFY_SOURCE=2 -fstack-protector-strong --param=ssp-buffer-size=4 -Werror=trampolines -fPIC -march=x86-64 -mtune=generic -gdwarf-4 -fno-debug-types-section -fvar-tracking-assignments -g2 -c ifcontrol.cc -o ifcontrol.o In file included from /usr/include/string.h:519, from ifcontrol.h:25, from ifcontrol.cc:20: In function 'char* strncpy(char*, const char*, size_t)', inlined from 'int Linux_GetDrvInfo(const char*, char*, ethtool_drvinfo*)' at ifcontrol.cc:127:12: /usr/include/bits/string_fortified.h:95:34: warning: 'char* __builtin_strncpy(char*, const char*, long unsigned int)' specified bound 16 equals destination size [-Wstringop-truncation] 95 | return __builtin___strncpy_chk (__dest, __src, __len, | ~~~~~~~~~~~~~~~~~~~~~~~~^~~~~~~~~~~~~~~~~~~~~~ 96 | __glibc_objsize (__dest)); | ~~~~~~~~~~~~~~~~~~~~~~~~~ In function 'char* strncpy(char*, const char*, size_t)', inlined from 'int Ifconfig_Get_Hwaddr(const char*, char*, uint8_t*)' at ifcontrol.cc:184:12: /usr/include/bits/string_fortified.h:95:34: warning: 'char* __builtin_strncpy(char*, const char*, long unsigned int)' specified bound 16 equals destination size [-Wstringop-truncation] 95 | return __builtin___strncpy_chk (__dest, __src, __len, | ~~~~~~~~~~~~~~~~~~~~~~~~^~~~~~~~~~~~~~~~~~~~~~ 96 | __glibc_objsize (__dest)); | ~~~~~~~~~~~~~~~~~~~~~~~~~ In function 'char* strncpy(char*, const char*, size_t)', inlined from 'int Ifconfig_Set_Hwaddr(const char*, char*, uint8_t*)' at ifcontrol.cc:210:12: /usr/include/bits/string_fortified.h:95:34: warning: 'char* __builtin_strncpy(char*, const char*, long unsigned int)' specified bound 16 equals destination size [-Wstringop-truncation] 95 | return __builtin___strncpy_chk (__dest, __src, __len, | ~~~~~~~~~~~~~~~~~~~~~~~~^~~~~~~~~~~~~~~~~~~~~~ 96 | __glibc_objsize (__dest)); | ~~~~~~~~~~~~~~~~~~~~~~~~~ In function 'char* strncpy(char*, const char*, size_t)', inlined from 'int Ifconfig_Set_MTU(const char*, char*, uint16_t)' at ifcontrol.cc:238:12: /usr/include/bits/string_fortified.h:95:34: warning: 'char* __builtin_strncpy(char*, const char*, long unsigned int)' specified bound 16 equals destination size [-Wstringop-truncation] 95 | return __builtin___strncpy_chk (__dest, __src, __len, | ~~~~~~~~~~~~~~~~~~~~~~~~^~~~~~~~~~~~~~~~~~~~~~ 96 | __glibc_objsize (__dest)); | ~~~~~~~~~~~~~~~~~~~~~~~~~ In function 'char* strncpy(char*, const char*, size_t)', inlined from 'int Ifconfig_Set_IP(const char*, char*, const char*)' at ifcontrol.cc:275:12: /usr/include/bits/string_fortified.h:95:34: warning: 'char* __builtin_strncpy(char*, const char*, long unsigned int)' specified bound 16 equals destination size [-Wstringop-truncation] 95 | return __builtin___strncpy_chk (__dest, __src, __len, | ~~~~~~~~~~~~~~~~~~~~~~~~^~~~~~~~~~~~~~~~~~~~~~ 96 | __glibc_objsize (__dest)); | ~~~~~~~~~~~~~~~~~~~~~~~~~ In function 'char* strncpy(char*, const char*, size_t)', inlined from 'int Ifconfig_Set_Netmask(const char*, char*, const char*)' at ifcontrol.cc:314:12: /usr/include/bits/string_fortified.h:95:34: warning: 'char* __builtin_strncpy(char*, const char*, long unsigned int)' specified bound 16 equals destination size [-Wstringop-truncation] 95 | return __builtin___strncpy_chk (__dest, __src, __len, | ~~~~~~~~~~~~~~~~~~~~~~~~^~~~~~~~~~~~~~~~~~~~~~ 96 | __glibc_objsize (__dest)); | ~~~~~~~~~~~~~~~~~~~~~~~~~ x86_64-pld-linux-g++ -pthread -I/usr/include/ncurses -I/usr/include/libnl3 -Wall -O2 -fwrapv -pipe -Wformat -Werror=format-security -gdwarf-4 -fno-debug-types-section -fvar-tracking-assignments -g2 -Wp,-D_FORTIFY_SOURCE=2 -fstack-protector-strong --param=ssp-buffer-size=4 -Werror=trampolines -fPIC -march=x86-64 -mtune=generic -gdwarf-4 -fno-debug-types-section -fvar-tracking-assignments -g2 -c messagebus.cc -o messagebus.o x86_64-pld-linux-g++ -pthread -I/usr/include/ncurses -I/usr/include/libnl3 -Wall -O2 -fwrapv -pipe -Wformat -Werror=format-security -gdwarf-4 -fno-debug-types-section -fvar-tracking-assignments -g2 -Wp,-D_FORTIFY_SOURCE=2 -fstack-protector-strong --param=ssp-buffer-size=4 -Werror=trampolines -fPIC -march=x86-64 -mtune=generic -gdwarf-4 -fno-debug-types-section -fvar-tracking-assignments -g2 -c madwifing_control.cc -o madwifing_control.o In file included from /usr/include/string.h:519, from madwifing_control.cc:33: In function 'char* strncpy(char*, const char*, size_t)', inlined from 'int madwifing_destroy_vap(const char*, char*)' at madwifing_control.cc:111:9: /usr/include/bits/string_fortified.h:95:34: warning: 'char* __builtin_strncpy(char*, const char*, long unsigned int)' specified bound 16 equals destination size [-Wstringop-truncation] 95 | return __builtin___strncpy_chk (__dest, __src, __len, | ~~~~~~~~~~~~~~~~~~~~~~~~^~~~~~~~~~~~~~~~~~~~~~ 96 | __glibc_objsize (__dest)); | ~~~~~~~~~~~~~~~~~~~~~~~~~ In function 'char* strncpy(char*, const char*, size_t)', inlined from 'int madwifing_build_vap(const char*, char*, const char*, char*, int, int)' at madwifing_control.cc:158:9: /usr/include/bits/string_fortified.h:95:34: warning: 'char* __builtin_strncpy(char*, const char*, long unsigned int)' specified bound 16 equals destination size [-Wstringop-truncation] 95 | return __builtin___strncpy_chk (__dest, __src, __len, | ~~~~~~~~~~~~~~~~~~~~~~~~^~~~~~~~~~~~~~~~~~~~~~ 96 | __glibc_objsize (__dest)); | ~~~~~~~~~~~~~~~~~~~~~~~~~ x86_64-pld-linux-g++ -pthread -I/usr/include/ncurses -I/usr/include/libnl3 -Wall -O2 -fwrapv -pipe -Wformat -Werror=format-security -gdwarf-4 -fno-debug-types-section -fvar-tracking-assignments -g2 -Wp,-D_FORTIFY_SOURCE=2 -fstack-protector-strong --param=ssp-buffer-size=4 -Werror=trampolines -fPIC -march=x86-64 -mtune=generic -gdwarf-4 -fno-debug-types-section -fvar-tracking-assignments -g2 -c iwcontrol.cc -o iwcontrol.o In file included from /usr/include/string.h:519, from iwcontrol.h:25, from iwcontrol.cc:20: In function 'char* strncpy(char*, const char*, size_t)', inlined from 'int Iwconfig_Set_SSID(const char*, char*, const char*)' at iwcontrol.cc:118:12: /usr/include/bits/string_fortified.h:95:34: warning: 'char* __builtin_strncpy(char*, const char*, long unsigned int)' specified bound 16 equals destination size [-Wstringop-truncation] 95 | return __builtin___strncpy_chk (__dest, __src, __len, | ~~~~~~~~~~~~~~~~~~~~~~~~^~~~~~~~~~~~~~~~~~~~~~ 96 | __glibc_objsize (__dest)); | ~~~~~~~~~~~~~~~~~~~~~~~~~ In function 'char* strncpy(char*, const char*, size_t)', inlined from 'int Iwconfig_Get_SSID(const char*, char*, char*)' at iwcontrol.cc:145:12: /usr/include/bits/string_fortified.h:95:34: warning: 'char* __builtin_strncpy(char*, const char*, long unsigned int)' specified bound 16 equals destination size [-Wstringop-truncation] 95 | return __builtin___strncpy_chk (__dest, __src, __len, | ~~~~~~~~~~~~~~~~~~~~~~~~^~~~~~~~~~~~~~~~~~~~~~ 96 | __glibc_objsize (__dest)); | ~~~~~~~~~~~~~~~~~~~~~~~~~ In function 'char* strncpy(char*, const char*, size_t)', inlined from 'int Iwconfig_Get_Name(const char*, char*, char*)' at iwcontrol.cc:174:12: /usr/include/bits/string_fortified.h:95:34: warning: 'char* __builtin_strncpy(char*, const char*, long unsigned int)' specified bound 16 equals destination size [-Wstringop-truncation] 95 | return __builtin___strncpy_chk (__dest, __src, __len, | ~~~~~~~~~~~~~~~~~~~~~~~~^~~~~~~~~~~~~~~~~~~~~~ 96 | __glibc_objsize (__dest)); | ~~~~~~~~~~~~~~~~~~~~~~~~~ In function 'char* strncpy(char*, const char*, size_t)', inlined from 'int Iwconfig_Set_IntPriv(const char*, const char*, int, int, char*)' at iwcontrol.cc:212:12: /usr/include/bits/string_fortified.h:95:34: warning: 'char* __builtin_strncpy(char*, const char*, long unsigned int)' specified bound 16 equals destination size [-Wstringop-truncation] 95 | return __builtin___strncpy_chk (__dest, __src, __len, | ~~~~~~~~~~~~~~~~~~~~~~~~^~~~~~~~~~~~~~~~~~~~~~ 96 | __glibc_objsize (__dest)); | ~~~~~~~~~~~~~~~~~~~~~~~~~ In function 'char* strncpy(char*, const char*, size_t)', inlined from 'int Iwconfig_Set_IntPriv(const char*, const char*, int, int, char*)' at iwcontrol.cc:282:12: /usr/include/bits/string_fortified.h:95:34: warning: 'char* __builtin_strncpy(char*, const char*, long unsigned int)' specified bound 16 equals destination size [-Wstringop-truncation] 95 | return __builtin___strncpy_chk (__dest, __src, __len, | ~~~~~~~~~~~~~~~~~~~~~~~~^~~~~~~~~~~~~~~~~~~~~~ 96 | __glibc_objsize (__dest)); | ~~~~~~~~~~~~~~~~~~~~~~~~~ In function 'char* strncpy(char*, const char*, size_t)', inlined from 'int Iwconfig_Get_IntPriv(const char*, const char*, int*, char*)' at iwcontrol.cc:334:12: /usr/include/bits/string_fortified.h:95:34: warning: 'char* __builtin_strncpy(char*, const char*, long unsigned int)' specified bound 16 equals destination size [-Wstringop-truncation] 95 | return __builtin___strncpy_chk (__dest, __src, __len, | ~~~~~~~~~~~~~~~~~~~~~~~~^~~~~~~~~~~~~~~~~~~~~~ 96 | __glibc_objsize (__dest)); | ~~~~~~~~~~~~~~~~~~~~~~~~~ In function 'char* strncpy(char*, const char*, size_t)', inlined from 'int Iwconfig_Get_IntPriv(const char*, const char*, int*, char*)' at iwcontrol.cc:404:12: /usr/include/bits/string_fortified.h:95:34: warning: 'char* __builtin_strncpy(char*, const char*, long unsigned int)' specified bound 16 equals destination size [-Wstringop-truncation] 95 | return __builtin___strncpy_chk (__dest, __src, __len, | ~~~~~~~~~~~~~~~~~~~~~~~~^~~~~~~~~~~~~~~~~~~~~~ 96 | __glibc_objsize (__dest)); | ~~~~~~~~~~~~~~~~~~~~~~~~~ In function 'char* strncpy(char*, const char*, size_t)', inlined from 'int Iwconfig_Get_Levels(const char*, char*, int*, int*)' at iwcontrol.cc:461:12: /usr/include/bits/string_fortified.h:95:34: warning: 'char* __builtin_strncpy(char*, const char*, long unsigned int)' specified bound 16 equals destination size [-Wstringop-truncation] 95 | return __builtin___strncpy_chk (__dest, __src, __len, | ~~~~~~~~~~~~~~~~~~~~~~~~^~~~~~~~~~~~~~~~~~~~~~ 96 | __glibc_objsize (__dest)); | ~~~~~~~~~~~~~~~~~~~~~~~~~ In function 'char* strncpy(char*, const char*, size_t)', inlined from 'int Iwconfig_Get_Levels(const char*, char*, int*, int*)' at iwcontrol.cc:476:12: /usr/include/bits/string_fortified.h:95:34: warning: 'char* __builtin_strncpy(char*, const char*, long unsigned int)' specified bound 16 equals destination size [-Wstringop-truncation] 95 | return __builtin___strncpy_chk (__dest, __src, __len, | ~~~~~~~~~~~~~~~~~~~~~~~~^~~~~~~~~~~~~~~~~~~~~~ 96 | __glibc_objsize (__dest)); | ~~~~~~~~~~~~~~~~~~~~~~~~~ In function 'char* strncpy(char*, const char*, size_t)', inlined from 'int Iwconfig_Get_Channel(const char*, char*)' at iwcontrol.cc:512:12: /usr/include/bits/string_fortified.h:95:34: warning: 'char* __builtin_strncpy(char*, const char*, long unsigned int)' specified bound 16 equals destination size [-Wstringop-truncation] 95 | return __builtin___strncpy_chk (__dest, __src, __len, | ~~~~~~~~~~~~~~~~~~~~~~~~^~~~~~~~~~~~~~~~~~~~~~ 96 | __glibc_objsize (__dest)); | ~~~~~~~~~~~~~~~~~~~~~~~~~ In function 'char* strncpy(char*, const char*, size_t)', inlined from 'int Iwconfig_Set_Channel(const char*, int, char*)' at iwcontrol.cc:538:12: /usr/include/bits/string_fortified.h:95:34: warning: 'char* __builtin_strncpy(char*, const char*, long unsigned int)' specified bound 16 equals destination size [-Wstringop-truncation] 95 | return __builtin___strncpy_chk (__dest, __src, __len, | ~~~~~~~~~~~~~~~~~~~~~~~~^~~~~~~~~~~~~~~~~~~~~~ 96 | __glibc_objsize (__dest)); | ~~~~~~~~~~~~~~~~~~~~~~~~~ In function 'char* strncpy(char*, const char*, size_t)', inlined from 'int Iwconfig_Get_Mode(const char*, char*, int*)' at iwcontrol.cc:582:12: /usr/include/bits/string_fortified.h:95:34: warning: 'char* __builtin_strncpy(char*, const char*, long unsigned int)' specified bound 16 equals destination size [-Wstringop-truncation] 95 | return __builtin___strncpy_chk (__dest, __src, __len, | ~~~~~~~~~~~~~~~~~~~~~~~~^~~~~~~~~~~~~~~~~~~~~~ 96 | __glibc_objsize (__dest)); | ~~~~~~~~~~~~~~~~~~~~~~~~~ In function 'char* strncpy(char*, const char*, size_t)', inlined from 'int Iwconfig_Set_Mode(const char*, char*, int)' at iwcontrol.cc:608:12: /usr/include/bits/string_fortified.h:95:34: warning: 'char* __builtin_strncpy(char*, const char*, long unsigned int)' specified bound 16 equals destination size [-Wstringop-truncation] 95 | return __builtin___strncpy_chk (__dest, __src, __len, | ~~~~~~~~~~~~~~~~~~~~~~~~^~~~~~~~~~~~~~~~~~~~~~ 96 | __glibc_objsize (__dest)); | ~~~~~~~~~~~~~~~~~~~~~~~~~ In function 'char* strncpy(char*, const char*, size_t)', inlined from 'int Iwconfig_Get_Chanlist(const char*, char*, std::vector<unsigned int>*)' at iwcontrol.cc:705:9: /usr/include/bits/string_fortified.h:95:34: warning: 'char* __builtin_strncpy(char*, const char*, long unsigned int)' specified bound 16 equals destination size [-Wstringop-truncation] 95 | return __builtin___strncpy_chk (__dest, __src, __len, | ~~~~~~~~~~~~~~~~~~~~~~~~^~~~~~~~~~~~~~~~~~~~~~ 96 | __glibc_objsize (__dest)); | ~~~~~~~~~~~~~~~~~~~~~~~~~ x86_64-pld-linux-g++ -pthread -I/usr/include/ncurses -I/usr/include/libnl3 -Wall -O2 -fwrapv -pipe -Wformat -Werror=format-security -gdwarf-4 -fno-debug-types-section -fvar-tracking-assignments -g2 -Wp,-D_FORTIFY_SOURCE=2 -fstack-protector-strong --param=ssp-buffer-size=4 -Werror=trampolines -fPIC -march=x86-64 -mtune=generic -gdwarf-4 -fno-debug-types-section -fvar-tracking-assignments -g2 -c psutils.cc -o psutils.o x86_64-pld-linux-g++ -pthread -I/usr/include/ncurses -I/usr/include/libnl3 -Wall -O2 -fwrapv -pipe -Wformat -Werror=format-security -gdwarf-4 -fno-debug-types-section -fvar-tracking-assignments -g2 -Wp,-D_FORTIFY_SOURCE=2 -fstack-protector-strong --param=ssp-buffer-size=4 -Werror=trampolines -fPIC -march=x86-64 -mtune=generic -gdwarf-4 -fno-debug-types-section -fvar-tracking-assignments -g2 -c nl80211_control.cc -o nl80211_control.o x86_64-pld-linux-g++ -pthread -I/usr/include/ncurses -I/usr/include/libnl3 -Wall -O2 -fwrapv -pipe -Wformat -Werror=format-security -gdwarf-4 -fno-debug-types-section -fvar-tracking-assignments -g2 -Wp,-D_FORTIFY_SOURCE=2 -fstack-protector-strong --param=ssp-buffer-size=4 -Werror=trampolines -fPIC -march=x86-64 -mtune=generic -gdwarf-4 -fno-debug-types-section -fvar-tracking-assignments -g2 -c battery.cc -o battery.o x86_64-pld-linux-g++ -pthread -I/usr/include/ncurses -I/usr/include/libnl3 -Wall -O2 -fwrapv -pipe -Wformat -Werror=format-security -gdwarf-4 -fno-debug-types-section -fvar-tracking-assignments -g2 -Wp,-D_FORTIFY_SOURCE=2 -fstack-protector-strong --param=ssp-buffer-size=4 -Werror=trampolines -fPIC -march=x86-64 -mtune=generic -gdwarf-4 -fno-debug-types-section -fvar-tracking-assignments -g2 -c ipc_remote.cc -o ipc_remote.o In file included from /usr/include/sys/socket.h:33, from ipc_remote.h:61, from ipc_remote.cc:34: /usr/include/bits/socket.h:285:33: error: flexible array member 'cmsghdr::__cmsg_data' not at end of 'struct<unnamed>' 285 | __extension__ unsigned char __cmsg_data __flexarr; /* Ancillary data. */ | ^~~~~~~~~~~ ipc_remote.cc:945:17: note: next member 'int <unnamed struct>::fd' declared here 945 | int fd; | ^~ ipc_remote.cc:943:16: note: in the definition of 'struct<unnamed>' 943 | typedef struct { | ^ make: *** [Makefile:317: ipc_remote.o] Error 1 make: *** Waiting for unfinished jobs.... x86_64-pld-linux-g++ -pthread -I/usr/include/ncurses -I/usr/include/libnl3 -Wall -O2 -fwrapv -pipe -Wformat -Werror=format-security -gdwarf-4 -fno-debug-types-section -fvar-tracking-assignments -g2 -Wp,-D_FORTIFY_SOURCE=2 -fstack-protector-strong --param=ssp-buffer-size=4 -Werror=trampolines -fPIC -march=x86-64 -mtune=generic -gdwarf-4 -fno-debug-types-section -fvar-tracking-assignments -g2 -c globalregistry.cc -o globalregistry.o x86_64-pld-linux-g++ -pthread -I/usr/include/ncurses -I/usr/include/libnl3 -Wall -O2 -fwrapv -pipe -Wformat -Werror=format-security -gdwarf-4 -fno-debug-types-section -fvar-tracking-assignments -g2 -Wp,-D_FORTIFY_SOURCE=2 -fstack-protector-strong --param=ssp-buffer-size=4 -Werror=trampolines -fPIC -march=x86-64 -mtune=generic -gdwarf-4 -fno-debug-types-section -fvar-tracking-assignments -g2 -c util.cc -o util.o In file included from /usr/include/string.h:519, from util.cc:28: In function 'char* strncpy(char*, const char*, size_t)', inlined from 'void init_proc_title(int, char**, char**)' at util.cc:781:12: /usr/include/bits/string_fortified.h:95:34: warning: 'char* __builtin_strncpy(char*, const char*, long unsigned int)' specified bound depends on the length of the source argument [-Wstringop-overflow=] 95 | return __builtin___strncpy_chk (__dest, __src, __len, | ~~~~~~~~~~~~~~~~~~~~~~~~^~~~~~~~~~~~~~~~~~~~~~ 96 | __glibc_objsize (__dest)); | ~~~~~~~~~~~~~~~~~~~~~~~~~ util.cc: In function 'void init_proc_title(int, char**, char**)': util.cc:781:40: note: length computed here 781 | strncpy(environ[i], envp[i], strlen(envp[i]) + 1); | ~~~~~~^~~~~~~~~ x86_64-pld-linux-g++ -pthread -I/usr/include/ncurses -I/usr/include/libnl3 -Wall -O2 -fwrapv -pipe -Wformat -Werror=format-security -gdwarf-4 -fno-debug-types-section -fvar-tracking-assignments -g2 -Wp,-D_FORTIFY_SOURCE=2 -fstack-protector-strong --param=ssp-buffer-size=4 -Werror=trampolines -fPIC -march=x86-64 -mtune=generic -gdwarf-4 -fno-debug-types-section -fvar-tracking-assignments -g2 -c configfile.cc -o configfile.o x86_64-pld-linux-g++ -pthread -I/usr/include/ncurses -I/usr/include/libnl3 -Wall -O2 -fwrapv -pipe -Wformat -Werror=format-security -gdwarf-4 -fno-debug-types-section -fvar-tracking-assignments -g2 -Wp,-D_FORTIFY_SOURCE=2 -fstack-protector-strong --param=ssp-buffer-size=4 -Werror=trampolines -fPIC -march=x86-64 -mtune=generic -gdwarf-4 -fno-debug-types-section -fvar-tracking-assignments -g2 -c soundcontrol.cc -o soundcontrol.o x86_64-pld-linux-g++ -pthread -I/usr/include/ncurses -I/usr/include/libnl3 -Wall -O2 -fwrapv -pipe -Wformat -Werror=format-security -gdwarf-4 -fno-debug-types-section -fvar-tracking-assignments -g2 -Wp,-D_FORTIFY_SOURCE=2 -fstack-protector-strong --param=ssp-buffer-size=4 -Werror=trampolines -fPIC -march=x86-64 -mtune=generic -gdwarf-4 -fno-debug-types-section -fvar-tracking-assignments -g2 -c clinetframework.cc -o clinetframework.o clinetframework.cc: In member function 'virtual int NetworkClient::Poll(fd_set&, fd_set&)': clinetframework.cc:144:9: warning: this 'if' clause does not guard... [-Wmisleading-indentation] 144 | if ((ret = WriteBytes()) < 0) | ^~ clinetframework.cc:146:13: note: ...this statement, but the latter is misleadingly indented as if it were guarded by the 'if' 146 | return ret; | ^~~~~~ clinetframework.cc: In member function 'virtual void NetworkClient::KillConnection()': clinetframework.cc:211:5: warning: this 'if' clause does not guard... [-Wmisleading-indentation] 211 | if (cli_fd >= 0) | ^~ clinetframework.cc:214:2: note: ...this statement, but the latter is misleadingly indented as if it were guarded by the 'if' 214 | cli_fd = -1; | ^~~~~~ x86_64-pld-linux-g++ -pthread -I/usr/include/ncurses -I/usr/include/libnl3 -Wall -O2 -fwrapv -pipe -Wformat -Werror=format-security -gdwarf-4 -fno-debug-types-section -fvar-tracking-assignments -g2 -Wp,-D_FORTIFY_SOURCE=2 -fstack-protector-strong --param=ssp-buffer-size=4 -Werror=trampolines -fPIC -march=x86-64 -mtune=generic -gdwarf-4 -fno-debug-types-section -fvar-tracking-assignments -g2 -c netframework.cc -o netframework.o x86_64-pld-linux-g++ -pthread -I/usr/include/ncurses -I/usr/include/libnl3 -Wall -O2 -fwrapv -pipe -Wformat -Werror=format-security -gdwarf-4 -fno-debug-types-section -fvar-tracking-assignments -g2 -Wp,-D_FORTIFY_SOURCE=2 -fstack-protector-strong --param=ssp-buffer-size=4 -Werror=trampolines -fPIC -march=x86-64 -mtune=generic -gdwarf-4 -fno-debug-types-section -fvar-tracking-assignments -g2 -c kismet_json.cc -o kismet_json.o x86_64-pld-linux-g++ -pthread -I/usr/include/ncurses -I/usr/include/libnl3 -Wall -O2 -fwrapv -pipe -Wformat -Werror=format-security -gdwarf-4 -fno-debug-types-section -fvar-tracking-assignments -g2 -Wp,-D_FORTIFY_SOURCE=2 -fstack-protector-strong --param=ssp-buffer-size=4 -Werror=trampolines -fPIC -march=x86-64 -mtune=generic -gdwarf-4 -fno-debug-types-section -fvar-tracking-assignments -g2 -c filtercore.cc -o filtercore.o error: Bad exit status from /tmp/B.4ei3Jc/BUILD/tmp/rpm-tmp.1YtAlL (%build) RPM build errors: Could not canonicalize hostname: ymir Bad exit status from /tmp/B.4ei3Jc/BUILD/tmp/rpm-tmp.1YtAlL (%build) ended at: Sun May 23 13:38:29 2021, done in 0:00:21.594554 error: No files produced. + chmod -R u+rwX /tmp/B.4ei3Jc/BUILD + rm -rf /tmp/B.4ei3Jc/tmp /tmp/B.4ei3Jc/BUILD + rm -rf /tmp/B.4ei3Jc Begin-PLD-Builder-Info Build-Time: user:41.12s sys:6.93s real:23.53s (faults io:2 non-io:1351503) End-PLD-Builder-Info
[Back to list of logs] [View rpm -qa of builder]