FailedOk

th/SRPMS[OK]
th/x32[OK]
th/i686[OK]
th/x86_64[OK]

ac/SRPMS[OK]
ac/i386[OK]
ac/i586[OK]
ac/i686[OK]
ac/alpha[OK]
ac/amd64[OK]
ac/athlon[OK]
ac/ppc[OK]
ac/sparc[OK]
ac/sparc64[OK]

Advanced Search
main()
Powered by PLD Linux
(c) 2002-2022 PLD Team
$Revision: 1.37 $
Powered by nasi tu byli.
Your IP: 44.197.108.169

ldc 379a1e60-dc45-489e-8d3b-3163d8a3b5cd

Status:Failed
Source URL:https://buildlogs.pld-linux.org/pld/th/x86_64/FAIL/ldc,379a1e60-dc45-489e-8d3b-3163d8a3b5cd.bz2
text/plain URL:View!
full text:View!
rpm -qa of builder:View!
Date:2022/10/29 09:44:30
Runtime:0:04:25.673514

Toc:

  • error 1
  • /tmp/B.eu7gwbpr/BUILD/ldc-1.29.0-src/gen/naked.cpp:474:25: error: 'Verify' is not a member of 'llvm::InlineAsm'
  • error 2
  • gmake[2]: *** [CMakeFiles/LDCShared.dir/build.make:681: CMakeFiles/LDCShared.dir/gen/naked.cpp.o] Error 1
  • error 3
  • gmake[1]: *** [CMakeFiles/Makefile2:203: CMakeFiles/LDCShared.dir/all] Error 2
  • error 4
  • error: Bad exit status from /tmp/B.eu7gwbpr/BUILD/tmp/rpm-tmp.FKoiBi (%build)
  • error 5
  • RPM build errors:
  • error 6
  • error: No files produced.

Content:

 3869 |             insnTemplate << reinterpret_cast<const d_uns32 &>(value);
      |                                                               ^~~~~
/tmp/B.eu7gwbpr/BUILD/ldc-1.29.0-src/gen/asm-x86.h:3872:63: warning: dereferencing type-punned pointer will break strict-aliasing rules [-Wstrict-aliasing]
 3872 |             insnTemplate << reinterpret_cast<const d_uns64 &>(value);
      |                                                               ^~~~~
[  6%] Building CXX object CMakeFiles/LDCShared.dir/gen/attributes.cpp.o
/usr/bin/x86_64-pld-linux-g++ -DLDC_ENABLE_PLUGINS -DLDC_LLVM_SUPPORTED_TARGET_AArch64=1 -DLDC_LLVM_SUPPORTED_TARGET_AMDGPU=1 -DLDC_LLVM_SUPPORTED_TARGET_ARM=1 -DLDC_LLVM_SUPPORTED_TARGET_AVR=1 -DLDC_LLVM_SUPPORTED_TARGET_BPF=1 -DLDC_LLVM_SUPPORTED_TARGET_Hexagon=1 -DLDC_LLVM_SUPPORTED_TARGET_Lanai=1 -DLDC_LLVM_SUPPORTED_TARGET_MSP430=1 -DLDC_LLVM_SUPPORTED_TARGET_Mips=1 -DLDC_LLVM_SUPPORTED_TARGET_NVPTX=1 -DLDC_LLVM_SUPPORTED_TARGET_PowerPC=1 -DLDC_LLVM_SUPPORTED_TARGET_RISCV=1 -DLDC_LLVM_SUPPORTED_TARGET_SPIRV=1 -DLDC_LLVM_SUPPORTED_TARGET_Sparc=1 -DLDC_LLVM_SUPPORTED_TARGET_SystemZ=1 -DLDC_LLVM_SUPPORTED_TARGET_VE=1 -DLDC_LLVM_SUPPORTED_TARGET_WebAssembly=1 -DLDC_LLVM_SUPPORTED_TARGET_X86=1 -DLDC_LLVM_SUPPORTED_TARGET_XCore=1 -I/tmp/B.eu7gwbpr/BUILD/ldc-1.29.0-src/. -I/tmp/B.eu7gwbpr/BUILD/ldc-1.29.0-src/dmd -DDMDV2 -O2 -fwrapv -pipe -Wformat -Werror=format-security -gdwarf-4 -fno-debug-types-section -fvar-tracking-assignments -g2 -Wp,-D_FORTIFY_SOURCE=2 -fstack-protector-strong --param=ssp-buffer-size=4 -Werror=trampolines -fPIC -march=x86-64 -mtune=generic -gdwarf-4 -fno-debug-types-section -fvar-tracking-assignments -g2  -DNDEBUG -DQT_NO_DEBUG -I/usr/include -std=c++14   -fno-exceptions -D_GNU_SOURCE -D__STDC_CONSTANT_MACROS -D__STDC_FORMAT_MACROS -D__STDC_LIMIT_MACROS -fno-rtti  -Wall -Wextra -Wno-unused-parameter -Wno-comment -Wno-missing-field-initializers -Wno-non-virtual-dtor -Wno-pedantic -fvisibility-inlines-hidden -DLDC_POSIX  -DIN_LLVM -DOPAQUE_VTBLS "-DLDC_INSTALL_PREFIX=R\"(/usr)\"" -DLDC_LLVM_VER=1500 "-DLDC_LIBDIR_SUFFIX=R\"(64)\"" -DLDC_HOST_LDMD=1 -DLDC_HOST_FE_VER=2097 "-DLDC_LLVM_LIBDIR=R\"(/usr/lib64)\""  -DNDEBUG -MD -MT CMakeFiles/LDCShared.dir/gen/attributes.cpp.o -MF CMakeFiles/LDCShared.dir/gen/attributes.cpp.o.d -o CMakeFiles/LDCShared.dir/gen/attributes.cpp.o -c /tmp/B.eu7gwbpr/BUILD/ldc-1.29.0-src/gen/attributes.cpp
[  6%] Building CXX object CMakeFiles/LDCShared.dir/gen/binops.cpp.o
/usr/bin/x86_64-pld-linux-g++ -DLDC_ENABLE_PLUGINS -DLDC_LLVM_SUPPORTED_TARGET_AArch64=1 -DLDC_LLVM_SUPPORTED_TARGET_AMDGPU=1 -DLDC_LLVM_SUPPORTED_TARGET_ARM=1 -DLDC_LLVM_SUPPORTED_TARGET_AVR=1 -DLDC_LLVM_SUPPORTED_TARGET_BPF=1 -DLDC_LLVM_SUPPORTED_TARGET_Hexagon=1 -DLDC_LLVM_SUPPORTED_TARGET_Lanai=1 -DLDC_LLVM_SUPPORTED_TARGET_MSP430=1 -DLDC_LLVM_SUPPORTED_TARGET_Mips=1 -DLDC_LLVM_SUPPORTED_TARGET_NVPTX=1 -DLDC_LLVM_SUPPORTED_TARGET_PowerPC=1 -DLDC_LLVM_SUPPORTED_TARGET_RISCV=1 -DLDC_LLVM_SUPPORTED_TARGET_SPIRV=1 -DLDC_LLVM_SUPPORTED_TARGET_Sparc=1 -DLDC_LLVM_SUPPORTED_TARGET_SystemZ=1 -DLDC_LLVM_SUPPORTED_TARGET_VE=1 -DLDC_LLVM_SUPPORTED_TARGET_WebAssembly=1 -DLDC_LLVM_SUPPORTED_TARGET_X86=1 -DLDC_LLVM_SUPPORTED_TARGET_XCore=1 -I/tmp/B.eu7gwbpr/BUILD/ldc-1.29.0-src/. -I/tmp/B.eu7gwbpr/BUILD/ldc-1.29.0-src/dmd -DDMDV2 -O2 -fwrapv -pipe -Wformat -Werror=format-security -gdwarf-4 -fno-debug-types-section -fvar-tracking-assignments -g2 -Wp,-D_FORTIFY_SOURCE=2 -fstack-protector-strong --param=ssp-buffer-size=4 -Werror=trampolines -fPIC -march=x86-64 -mtune=generic -gdwarf-4 -fno-debug-types-section -fvar-tracking-assignments -g2  -DNDEBUG -DQT_NO_DEBUG -I/usr/include -std=c++14   -fno-exceptions -D_GNU_SOURCE -D__STDC_CONSTANT_MACROS -D__STDC_FORMAT_MACROS -D__STDC_LIMIT_MACROS -fno-rtti  -Wall -Wextra -Wno-unused-parameter -Wno-comment -Wno-missing-field-initializers -Wno-non-virtual-dtor -Wno-pedantic -fvisibility-inlines-hidden -DLDC_POSIX  -DIN_LLVM -DOPAQUE_VTBLS "-DLDC_INSTALL_PREFIX=R\"(/usr)\"" -DLDC_LLVM_VER=1500 "-DLDC_LIBDIR_SUFFIX=R\"(64)\"" -DLDC_HOST_LDMD=1 -DLDC_HOST_FE_VER=2097 "-DLDC_LLVM_LIBDIR=R\"(/usr/lib64)\""  -DNDEBUG -MD -MT CMakeFiles/LDCShared.dir/gen/binops.cpp.o -MF CMakeFiles/LDCShared.dir/gen/binops.cpp.o.d -o CMakeFiles/LDCShared.dir/gen/binops.cpp.o -c /tmp/B.eu7gwbpr/BUILD/ldc-1.29.0-src/gen/binops.cpp
[  6%] Building CXX object CMakeFiles/LDCShared.dir/gen/cl_helpers.cpp.o
/usr/bin/x86_64-pld-linux-g++ -DLDC_ENABLE_PLUGINS -DLDC_LLVM_SUPPORTED_TARGET_AArch64=1 -DLDC_LLVM_SUPPORTED_TARGET_AMDGPU=1 -DLDC_LLVM_SUPPORTED_TARGET_ARM=1 -DLDC_LLVM_SUPPORTED_TARGET_AVR=1 -DLDC_LLVM_SUPPORTED_TARGET_BPF=1 -DLDC_LLVM_SUPPORTED_TARGET_Hexagon=1 -DLDC_LLVM_SUPPORTED_TARGET_Lanai=1 -DLDC_LLVM_SUPPORTED_TARGET_MSP430=1 -DLDC_LLVM_SUPPORTED_TARGET_Mips=1 -DLDC_LLVM_SUPPORTED_TARGET_NVPTX=1 -DLDC_LLVM_SUPPORTED_TARGET_PowerPC=1 -DLDC_LLVM_SUPPORTED_TARGET_RISCV=1 -DLDC_LLVM_SUPPORTED_TARGET_SPIRV=1 -DLDC_LLVM_SUPPORTED_TARGET_Sparc=1 -DLDC_LLVM_SUPPORTED_TARGET_SystemZ=1 -DLDC_LLVM_SUPPORTED_TARGET_VE=1 -DLDC_LLVM_SUPPORTED_TARGET_WebAssembly=1 -DLDC_LLVM_SUPPORTED_TARGET_X86=1 -DLDC_LLVM_SUPPORTED_TARGET_XCore=1 -I/tmp/B.eu7gwbpr/BUILD/ldc-1.29.0-src/. -I/tmp/B.eu7gwbpr/BUILD/ldc-1.29.0-src/dmd -DDMDV2 -O2 -fwrapv -pipe -Wformat -Werror=format-security -gdwarf-4 -fno-debug-types-section -fvar-tracking-assignments -g2 -Wp,-D_FORTIFY_SOURCE=2 -fstack-protector-strong --param=ssp-buffer-size=4 -Werror=trampolines -fPIC -march=x86-64 -mtune=generic -gdwarf-4 -fno-debug-types-section -fvar-tracking-assignments -g2  -DNDEBUG -DQT_NO_DEBUG -I/usr/include -std=c++14   -fno-exceptions -D_GNU_SOURCE -D__STDC_CONSTANT_MACROS -D__STDC_FORMAT_MACROS -D__STDC_LIMIT_MACROS -fno-rtti  -Wall -Wextra -Wno-unused-parameter -Wno-comment -Wno-missing-field-initializers -Wno-non-virtual-dtor -Wno-pedantic -fvisibility-inlines-hidden -DLDC_POSIX  -DIN_LLVM -DOPAQUE_VTBLS "-DLDC_INSTALL_PREFIX=R\"(/usr)\"" -DLDC_LLVM_VER=1500 "-DLDC_LIBDIR_SUFFIX=R\"(64)\"" -DLDC_HOST_LDMD=1 -DLDC_HOST_FE_VER=2097 "-DLDC_LLVM_LIBDIR=R\"(/usr/lib64)\""  -DNDEBUG -MD -MT CMakeFiles/LDCShared.dir/gen/cl_helpers.cpp.o -MF CMakeFiles/LDCShared.dir/gen/cl_helpers.cpp.o.d -o CMakeFiles/LDCShared.dir/gen/cl_helpers.cpp.o -c /tmp/B.eu7gwbpr/BUILD/ldc-1.29.0-src/gen/cl_helpers.cpp
[  6%] Building CXX object CMakeFiles/LDCShared.dir/gen/classes.cpp.o
/usr/bin/x86_64-pld-linux-g++ -DLDC_ENABLE_PLUGINS -DLDC_LLVM_SUPPORTED_TARGET_AArch64=1 -DLDC_LLVM_SUPPORTED_TARGET_AMDGPU=1 -DLDC_LLVM_SUPPORTED_TARGET_ARM=1 -DLDC_LLVM_SUPPORTED_TARGET_AVR=1 -DLDC_LLVM_SUPPORTED_TARGET_BPF=1 -DLDC_LLVM_SUPPORTED_TARGET_Hexagon=1 -DLDC_LLVM_SUPPORTED_TARGET_Lanai=1 -DLDC_LLVM_SUPPORTED_TARGET_MSP430=1 -DLDC_LLVM_SUPPORTED_TARGET_Mips=1 -DLDC_LLVM_SUPPORTED_TARGET_NVPTX=1 -DLDC_LLVM_SUPPORTED_TARGET_PowerPC=1 -DLDC_LLVM_SUPPORTED_TARGET_RISCV=1 -DLDC_LLVM_SUPPORTED_TARGET_SPIRV=1 -DLDC_LLVM_SUPPORTED_TARGET_Sparc=1 -DLDC_LLVM_SUPPORTED_TARGET_SystemZ=1 -DLDC_LLVM_SUPPORTED_TARGET_VE=1 -DLDC_LLVM_SUPPORTED_TARGET_WebAssembly=1 -DLDC_LLVM_SUPPORTED_TARGET_X86=1 -DLDC_LLVM_SUPPORTED_TARGET_XCore=1 -I/tmp/B.eu7gwbpr/BUILD/ldc-1.29.0-src/. -I/tmp/B.eu7gwbpr/BUILD/ldc-1.29.0-src/dmd -DDMDV2 -O2 -fwrapv -pipe -Wformat -Werror=format-security -gdwarf-4 -fno-debug-types-section -fvar-tracking-assignments -g2 -Wp,-D_FORTIFY_SOURCE=2 -fstack-protector-strong --param=ssp-buffer-size=4 -Werror=trampolines -fPIC -march=x86-64 -mtune=generic -gdwarf-4 -fno-debug-types-section -fvar-tracking-assignments -g2  -DNDEBUG -DQT_NO_DEBUG -I/usr/include -std=c++14   -fno-exceptions -D_GNU_SOURCE -D__STDC_CONSTANT_MACROS -D__STDC_FORMAT_MACROS -D__STDC_LIMIT_MACROS -fno-rtti  -Wall -Wextra -Wno-unused-parameter -Wno-comment -Wno-missing-field-initializers -Wno-non-virtual-dtor -Wno-pedantic -fvisibility-inlines-hidden -DLDC_POSIX  -DIN_LLVM -DOPAQUE_VTBLS "-DLDC_INSTALL_PREFIX=R\"(/usr)\"" -DLDC_LLVM_VER=1500 "-DLDC_LIBDIR_SUFFIX=R\"(64)\"" -DLDC_HOST_LDMD=1 -DLDC_HOST_FE_VER=2097 "-DLDC_LLVM_LIBDIR=R\"(/usr/lib64)\""  -DNDEBUG -MD -MT CMakeFiles/LDCShared.dir/gen/classes.cpp.o -MF CMakeFiles/LDCShared.dir/gen/classes.cpp.o.d -o CMakeFiles/LDCShared.dir/gen/classes.cpp.o -c /tmp/B.eu7gwbpr/BUILD/ldc-1.29.0-src/gen/classes.cpp
[  6%] Building CXX object CMakeFiles/LDCShared.dir/gen/complex.cpp.o
/usr/bin/x86_64-pld-linux-g++ -DLDC_ENABLE_PLUGINS -DLDC_LLVM_SUPPORTED_TARGET_AArch64=1 -DLDC_LLVM_SUPPORTED_TARGET_AMDGPU=1 -DLDC_LLVM_SUPPORTED_TARGET_ARM=1 -DLDC_LLVM_SUPPORTED_TARGET_AVR=1 -DLDC_LLVM_SUPPORTED_TARGET_BPF=1 -DLDC_LLVM_SUPPORTED_TARGET_Hexagon=1 -DLDC_LLVM_SUPPORTED_TARGET_Lanai=1 -DLDC_LLVM_SUPPORTED_TARGET_MSP430=1 -DLDC_LLVM_SUPPORTED_TARGET_Mips=1 -DLDC_LLVM_SUPPORTED_TARGET_NVPTX=1 -DLDC_LLVM_SUPPORTED_TARGET_PowerPC=1 -DLDC_LLVM_SUPPORTED_TARGET_RISCV=1 -DLDC_LLVM_SUPPORTED_TARGET_SPIRV=1 -DLDC_LLVM_SUPPORTED_TARGET_Sparc=1 -DLDC_LLVM_SUPPORTED_TARGET_SystemZ=1 -DLDC_LLVM_SUPPORTED_TARGET_VE=1 -DLDC_LLVM_SUPPORTED_TARGET_WebAssembly=1 -DLDC_LLVM_SUPPORTED_TARGET_X86=1 -DLDC_LLVM_SUPPORTED_TARGET_XCore=1 -I/tmp/B.eu7gwbpr/BUILD/ldc-1.29.0-src/. -I/tmp/B.eu7gwbpr/BUILD/ldc-1.29.0-src/dmd -DDMDV2 -O2 -fwrapv -pipe -Wformat -Werror=format-security -gdwarf-4 -fno-debug-types-section -fvar-tracking-assignments -g2 -Wp,-D_FORTIFY_SOURCE=2 -fstack-protector-strong --param=ssp-buffer-size=4 -Werror=trampolines -fPIC -march=x86-64 -mtune=generic -gdwarf-4 -fno-debug-types-section -fvar-tracking-assignments -g2  -DNDEBUG -DQT_NO_DEBUG -I/usr/include -std=c++14   -fno-exceptions -D_GNU_SOURCE -D__STDC_CONSTANT_MACROS -D__STDC_FORMAT_MACROS -D__STDC_LIMIT_MACROS -fno-rtti  -Wall -Wextra -Wno-unused-parameter -Wno-comment -Wno-missing-field-initializers -Wno-non-virtual-dtor -Wno-pedantic -fvisibility-inlines-hidden -DLDC_POSIX  -DIN_LLVM -DOPAQUE_VTBLS "-DLDC_INSTALL_PREFIX=R\"(/usr)\"" -DLDC_LLVM_VER=1500 "-DLDC_LIBDIR_SUFFIX=R\"(64)\"" -DLDC_HOST_LDMD=1 -DLDC_HOST_FE_VER=2097 "-DLDC_LLVM_LIBDIR=R\"(/usr/lib64)\""  -DNDEBUG -MD -MT CMakeFiles/LDCShared.dir/gen/complex.cpp.o -MF CMakeFiles/LDCShared.dir/gen/complex.cpp.o.d -o CMakeFiles/LDCShared.dir/gen/complex.cpp.o -c /tmp/B.eu7gwbpr/BUILD/ldc-1.29.0-src/gen/complex.cpp
[  6%] Building CXX object CMakeFiles/LDCShared.dir/gen/coverage.cpp.o
/usr/bin/x86_64-pld-linux-g++ -DLDC_ENABLE_PLUGINS -DLDC_LLVM_SUPPORTED_TARGET_AArch64=1 -DLDC_LLVM_SUPPORTED_TARGET_AMDGPU=1 -DLDC_LLVM_SUPPORTED_TARGET_ARM=1 -DLDC_LLVM_SUPPORTED_TARGET_AVR=1 -DLDC_LLVM_SUPPORTED_TARGET_BPF=1 -DLDC_LLVM_SUPPORTED_TARGET_Hexagon=1 -DLDC_LLVM_SUPPORTED_TARGET_Lanai=1 -DLDC_LLVM_SUPPORTED_TARGET_MSP430=1 -DLDC_LLVM_SUPPORTED_TARGET_Mips=1 -DLDC_LLVM_SUPPORTED_TARGET_NVPTX=1 -DLDC_LLVM_SUPPORTED_TARGET_PowerPC=1 -DLDC_LLVM_SUPPORTED_TARGET_RISCV=1 -DLDC_LLVM_SUPPORTED_TARGET_SPIRV=1 -DLDC_LLVM_SUPPORTED_TARGET_Sparc=1 -DLDC_LLVM_SUPPORTED_TARGET_SystemZ=1 -DLDC_LLVM_SUPPORTED_TARGET_VE=1 -DLDC_LLVM_SUPPORTED_TARGET_WebAssembly=1 -DLDC_LLVM_SUPPORTED_TARGET_X86=1 -DLDC_LLVM_SUPPORTED_TARGET_XCore=1 -I/tmp/B.eu7gwbpr/BUILD/ldc-1.29.0-src/. -I/tmp/B.eu7gwbpr/BUILD/ldc-1.29.0-src/dmd -DDMDV2 -O2 -fwrapv -pipe -Wformat -Werror=format-security -gdwarf-4 -fno-debug-types-section -fvar-tracking-assignments -g2 -Wp,-D_FORTIFY_SOURCE=2 -fstack-protector-strong --param=ssp-buffer-size=4 -Werror=trampolines -fPIC -march=x86-64 -mtune=generic -gdwarf-4 -fno-debug-types-section -fvar-tracking-assignments -g2  -DNDEBUG -DQT_NO_DEBUG -I/usr/include -std=c++14   -fno-exceptions -D_GNU_SOURCE -D__STDC_CONSTANT_MACROS -D__STDC_FORMAT_MACROS -D__STDC_LIMIT_MACROS -fno-rtti  -Wall -Wextra -Wno-unused-parameter -Wno-comment -Wno-missing-field-initializers -Wno-non-virtual-dtor -Wno-pedantic -fvisibility-inlines-hidden -DLDC_POSIX  -DIN_LLVM -DOPAQUE_VTBLS "-DLDC_INSTALL_PREFIX=R\"(/usr)\"" -DLDC_LLVM_VER=1500 "-DLDC_LIBDIR_SUFFIX=R\"(64)\"" -DLDC_HOST_LDMD=1 -DLDC_HOST_FE_VER=2097 "-DLDC_LLVM_LIBDIR=R\"(/usr/lib64)\""  -DNDEBUG -MD -MT CMakeFiles/LDCShared.dir/gen/coverage.cpp.o -MF CMakeFiles/LDCShared.dir/gen/coverage.cpp.o.d -o CMakeFiles/LDCShared.dir/gen/coverage.cpp.o -c /tmp/B.eu7gwbpr/BUILD/ldc-1.29.0-src/gen/coverage.cpp
[  6%] Building CXX object CMakeFiles/LDCShared.dir/gen/ctfloat.cpp.o
/usr/bin/x86_64-pld-linux-g++ -DLDC_ENABLE_PLUGINS -DLDC_LLVM_SUPPORTED_TARGET_AArch64=1 -DLDC_LLVM_SUPPORTED_TARGET_AMDGPU=1 -DLDC_LLVM_SUPPORTED_TARGET_ARM=1 -DLDC_LLVM_SUPPORTED_TARGET_AVR=1 -DLDC_LLVM_SUPPORTED_TARGET_BPF=1 -DLDC_LLVM_SUPPORTED_TARGET_Hexagon=1 -DLDC_LLVM_SUPPORTED_TARGET_Lanai=1 -DLDC_LLVM_SUPPORTED_TARGET_MSP430=1 -DLDC_LLVM_SUPPORTED_TARGET_Mips=1 -DLDC_LLVM_SUPPORTED_TARGET_NVPTX=1 -DLDC_LLVM_SUPPORTED_TARGET_PowerPC=1 -DLDC_LLVM_SUPPORTED_TARGET_RISCV=1 -DLDC_LLVM_SUPPORTED_TARGET_SPIRV=1 -DLDC_LLVM_SUPPORTED_TARGET_Sparc=1 -DLDC_LLVM_SUPPORTED_TARGET_SystemZ=1 -DLDC_LLVM_SUPPORTED_TARGET_VE=1 -DLDC_LLVM_SUPPORTED_TARGET_WebAssembly=1 -DLDC_LLVM_SUPPORTED_TARGET_X86=1 -DLDC_LLVM_SUPPORTED_TARGET_XCore=1 -I/tmp/B.eu7gwbpr/BUILD/ldc-1.29.0-src/. -I/tmp/B.eu7gwbpr/BUILD/ldc-1.29.0-src/dmd -DDMDV2 -O2 -fwrapv -pipe -Wformat -Werror=format-security -gdwarf-4 -fno-debug-types-section -fvar-tracking-assignments -g2 -Wp,-D_FORTIFY_SOURCE=2 -fstack-protector-strong --param=ssp-buffer-size=4 -Werror=trampolines -fPIC -march=x86-64 -mtune=generic -gdwarf-4 -fno-debug-types-section -fvar-tracking-assignments -g2  -DNDEBUG -DQT_NO_DEBUG -I/usr/include -std=c++14   -fno-exceptions -D_GNU_SOURCE -D__STDC_CONSTANT_MACROS -D__STDC_FORMAT_MACROS -D__STDC_LIMIT_MACROS -fno-rtti  -Wall -Wextra -Wno-unused-parameter -Wno-comment -Wno-missing-field-initializers -Wno-non-virtual-dtor -Wno-pedantic -fvisibility-inlines-hidden -DLDC_POSIX  -DIN_LLVM -DOPAQUE_VTBLS "-DLDC_INSTALL_PREFIX=R\"(/usr)\"" -DLDC_LLVM_VER=1500 "-DLDC_LIBDIR_SUFFIX=R\"(64)\"" -DLDC_HOST_LDMD=1 -DLDC_HOST_FE_VER=2097 "-DLDC_LLVM_LIBDIR=R\"(/usr/lib64)\""  -DNDEBUG -MD -MT CMakeFiles/LDCShared.dir/gen/ctfloat.cpp.o -MF CMakeFiles/LDCShared.dir/gen/ctfloat.cpp.o.d -o CMakeFiles/LDCShared.dir/gen/ctfloat.cpp.o -c /tmp/B.eu7gwbpr/BUILD/ldc-1.29.0-src/gen/ctfloat.cpp
[  6%] Building CXX object CMakeFiles/LDCShared.dir/gen/dcompute/druntime.cpp.o
/usr/bin/x86_64-pld-linux-g++ -DLDC_ENABLE_PLUGINS -DLDC_LLVM_SUPPORTED_TARGET_AArch64=1 -DLDC_LLVM_SUPPORTED_TARGET_AMDGPU=1 -DLDC_LLVM_SUPPORTED_TARGET_ARM=1 -DLDC_LLVM_SUPPORTED_TARGET_AVR=1 -DLDC_LLVM_SUPPORTED_TARGET_BPF=1 -DLDC_LLVM_SUPPORTED_TARGET_Hexagon=1 -DLDC_LLVM_SUPPORTED_TARGET_Lanai=1 -DLDC_LLVM_SUPPORTED_TARGET_MSP430=1 -DLDC_LLVM_SUPPORTED_TARGET_Mips=1 -DLDC_LLVM_SUPPORTED_TARGET_NVPTX=1 -DLDC_LLVM_SUPPORTED_TARGET_PowerPC=1 -DLDC_LLVM_SUPPORTED_TARGET_RISCV=1 -DLDC_LLVM_SUPPORTED_TARGET_SPIRV=1 -DLDC_LLVM_SUPPORTED_TARGET_Sparc=1 -DLDC_LLVM_SUPPORTED_TARGET_SystemZ=1 -DLDC_LLVM_SUPPORTED_TARGET_VE=1 -DLDC_LLVM_SUPPORTED_TARGET_WebAssembly=1 -DLDC_LLVM_SUPPORTED_TARGET_X86=1 -DLDC_LLVM_SUPPORTED_TARGET_XCore=1 -I/tmp/B.eu7gwbpr/BUILD/ldc-1.29.0-src/. -I/tmp/B.eu7gwbpr/BUILD/ldc-1.29.0-src/dmd -DDMDV2 -O2 -fwrapv -pipe -Wformat -Werror=format-security -gdwarf-4 -fno-debug-types-section -fvar-tracking-assignments -g2 -Wp,-D_FORTIFY_SOURCE=2 -fstack-protector-strong --param=ssp-buffer-size=4 -Werror=trampolines -fPIC -march=x86-64 -mtune=generic -gdwarf-4 -fno-debug-types-section -fvar-tracking-assignments -g2  -DNDEBUG -DQT_NO_DEBUG -I/usr/include -std=c++14   -fno-exceptions -D_GNU_SOURCE -D__STDC_CONSTANT_MACROS -D__STDC_FORMAT_MACROS -D__STDC_LIMIT_MACROS -fno-rtti  -Wall -Wextra -Wno-unused-parameter -Wno-comment -Wno-missing-field-initializers -Wno-non-virtual-dtor -Wno-pedantic -fvisibility-inlines-hidden -DLDC_POSIX  -DIN_LLVM -DOPAQUE_VTBLS "-DLDC_INSTALL_PREFIX=R\"(/usr)\"" -DLDC_LLVM_VER=1500 "-DLDC_LIBDIR_SUFFIX=R\"(64)\"" -DLDC_HOST_LDMD=1 -DLDC_HOST_FE_VER=2097 "-DLDC_LLVM_LIBDIR=R\"(/usr/lib64)\""  -DNDEBUG -MD -MT CMakeFiles/LDCShared.dir/gen/dcompute/druntime.cpp.o -MF CMakeFiles/LDCShared.dir/gen/dcompute/druntime.cpp.o.d -o CMakeFiles/LDCShared.dir/gen/dcompute/druntime.cpp.o -c /tmp/B.eu7gwbpr/BUILD/ldc-1.29.0-src/gen/dcompute/druntime.cpp
[ 12%] Building CXX object CMakeFiles/LDCShared.dir/gen/dcompute/target.cpp.o
/usr/bin/x86_64-pld-linux-g++ -DLDC_ENABLE_PLUGINS -DLDC_LLVM_SUPPORTED_TARGET_AArch64=1 -DLDC_LLVM_SUPPORTED_TARGET_AMDGPU=1 -DLDC_LLVM_SUPPORTED_TARGET_ARM=1 -DLDC_LLVM_SUPPORTED_TARGET_AVR=1 -DLDC_LLVM_SUPPORTED_TARGET_BPF=1 -DLDC_LLVM_SUPPORTED_TARGET_Hexagon=1 -DLDC_LLVM_SUPPORTED_TARGET_Lanai=1 -DLDC_LLVM_SUPPORTED_TARGET_MSP430=1 -DLDC_LLVM_SUPPORTED_TARGET_Mips=1 -DLDC_LLVM_SUPPORTED_TARGET_NVPTX=1 -DLDC_LLVM_SUPPORTED_TARGET_PowerPC=1 -DLDC_LLVM_SUPPORTED_TARGET_RISCV=1 -DLDC_LLVM_SUPPORTED_TARGET_SPIRV=1 -DLDC_LLVM_SUPPORTED_TARGET_Sparc=1 -DLDC_LLVM_SUPPORTED_TARGET_SystemZ=1 -DLDC_LLVM_SUPPORTED_TARGET_VE=1 -DLDC_LLVM_SUPPORTED_TARGET_WebAssembly=1 -DLDC_LLVM_SUPPORTED_TARGET_X86=1 -DLDC_LLVM_SUPPORTED_TARGET_XCore=1 -I/tmp/B.eu7gwbpr/BUILD/ldc-1.29.0-src/. -I/tmp/B.eu7gwbpr/BUILD/ldc-1.29.0-src/dmd -DDMDV2 -O2 -fwrapv -pipe -Wformat -Werror=format-security -gdwarf-4 -fno-debug-types-section -fvar-tracking-assignments -g2 -Wp,-D_FORTIFY_SOURCE=2 -fstack-protector-strong --param=ssp-buffer-size=4 -Werror=trampolines -fPIC -march=x86-64 -mtune=generic -gdwarf-4 -fno-debug-types-section -fvar-tracking-assignments -g2  -DNDEBUG -DQT_NO_DEBUG -I/usr/include -std=c++14   -fno-exceptions -D_GNU_SOURCE -D__STDC_CONSTANT_MACROS -D__STDC_FORMAT_MACROS -D__STDC_LIMIT_MACROS -fno-rtti  -Wall -Wextra -Wno-unused-parameter -Wno-comment -Wno-missing-field-initializers -Wno-non-virtual-dtor -Wno-pedantic -fvisibility-inlines-hidden -DLDC_POSIX  -DIN_LLVM -DOPAQUE_VTBLS "-DLDC_INSTALL_PREFIX=R\"(/usr)\"" -DLDC_LLVM_VER=1500 "-DLDC_LIBDIR_SUFFIX=R\"(64)\"" -DLDC_HOST_LDMD=1 -DLDC_HOST_FE_VER=2097 "-DLDC_LLVM_LIBDIR=R\"(/usr/lib64)\""  -DNDEBUG -MD -MT CMakeFiles/LDCShared.dir/gen/dcompute/target.cpp.o -MF CMakeFiles/LDCShared.dir/gen/dcompute/target.cpp.o.d -o CMakeFiles/LDCShared.dir/gen/dcompute/target.cpp.o -c /tmp/B.eu7gwbpr/BUILD/ldc-1.29.0-src/gen/dcompute/target.cpp
[ 12%] Building CXX object CMakeFiles/LDCShared.dir/gen/dcompute/targetCUDA.cpp.o
/usr/bin/x86_64-pld-linux-g++ -DLDC_ENABLE_PLUGINS -DLDC_LLVM_SUPPORTED_TARGET_AArch64=1 -DLDC_LLVM_SUPPORTED_TARGET_AMDGPU=1 -DLDC_LLVM_SUPPORTED_TARGET_ARM=1 -DLDC_LLVM_SUPPORTED_TARGET_AVR=1 -DLDC_LLVM_SUPPORTED_TARGET_BPF=1 -DLDC_LLVM_SUPPORTED_TARGET_Hexagon=1 -DLDC_LLVM_SUPPORTED_TARGET_Lanai=1 -DLDC_LLVM_SUPPORTED_TARGET_MSP430=1 -DLDC_LLVM_SUPPORTED_TARGET_Mips=1 -DLDC_LLVM_SUPPORTED_TARGET_NVPTX=1 -DLDC_LLVM_SUPPORTED_TARGET_PowerPC=1 -DLDC_LLVM_SUPPORTED_TARGET_RISCV=1 -DLDC_LLVM_SUPPORTED_TARGET_SPIRV=1 -DLDC_LLVM_SUPPORTED_TARGET_Sparc=1 -DLDC_LLVM_SUPPORTED_TARGET_SystemZ=1 -DLDC_LLVM_SUPPORTED_TARGET_VE=1 -DLDC_LLVM_SUPPORTED_TARGET_WebAssembly=1 -DLDC_LLVM_SUPPORTED_TARGET_X86=1 -DLDC_LLVM_SUPPORTED_TARGET_XCore=1 -I/tmp/B.eu7gwbpr/BUILD/ldc-1.29.0-src/. -I/tmp/B.eu7gwbpr/BUILD/ldc-1.29.0-src/dmd -DDMDV2 -O2 -fwrapv -pipe -Wformat -Werror=format-security -gdwarf-4 -fno-debug-types-section -fvar-tracking-assignments -g2 -Wp,-D_FORTIFY_SOURCE=2 -fstack-protector-strong --param=ssp-buffer-size=4 -Werror=trampolines -fPIC -march=x86-64 -mtune=generic -gdwarf-4 -fno-debug-types-section -fvar-tracking-assignments -g2  -DNDEBUG -DQT_NO_DEBUG -I/usr/include -std=c++14   -fno-exceptions -D_GNU_SOURCE -D__STDC_CONSTANT_MACROS -D__STDC_FORMAT_MACROS -D__STDC_LIMIT_MACROS -fno-rtti  -Wall -Wextra -Wno-unused-parameter -Wno-comment -Wno-missing-field-initializers -Wno-non-virtual-dtor -Wno-pedantic -fvisibility-inlines-hidden -DLDC_POSIX  -DIN_LLVM -DOPAQUE_VTBLS "-DLDC_INSTALL_PREFIX=R\"(/usr)\"" -DLDC_LLVM_VER=1500 "-DLDC_LIBDIR_SUFFIX=R\"(64)\"" -DLDC_HOST_LDMD=1 -DLDC_HOST_FE_VER=2097 "-DLDC_LLVM_LIBDIR=R\"(/usr/lib64)\""  -DNDEBUG -MD -MT CMakeFiles/LDCShared.dir/gen/dcompute/targetCUDA.cpp.o -MF CMakeFiles/LDCShared.dir/gen/dcompute/targetCUDA.cpp.o.d -o CMakeFiles/LDCShared.dir/gen/dcompute/targetCUDA.cpp.o -c /tmp/B.eu7gwbpr/BUILD/ldc-1.29.0-src/gen/dcompute/targetCUDA.cpp
[ 12%] Building CXX object CMakeFiles/LDCShared.dir/gen/dcompute/targetOCL.cpp.o
/usr/bin/x86_64-pld-linux-g++ -DLDC_ENABLE_PLUGINS -DLDC_LLVM_SUPPORTED_TARGET_AArch64=1 -DLDC_LLVM_SUPPORTED_TARGET_AMDGPU=1 -DLDC_LLVM_SUPPORTED_TARGET_ARM=1 -DLDC_LLVM_SUPPORTED_TARGET_AVR=1 -DLDC_LLVM_SUPPORTED_TARGET_BPF=1 -DLDC_LLVM_SUPPORTED_TARGET_Hexagon=1 -DLDC_LLVM_SUPPORTED_TARGET_Lanai=1 -DLDC_LLVM_SUPPORTED_TARGET_MSP430=1 -DLDC_LLVM_SUPPORTED_TARGET_Mips=1 -DLDC_LLVM_SUPPORTED_TARGET_NVPTX=1 -DLDC_LLVM_SUPPORTED_TARGET_PowerPC=1 -DLDC_LLVM_SUPPORTED_TARGET_RISCV=1 -DLDC_LLVM_SUPPORTED_TARGET_SPIRV=1 -DLDC_LLVM_SUPPORTED_TARGET_Sparc=1 -DLDC_LLVM_SUPPORTED_TARGET_SystemZ=1 -DLDC_LLVM_SUPPORTED_TARGET_VE=1 -DLDC_LLVM_SUPPORTED_TARGET_WebAssembly=1 -DLDC_LLVM_SUPPORTED_TARGET_X86=1 -DLDC_LLVM_SUPPORTED_TARGET_XCore=1 -I/tmp/B.eu7gwbpr/BUILD/ldc-1.29.0-src/. -I/tmp/B.eu7gwbpr/BUILD/ldc-1.29.0-src/dmd -DDMDV2 -O2 -fwrapv -pipe -Wformat -Werror=format-security -gdwarf-4 -fno-debug-types-section -fvar-tracking-assignments -g2 -Wp,-D_FORTIFY_SOURCE=2 -fstack-protector-strong --param=ssp-buffer-size=4 -Werror=trampolines -fPIC -march=x86-64 -mtune=generic -gdwarf-4 -fno-debug-types-section -fvar-tracking-assignments -g2  -DNDEBUG -DQT_NO_DEBUG -I/usr/include -std=c++14   -fno-exceptions -D_GNU_SOURCE -D__STDC_CONSTANT_MACROS -D__STDC_FORMAT_MACROS -D__STDC_LIMIT_MACROS -fno-rtti  -Wall -Wextra -Wno-unused-parameter -Wno-comment -Wno-missing-field-initializers -Wno-non-virtual-dtor -Wno-pedantic -fvisibility-inlines-hidden -DLDC_POSIX  -DIN_LLVM -DOPAQUE_VTBLS "-DLDC_INSTALL_PREFIX=R\"(/usr)\"" -DLDC_LLVM_VER=1500 "-DLDC_LIBDIR_SUFFIX=R\"(64)\"" -DLDC_HOST_LDMD=1 -DLDC_HOST_FE_VER=2097 "-DLDC_LLVM_LIBDIR=R\"(/usr/lib64)\""  -DNDEBUG -MD -MT CMakeFiles/LDCShared.dir/gen/dcompute/targetOCL.cpp.o -MF CMakeFiles/LDCShared.dir/gen/dcompute/targetOCL.cpp.o.d -o CMakeFiles/LDCShared.dir/gen/dcompute/targetOCL.cpp.o -c /tmp/B.eu7gwbpr/BUILD/ldc-1.29.0-src/gen/dcompute/targetOCL.cpp
[ 12%] Building CXX object CMakeFiles/LDCShared.dir/gen/declarations.cpp.o
/usr/bin/x86_64-pld-linux-g++ -DLDC_ENABLE_PLUGINS -DLDC_LLVM_SUPPORTED_TARGET_AArch64=1 -DLDC_LLVM_SUPPORTED_TARGET_AMDGPU=1 -DLDC_LLVM_SUPPORTED_TARGET_ARM=1 -DLDC_LLVM_SUPPORTED_TARGET_AVR=1 -DLDC_LLVM_SUPPORTED_TARGET_BPF=1 -DLDC_LLVM_SUPPORTED_TARGET_Hexagon=1 -DLDC_LLVM_SUPPORTED_TARGET_Lanai=1 -DLDC_LLVM_SUPPORTED_TARGET_MSP430=1 -DLDC_LLVM_SUPPORTED_TARGET_Mips=1 -DLDC_LLVM_SUPPORTED_TARGET_NVPTX=1 -DLDC_LLVM_SUPPORTED_TARGET_PowerPC=1 -DLDC_LLVM_SUPPORTED_TARGET_RISCV=1 -DLDC_LLVM_SUPPORTED_TARGET_SPIRV=1 -DLDC_LLVM_SUPPORTED_TARGET_Sparc=1 -DLDC_LLVM_SUPPORTED_TARGET_SystemZ=1 -DLDC_LLVM_SUPPORTED_TARGET_VE=1 -DLDC_LLVM_SUPPORTED_TARGET_WebAssembly=1 -DLDC_LLVM_SUPPORTED_TARGET_X86=1 -DLDC_LLVM_SUPPORTED_TARGET_XCore=1 -I/tmp/B.eu7gwbpr/BUILD/ldc-1.29.0-src/. -I/tmp/B.eu7gwbpr/BUILD/ldc-1.29.0-src/dmd -DDMDV2 -O2 -fwrapv -pipe -Wformat -Werror=format-security -gdwarf-4 -fno-debug-types-section -fvar-tracking-assignments -g2 -Wp,-D_FORTIFY_SOURCE=2 -fstack-protector-strong --param=ssp-buffer-size=4 -Werror=trampolines -fPIC -march=x86-64 -mtune=generic -gdwarf-4 -fno-debug-types-section -fvar-tracking-assignments -g2  -DNDEBUG -DQT_NO_DEBUG -I/usr/include -std=c++14   -fno-exceptions -D_GNU_SOURCE -D__STDC_CONSTANT_MACROS -D__STDC_FORMAT_MACROS -D__STDC_LIMIT_MACROS -fno-rtti  -Wall -Wextra -Wno-unused-parameter -Wno-comment -Wno-missing-field-initializers -Wno-non-virtual-dtor -Wno-pedantic -fvisibility-inlines-hidden -DLDC_POSIX  -DIN_LLVM -DOPAQUE_VTBLS "-DLDC_INSTALL_PREFIX=R\"(/usr)\"" -DLDC_LLVM_VER=1500 "-DLDC_LIBDIR_SUFFIX=R\"(64)\"" -DLDC_HOST_LDMD=1 -DLDC_HOST_FE_VER=2097 "-DLDC_LLVM_LIBDIR=R\"(/usr/lib64)\""  -DNDEBUG -MD -MT CMakeFiles/LDCShared.dir/gen/declarations.cpp.o -MF CMakeFiles/LDCShared.dir/gen/declarations.cpp.o.d -o CMakeFiles/LDCShared.dir/gen/declarations.cpp.o -c /tmp/B.eu7gwbpr/BUILD/ldc-1.29.0-src/gen/declarations.cpp
[ 12%] Building CXX object CMakeFiles/LDCShared.dir/gen/dibuilder.cpp.o
/usr/bin/x86_64-pld-linux-g++ -DLDC_ENABLE_PLUGINS -DLDC_LLVM_SUPPORTED_TARGET_AArch64=1 -DLDC_LLVM_SUPPORTED_TARGET_AMDGPU=1 -DLDC_LLVM_SUPPORTED_TARGET_ARM=1 -DLDC_LLVM_SUPPORTED_TARGET_AVR=1 -DLDC_LLVM_SUPPORTED_TARGET_BPF=1 -DLDC_LLVM_SUPPORTED_TARGET_Hexagon=1 -DLDC_LLVM_SUPPORTED_TARGET_Lanai=1 -DLDC_LLVM_SUPPORTED_TARGET_MSP430=1 -DLDC_LLVM_SUPPORTED_TARGET_Mips=1 -DLDC_LLVM_SUPPORTED_TARGET_NVPTX=1 -DLDC_LLVM_SUPPORTED_TARGET_PowerPC=1 -DLDC_LLVM_SUPPORTED_TARGET_RISCV=1 -DLDC_LLVM_SUPPORTED_TARGET_SPIRV=1 -DLDC_LLVM_SUPPORTED_TARGET_Sparc=1 -DLDC_LLVM_SUPPORTED_TARGET_SystemZ=1 -DLDC_LLVM_SUPPORTED_TARGET_VE=1 -DLDC_LLVM_SUPPORTED_TARGET_WebAssembly=1 -DLDC_LLVM_SUPPORTED_TARGET_X86=1 -DLDC_LLVM_SUPPORTED_TARGET_XCore=1 -I/tmp/B.eu7gwbpr/BUILD/ldc-1.29.0-src/. -I/tmp/B.eu7gwbpr/BUILD/ldc-1.29.0-src/dmd -DDMDV2 -O2 -fwrapv -pipe -Wformat -Werror=format-security -gdwarf-4 -fno-debug-types-section -fvar-tracking-assignments -g2 -Wp,-D_FORTIFY_SOURCE=2 -fstack-protector-strong --param=ssp-buffer-size=4 -Werror=trampolines -fPIC -march=x86-64 -mtune=generic -gdwarf-4 -fno-debug-types-section -fvar-tracking-assignments -g2  -DNDEBUG -DQT_NO_DEBUG -I/usr/include -std=c++14   -fno-exceptions -D_GNU_SOURCE -D__STDC_CONSTANT_MACROS -D__STDC_FORMAT_MACROS -D__STDC_LIMIT_MACROS -fno-rtti  -Wall -Wextra -Wno-unused-parameter -Wno-comment -Wno-missing-field-initializers -Wno-non-virtual-dtor -Wno-pedantic -fvisibility-inlines-hidden -DLDC_POSIX  -DIN_LLVM -DOPAQUE_VTBLS "-DLDC_INSTALL_PREFIX=R\"(/usr)\"" -DLDC_LLVM_VER=1500 "-DLDC_LIBDIR_SUFFIX=R\"(64)\"" -DLDC_HOST_LDMD=1 -DLDC_HOST_FE_VER=2097 "-DLDC_LLVM_LIBDIR=R\"(/usr/lib64)\""  -DNDEBUG -MD -MT CMakeFiles/LDCShared.dir/gen/dibuilder.cpp.o -MF CMakeFiles/LDCShared.dir/gen/dibuilder.cpp.o.d -o CMakeFiles/LDCShared.dir/gen/dibuilder.cpp.o -c /tmp/B.eu7gwbpr/BUILD/ldc-1.29.0-src/gen/dibuilder.cpp
/tmp/B.eu7gwbpr/BUILD/ldc-1.29.0-src/gen/dibuilder.cpp: In member function 'llvm::DIType* ldc::DIBuilder::CreateCompositeType(Type*)':
/tmp/B.eu7gwbpr/BUILD/ldc-1.29.0-src/gen/dibuilder.cpp:550:33: warning: 'llvm::Type* llvm::Type::getPointerElementType() const' is deprecated: Deprecated without replacement, see https://llvm.org/docs/OpaquePointers.html for context and migration instructions [-Wdeprecated-declarations]
  550 |     T = T->getPointerElementType();
      |         ~~~~~~~~~~~~~~~~~~~~~~~~^~
In file included from /tmp/B.eu7gwbpr/BUILD/ldc-1.29.0-src/./gen/llvm.h:20,
                 from /tmp/B.eu7gwbpr/BUILD/ldc-1.29.0-src/./gen/attributes.h:12,
                 from /tmp/B.eu7gwbpr/BUILD/ldc-1.29.0-src/./gen/tollvm.h:22,
                 from /tmp/B.eu7gwbpr/BUILD/ldc-1.29.0-src/./gen/dibuilder.h:12,
                 from /tmp/B.eu7gwbpr/BUILD/ldc-1.29.0-src/gen/dibuilder.cpp:10:
/usr/include/llvm/IR/Type.h:380:9: note: declared here
  380 |   Type *getPointerElementType() const {
      |         ^~~~~~~~~~~~~~~~~~~~~
[ 12%] Building CXX object CMakeFiles/LDCShared.dir/gen/dvalue.cpp.o
/usr/bin/x86_64-pld-linux-g++ -DLDC_ENABLE_PLUGINS -DLDC_LLVM_SUPPORTED_TARGET_AArch64=1 -DLDC_LLVM_SUPPORTED_TARGET_AMDGPU=1 -DLDC_LLVM_SUPPORTED_TARGET_ARM=1 -DLDC_LLVM_SUPPORTED_TARGET_AVR=1 -DLDC_LLVM_SUPPORTED_TARGET_BPF=1 -DLDC_LLVM_SUPPORTED_TARGET_Hexagon=1 -DLDC_LLVM_SUPPORTED_TARGET_Lanai=1 -DLDC_LLVM_SUPPORTED_TARGET_MSP430=1 -DLDC_LLVM_SUPPORTED_TARGET_Mips=1 -DLDC_LLVM_SUPPORTED_TARGET_NVPTX=1 -DLDC_LLVM_SUPPORTED_TARGET_PowerPC=1 -DLDC_LLVM_SUPPORTED_TARGET_RISCV=1 -DLDC_LLVM_SUPPORTED_TARGET_SPIRV=1 -DLDC_LLVM_SUPPORTED_TARGET_Sparc=1 -DLDC_LLVM_SUPPORTED_TARGET_SystemZ=1 -DLDC_LLVM_SUPPORTED_TARGET_VE=1 -DLDC_LLVM_SUPPORTED_TARGET_WebAssembly=1 -DLDC_LLVM_SUPPORTED_TARGET_X86=1 -DLDC_LLVM_SUPPORTED_TARGET_XCore=1 -I/tmp/B.eu7gwbpr/BUILD/ldc-1.29.0-src/. -I/tmp/B.eu7gwbpr/BUILD/ldc-1.29.0-src/dmd -DDMDV2 -O2 -fwrapv -pipe -Wformat -Werror=format-security -gdwarf-4 -fno-debug-types-section -fvar-tracking-assignments -g2 -Wp,-D_FORTIFY_SOURCE=2 -fstack-protector-strong --param=ssp-buffer-size=4 -Werror=trampolines -fPIC -march=x86-64 -mtune=generic -gdwarf-4 -fno-debug-types-section -fvar-tracking-assignments -g2  -DNDEBUG -DQT_NO_DEBUG -I/usr/include -std=c++14   -fno-exceptions -D_GNU_SOURCE -D__STDC_CONSTANT_MACROS -D__STDC_FORMAT_MACROS -D__STDC_LIMIT_MACROS -fno-rtti  -Wall -Wextra -Wno-unused-parameter -Wno-comment -Wno-missing-field-initializers -Wno-non-virtual-dtor -Wno-pedantic -fvisibility-inlines-hidden -DLDC_POSIX  -DIN_LLVM -DOPAQUE_VTBLS "-DLDC_INSTALL_PREFIX=R\"(/usr)\"" -DLDC_LLVM_VER=1500 "-DLDC_LIBDIR_SUFFIX=R\"(64)\"" -DLDC_HOST_LDMD=1 -DLDC_HOST_FE_VER=2097 "-DLDC_LLVM_LIBDIR=R\"(/usr/lib64)\""  -DNDEBUG -MD -MT CMakeFiles/LDCShared.dir/gen/dvalue.cpp.o -MF CMakeFiles/LDCShared.dir/gen/dvalue.cpp.o.d -o CMakeFiles/LDCShared.dir/gen/dvalue.cpp.o -c /tmp/B.eu7gwbpr/BUILD/ldc-1.29.0-src/gen/dvalue.cpp
[ 12%] Building CXX object CMakeFiles/LDCShared.dir/gen/dynamiccompile.cpp.o
/usr/bin/x86_64-pld-linux-g++ -DLDC_ENABLE_PLUGINS -DLDC_LLVM_SUPPORTED_TARGET_AArch64=1 -DLDC_LLVM_SUPPORTED_TARGET_AMDGPU=1 -DLDC_LLVM_SUPPORTED_TARGET_ARM=1 -DLDC_LLVM_SUPPORTED_TARGET_AVR=1 -DLDC_LLVM_SUPPORTED_TARGET_BPF=1 -DLDC_LLVM_SUPPORTED_TARGET_Hexagon=1 -DLDC_LLVM_SUPPORTED_TARGET_Lanai=1 -DLDC_LLVM_SUPPORTED_TARGET_MSP430=1 -DLDC_LLVM_SUPPORTED_TARGET_Mips=1 -DLDC_LLVM_SUPPORTED_TARGET_NVPTX=1 -DLDC_LLVM_SUPPORTED_TARGET_PowerPC=1 -DLDC_LLVM_SUPPORTED_TARGET_RISCV=1 -DLDC_LLVM_SUPPORTED_TARGET_SPIRV=1 -DLDC_LLVM_SUPPORTED_TARGET_Sparc=1 -DLDC_LLVM_SUPPORTED_TARGET_SystemZ=1 -DLDC_LLVM_SUPPORTED_TARGET_VE=1 -DLDC_LLVM_SUPPORTED_TARGET_WebAssembly=1 -DLDC_LLVM_SUPPORTED_TARGET_X86=1 -DLDC_LLVM_SUPPORTED_TARGET_XCore=1 -I/tmp/B.eu7gwbpr/BUILD/ldc-1.29.0-src/. -I/tmp/B.eu7gwbpr/BUILD/ldc-1.29.0-src/dmd -DDMDV2 -O2 -fwrapv -pipe -Wformat -Werror=format-security -gdwarf-4 -fno-debug-types-section -fvar-tracking-assignments -g2 -Wp,-D_FORTIFY_SOURCE=2 -fstack-protector-strong --param=ssp-buffer-size=4 -Werror=trampolines -fPIC -march=x86-64 -mtune=generic -gdwarf-4 -fno-debug-types-section -fvar-tracking-assignments -g2  -DNDEBUG -DQT_NO_DEBUG -I/usr/include -std=c++14   -fno-exceptions -D_GNU_SOURCE -D__STDC_CONSTANT_MACROS -D__STDC_FORMAT_MACROS -D__STDC_LIMIT_MACROS -fno-rtti  -Wall -Wextra -Wno-unused-parameter -Wno-comment -Wno-missing-field-initializers -Wno-non-virtual-dtor -Wno-pedantic -fvisibility-inlines-hidden -DLDC_POSIX  -DIN_LLVM -DOPAQUE_VTBLS "-DLDC_INSTALL_PREFIX=R\"(/usr)\"" -DLDC_LLVM_VER=1500 "-DLDC_LIBDIR_SUFFIX=R\"(64)\"" -DLDC_HOST_LDMD=1 -DLDC_HOST_FE_VER=2097 "-DLDC_LLVM_LIBDIR=R\"(/usr/lib64)\""  -DNDEBUG -MD -MT CMakeFiles/LDCShared.dir/gen/dynamiccompile.cpp.o -MF CMakeFiles/LDCShared.dir/gen/dynamiccompile.cpp.o.d -o CMakeFiles/LDCShared.dir/gen/dynamiccompile.cpp.o -c /tmp/B.eu7gwbpr/BUILD/ldc-1.29.0-src/gen/dynamiccompile.cpp
[ 12%] Building CXX object CMakeFiles/LDCShared.dir/gen/funcgenstate.cpp.o
/usr/bin/x86_64-pld-linux-g++ -DLDC_ENABLE_PLUGINS -DLDC_LLVM_SUPPORTED_TARGET_AArch64=1 -DLDC_LLVM_SUPPORTED_TARGET_AMDGPU=1 -DLDC_LLVM_SUPPORTED_TARGET_ARM=1 -DLDC_LLVM_SUPPORTED_TARGET_AVR=1 -DLDC_LLVM_SUPPORTED_TARGET_BPF=1 -DLDC_LLVM_SUPPORTED_TARGET_Hexagon=1 -DLDC_LLVM_SUPPORTED_TARGET_Lanai=1 -DLDC_LLVM_SUPPORTED_TARGET_MSP430=1 -DLDC_LLVM_SUPPORTED_TARGET_Mips=1 -DLDC_LLVM_SUPPORTED_TARGET_NVPTX=1 -DLDC_LLVM_SUPPORTED_TARGET_PowerPC=1 -DLDC_LLVM_SUPPORTED_TARGET_RISCV=1 -DLDC_LLVM_SUPPORTED_TARGET_SPIRV=1 -DLDC_LLVM_SUPPORTED_TARGET_Sparc=1 -DLDC_LLVM_SUPPORTED_TARGET_SystemZ=1 -DLDC_LLVM_SUPPORTED_TARGET_VE=1 -DLDC_LLVM_SUPPORTED_TARGET_WebAssembly=1 -DLDC_LLVM_SUPPORTED_TARGET_X86=1 -DLDC_LLVM_SUPPORTED_TARGET_XCore=1 -I/tmp/B.eu7gwbpr/BUILD/ldc-1.29.0-src/. -I/tmp/B.eu7gwbpr/BUILD/ldc-1.29.0-src/dmd -DDMDV2 -O2 -fwrapv -pipe -Wformat -Werror=format-security -gdwarf-4 -fno-debug-types-section -fvar-tracking-assignments -g2 -Wp,-D_FORTIFY_SOURCE=2 -fstack-protector-strong --param=ssp-buffer-size=4 -Werror=trampolines -fPIC -march=x86-64 -mtune=generic -gdwarf-4 -fno-debug-types-section -fvar-tracking-assignments -g2  -DNDEBUG -DQT_NO_DEBUG -I/usr/include -std=c++14   -fno-exceptions -D_GNU_SOURCE -D__STDC_CONSTANT_MACROS -D__STDC_FORMAT_MACROS -D__STDC_LIMIT_MACROS -fno-rtti  -Wall -Wextra -Wno-unused-parameter -Wno-comment -Wno-missing-field-initializers -Wno-non-virtual-dtor -Wno-pedantic -fvisibility-inlines-hidden -DLDC_POSIX  -DIN_LLVM -DOPAQUE_VTBLS "-DLDC_INSTALL_PREFIX=R\"(/usr)\"" -DLDC_LLVM_VER=1500 "-DLDC_LIBDIR_SUFFIX=R\"(64)\"" -DLDC_HOST_LDMD=1 -DLDC_HOST_FE_VER=2097 "-DLDC_LLVM_LIBDIR=R\"(/usr/lib64)\""  -DNDEBUG -MD -MT CMakeFiles/LDCShared.dir/gen/funcgenstate.cpp.o -MF CMakeFiles/LDCShared.dir/gen/funcgenstate.cpp.o.d -o CMakeFiles/LDCShared.dir/gen/funcgenstate.cpp.o -c /tmp/B.eu7gwbpr/BUILD/ldc-1.29.0-src/gen/funcgenstate.cpp
[ 12%] Building CXX object CMakeFiles/LDCShared.dir/gen/function-inlining.cpp.o
/usr/bin/x86_64-pld-linux-g++ -DLDC_ENABLE_PLUGINS -DLDC_LLVM_SUPPORTED_TARGET_AArch64=1 -DLDC_LLVM_SUPPORTED_TARGET_AMDGPU=1 -DLDC_LLVM_SUPPORTED_TARGET_ARM=1 -DLDC_LLVM_SUPPORTED_TARGET_AVR=1 -DLDC_LLVM_SUPPORTED_TARGET_BPF=1 -DLDC_LLVM_SUPPORTED_TARGET_Hexagon=1 -DLDC_LLVM_SUPPORTED_TARGET_Lanai=1 -DLDC_LLVM_SUPPORTED_TARGET_MSP430=1 -DLDC_LLVM_SUPPORTED_TARGET_Mips=1 -DLDC_LLVM_SUPPORTED_TARGET_NVPTX=1 -DLDC_LLVM_SUPPORTED_TARGET_PowerPC=1 -DLDC_LLVM_SUPPORTED_TARGET_RISCV=1 -DLDC_LLVM_SUPPORTED_TARGET_SPIRV=1 -DLDC_LLVM_SUPPORTED_TARGET_Sparc=1 -DLDC_LLVM_SUPPORTED_TARGET_SystemZ=1 -DLDC_LLVM_SUPPORTED_TARGET_VE=1 -DLDC_LLVM_SUPPORTED_TARGET_WebAssembly=1 -DLDC_LLVM_SUPPORTED_TARGET_X86=1 -DLDC_LLVM_SUPPORTED_TARGET_XCore=1 -I/tmp/B.eu7gwbpr/BUILD/ldc-1.29.0-src/. -I/tmp/B.eu7gwbpr/BUILD/ldc-1.29.0-src/dmd -DDMDV2 -O2 -fwrapv -pipe -Wformat -Werror=format-security -gdwarf-4 -fno-debug-types-section -fvar-tracking-assignments -g2 -Wp,-D_FORTIFY_SOURCE=2 -fstack-protector-strong --param=ssp-buffer-size=4 -Werror=trampolines -fPIC -march=x86-64 -mtune=generic -gdwarf-4 -fno-debug-types-section -fvar-tracking-assignments -g2  -DNDEBUG -DQT_NO_DEBUG -I/usr/include -std=c++14   -fno-exceptions -D_GNU_SOURCE -D__STDC_CONSTANT_MACROS -D__STDC_FORMAT_MACROS -D__STDC_LIMIT_MACROS -fno-rtti  -Wall -Wextra -Wno-unused-parameter -Wno-comment -Wno-missing-field-initializers -Wno-non-virtual-dtor -Wno-pedantic -fvisibility-inlines-hidden -DLDC_POSIX  -DIN_LLVM -DOPAQUE_VTBLS "-DLDC_INSTALL_PREFIX=R\"(/usr)\"" -DLDC_LLVM_VER=1500 "-DLDC_LIBDIR_SUFFIX=R\"(64)\"" -DLDC_HOST_LDMD=1 -DLDC_HOST_FE_VER=2097 "-DLDC_LLVM_LIBDIR=R\"(/usr/lib64)\""  -DNDEBUG -MD -MT CMakeFiles/LDCShared.dir/gen/function-inlining.cpp.o -MF CMakeFiles/LDCShared.dir/gen/function-inlining.cpp.o.d -o CMakeFiles/LDCShared.dir/gen/function-inlining.cpp.o -c /tmp/B.eu7gwbpr/BUILD/ldc-1.29.0-src/gen/function-inlining.cpp
[ 12%] Building CXX object CMakeFiles/LDCShared.dir/gen/functions.cpp.o
/usr/bin/x86_64-pld-linux-g++ -DLDC_ENABLE_PLUGINS -DLDC_LLVM_SUPPORTED_TARGET_AArch64=1 -DLDC_LLVM_SUPPORTED_TARGET_AMDGPU=1 -DLDC_LLVM_SUPPORTED_TARGET_ARM=1 -DLDC_LLVM_SUPPORTED_TARGET_AVR=1 -DLDC_LLVM_SUPPORTED_TARGET_BPF=1 -DLDC_LLVM_SUPPORTED_TARGET_Hexagon=1 -DLDC_LLVM_SUPPORTED_TARGET_Lanai=1 -DLDC_LLVM_SUPPORTED_TARGET_MSP430=1 -DLDC_LLVM_SUPPORTED_TARGET_Mips=1 -DLDC_LLVM_SUPPORTED_TARGET_NVPTX=1 -DLDC_LLVM_SUPPORTED_TARGET_PowerPC=1 -DLDC_LLVM_SUPPORTED_TARGET_RISCV=1 -DLDC_LLVM_SUPPORTED_TARGET_SPIRV=1 -DLDC_LLVM_SUPPORTED_TARGET_Sparc=1 -DLDC_LLVM_SUPPORTED_TARGET_SystemZ=1 -DLDC_LLVM_SUPPORTED_TARGET_VE=1 -DLDC_LLVM_SUPPORTED_TARGET_WebAssembly=1 -DLDC_LLVM_SUPPORTED_TARGET_X86=1 -DLDC_LLVM_SUPPORTED_TARGET_XCore=1 -I/tmp/B.eu7gwbpr/BUILD/ldc-1.29.0-src/. -I/tmp/B.eu7gwbpr/BUILD/ldc-1.29.0-src/dmd -DDMDV2 -O2 -fwrapv -pipe -Wformat -Werror=format-security -gdwarf-4 -fno-debug-types-section -fvar-tracking-assignments -g2 -Wp,-D_FORTIFY_SOURCE=2 -fstack-protector-strong --param=ssp-buffer-size=4 -Werror=trampolines -fPIC -march=x86-64 -mtune=generic -gdwarf-4 -fno-debug-types-section -fvar-tracking-assignments -g2  -DNDEBUG -DQT_NO_DEBUG -I/usr/include -std=c++14   -fno-exceptions -D_GNU_SOURCE -D__STDC_CONSTANT_MACROS -D__STDC_FORMAT_MACROS -D__STDC_LIMIT_MACROS -fno-rtti  -Wall -Wextra -Wno-unused-parameter -Wno-comment -Wno-missing-field-initializers -Wno-non-virtual-dtor -Wno-pedantic -fvisibility-inlines-hidden -DLDC_POSIX  -DIN_LLVM -DOPAQUE_VTBLS "-DLDC_INSTALL_PREFIX=R\"(/usr)\"" -DLDC_LLVM_VER=1500 "-DLDC_LIBDIR_SUFFIX=R\"(64)\"" -DLDC_HOST_LDMD=1 -DLDC_HOST_FE_VER=2097 "-DLDC_LLVM_LIBDIR=R\"(/usr/lib64)\""  -DNDEBUG -MD -MT CMakeFiles/LDCShared.dir/gen/functions.cpp.o -MF CMakeFiles/LDCShared.dir/gen/functions.cpp.o.d -o CMakeFiles/LDCShared.dir/gen/functions.cpp.o -c /tmp/B.eu7gwbpr/BUILD/ldc-1.29.0-src/gen/functions.cpp
[ 12%] Building CXX object CMakeFiles/LDCShared.dir/gen/inlineir.cpp.o
/usr/bin/x86_64-pld-linux-g++ -DLDC_ENABLE_PLUGINS -DLDC_LLVM_SUPPORTED_TARGET_AArch64=1 -DLDC_LLVM_SUPPORTED_TARGET_AMDGPU=1 -DLDC_LLVM_SUPPORTED_TARGET_ARM=1 -DLDC_LLVM_SUPPORTED_TARGET_AVR=1 -DLDC_LLVM_SUPPORTED_TARGET_BPF=1 -DLDC_LLVM_SUPPORTED_TARGET_Hexagon=1 -DLDC_LLVM_SUPPORTED_TARGET_Lanai=1 -DLDC_LLVM_SUPPORTED_TARGET_MSP430=1 -DLDC_LLVM_SUPPORTED_TARGET_Mips=1 -DLDC_LLVM_SUPPORTED_TARGET_NVPTX=1 -DLDC_LLVM_SUPPORTED_TARGET_PowerPC=1 -DLDC_LLVM_SUPPORTED_TARGET_RISCV=1 -DLDC_LLVM_SUPPORTED_TARGET_SPIRV=1 -DLDC_LLVM_SUPPORTED_TARGET_Sparc=1 -DLDC_LLVM_SUPPORTED_TARGET_SystemZ=1 -DLDC_LLVM_SUPPORTED_TARGET_VE=1 -DLDC_LLVM_SUPPORTED_TARGET_WebAssembly=1 -DLDC_LLVM_SUPPORTED_TARGET_X86=1 -DLDC_LLVM_SUPPORTED_TARGET_XCore=1 -I/tmp/B.eu7gwbpr/BUILD/ldc-1.29.0-src/. -I/tmp/B.eu7gwbpr/BUILD/ldc-1.29.0-src/dmd -DDMDV2 -O2 -fwrapv -pipe -Wformat -Werror=format-security -gdwarf-4 -fno-debug-types-section -fvar-tracking-assignments -g2 -Wp,-D_FORTIFY_SOURCE=2 -fstack-protector-strong --param=ssp-buffer-size=4 -Werror=trampolines -fPIC -march=x86-64 -mtune=generic -gdwarf-4 -fno-debug-types-section -fvar-tracking-assignments -g2  -DNDEBUG -DQT_NO_DEBUG -I/usr/include -std=c++14   -fno-exceptions -D_GNU_SOURCE -D__STDC_CONSTANT_MACROS -D__STDC_FORMAT_MACROS -D__STDC_LIMIT_MACROS -fno-rtti  -Wall -Wextra -Wno-unused-parameter -Wno-comment -Wno-missing-field-initializers -Wno-non-virtual-dtor -Wno-pedantic -fvisibility-inlines-hidden -DLDC_POSIX  -DIN_LLVM -DOPAQUE_VTBLS "-DLDC_INSTALL_PREFIX=R\"(/usr)\"" -DLDC_LLVM_VER=1500 "-DLDC_LIBDIR_SUFFIX=R\"(64)\"" -DLDC_HOST_LDMD=1 -DLDC_HOST_FE_VER=2097 "-DLDC_LLVM_LIBDIR=R\"(/usr/lib64)\""  -DNDEBUG -MD -MT CMakeFiles/LDCShared.dir/gen/inlineir.cpp.o -MF CMakeFiles/LDCShared.dir/gen/inlineir.cpp.o.d -o CMakeFiles/LDCShared.dir/gen/inlineir.cpp.o -c /tmp/B.eu7gwbpr/BUILD/ldc-1.29.0-src/gen/inlineir.cpp
[ 12%] Building CXX object CMakeFiles/LDCShared.dir/gen/irstate.cpp.o
/usr/bin/x86_64-pld-linux-g++ -DLDC_ENABLE_PLUGINS -DLDC_LLVM_SUPPORTED_TARGET_AArch64=1 -DLDC_LLVM_SUPPORTED_TARGET_AMDGPU=1 -DLDC_LLVM_SUPPORTED_TARGET_ARM=1 -DLDC_LLVM_SUPPORTED_TARGET_AVR=1 -DLDC_LLVM_SUPPORTED_TARGET_BPF=1 -DLDC_LLVM_SUPPORTED_TARGET_Hexagon=1 -DLDC_LLVM_SUPPORTED_TARGET_Lanai=1 -DLDC_LLVM_SUPPORTED_TARGET_MSP430=1 -DLDC_LLVM_SUPPORTED_TARGET_Mips=1 -DLDC_LLVM_SUPPORTED_TARGET_NVPTX=1 -DLDC_LLVM_SUPPORTED_TARGET_PowerPC=1 -DLDC_LLVM_SUPPORTED_TARGET_RISCV=1 -DLDC_LLVM_SUPPORTED_TARGET_SPIRV=1 -DLDC_LLVM_SUPPORTED_TARGET_Sparc=1 -DLDC_LLVM_SUPPORTED_TARGET_SystemZ=1 -DLDC_LLVM_SUPPORTED_TARGET_VE=1 -DLDC_LLVM_SUPPORTED_TARGET_WebAssembly=1 -DLDC_LLVM_SUPPORTED_TARGET_X86=1 -DLDC_LLVM_SUPPORTED_TARGET_XCore=1 -I/tmp/B.eu7gwbpr/BUILD/ldc-1.29.0-src/. -I/tmp/B.eu7gwbpr/BUILD/ldc-1.29.0-src/dmd -DDMDV2 -O2 -fwrapv -pipe -Wformat -Werror=format-security -gdwarf-4 -fno-debug-types-section -fvar-tracking-assignments -g2 -Wp,-D_FORTIFY_SOURCE=2 -fstack-protector-strong --param=ssp-buffer-size=4 -Werror=trampolines -fPIC -march=x86-64 -mtune=generic -gdwarf-4 -fno-debug-types-section -fvar-tracking-assignments -g2  -DNDEBUG -DQT_NO_DEBUG -I/usr/include -std=c++14   -fno-exceptions -D_GNU_SOURCE -D__STDC_CONSTANT_MACROS -D__STDC_FORMAT_MACROS -D__STDC_LIMIT_MACROS -fno-rtti  -Wall -Wextra -Wno-unused-parameter -Wno-comment -Wno-missing-field-initializers -Wno-non-virtual-dtor -Wno-pedantic -fvisibility-inlines-hidden -DLDC_POSIX  -DIN_LLVM -DOPAQUE_VTBLS "-DLDC_INSTALL_PREFIX=R\"(/usr)\"" -DLDC_LLVM_VER=1500 "-DLDC_LIBDIR_SUFFIX=R\"(64)\"" -DLDC_HOST_LDMD=1 -DLDC_HOST_FE_VER=2097 "-DLDC_LLVM_LIBDIR=R\"(/usr/lib64)\""  -DNDEBUG -MD -MT CMakeFiles/LDCShared.dir/gen/irstate.cpp.o -MF CMakeFiles/LDCShared.dir/gen/irstate.cpp.o.d -o CMakeFiles/LDCShared.dir/gen/irstate.cpp.o -c /tmp/B.eu7gwbpr/BUILD/ldc-1.29.0-src/gen/irstate.cpp
[ 18%] Building CXX object CMakeFiles/LDCShared.dir/gen/ldctraits.cpp.o
/usr/bin/x86_64-pld-linux-g++ -DLDC_ENABLE_PLUGINS -DLDC_LLVM_SUPPORTED_TARGET_AArch64=1 -DLDC_LLVM_SUPPORTED_TARGET_AMDGPU=1 -DLDC_LLVM_SUPPORTED_TARGET_ARM=1 -DLDC_LLVM_SUPPORTED_TARGET_AVR=1 -DLDC_LLVM_SUPPORTED_TARGET_BPF=1 -DLDC_LLVM_SUPPORTED_TARGET_Hexagon=1 -DLDC_LLVM_SUPPORTED_TARGET_Lanai=1 -DLDC_LLVM_SUPPORTED_TARGET_MSP430=1 -DLDC_LLVM_SUPPORTED_TARGET_Mips=1 -DLDC_LLVM_SUPPORTED_TARGET_NVPTX=1 -DLDC_LLVM_SUPPORTED_TARGET_PowerPC=1 -DLDC_LLVM_SUPPORTED_TARGET_RISCV=1 -DLDC_LLVM_SUPPORTED_TARGET_SPIRV=1 -DLDC_LLVM_SUPPORTED_TARGET_Sparc=1 -DLDC_LLVM_SUPPORTED_TARGET_SystemZ=1 -DLDC_LLVM_SUPPORTED_TARGET_VE=1 -DLDC_LLVM_SUPPORTED_TARGET_WebAssembly=1 -DLDC_LLVM_SUPPORTED_TARGET_X86=1 -DLDC_LLVM_SUPPORTED_TARGET_XCore=1 -I/tmp/B.eu7gwbpr/BUILD/ldc-1.29.0-src/. -I/tmp/B.eu7gwbpr/BUILD/ldc-1.29.0-src/dmd -DDMDV2 -O2 -fwrapv -pipe -Wformat -Werror=format-security -gdwarf-4 -fno-debug-types-section -fvar-tracking-assignments -g2 -Wp,-D_FORTIFY_SOURCE=2 -fstack-protector-strong --param=ssp-buffer-size=4 -Werror=trampolines -fPIC -march=x86-64 -mtune=generic -gdwarf-4 -fno-debug-types-section -fvar-tracking-assignments -g2  -DNDEBUG -DQT_NO_DEBUG -I/usr/include -std=c++14   -fno-exceptions -D_GNU_SOURCE -D__STDC_CONSTANT_MACROS -D__STDC_FORMAT_MACROS -D__STDC_LIMIT_MACROS -fno-rtti  -Wall -Wextra -Wno-unused-parameter -Wno-comment -Wno-missing-field-initializers -Wno-non-virtual-dtor -Wno-pedantic -fvisibility-inlines-hidden -DLDC_POSIX  -DIN_LLVM -DOPAQUE_VTBLS "-DLDC_INSTALL_PREFIX=R\"(/usr)\"" -DLDC_LLVM_VER=1500 "-DLDC_LIBDIR_SUFFIX=R\"(64)\"" -DLDC_HOST_LDMD=1 -DLDC_HOST_FE_VER=2097 "-DLDC_LLVM_LIBDIR=R\"(/usr/lib64)\""  -DNDEBUG -MD -MT CMakeFiles/LDCShared.dir/gen/ldctraits.cpp.o -MF CMakeFiles/LDCShared.dir/gen/ldctraits.cpp.o.d -o CMakeFiles/LDCShared.dir/gen/ldctraits.cpp.o -c /tmp/B.eu7gwbpr/BUILD/ldc-1.29.0-src/gen/ldctraits.cpp
[ 18%] Building CXX object CMakeFiles/LDCShared.dir/gen/linkage.cpp.o
/usr/bin/x86_64-pld-linux-g++ -DLDC_ENABLE_PLUGINS -DLDC_LLVM_SUPPORTED_TARGET_AArch64=1 -DLDC_LLVM_SUPPORTED_TARGET_AMDGPU=1 -DLDC_LLVM_SUPPORTED_TARGET_ARM=1 -DLDC_LLVM_SUPPORTED_TARGET_AVR=1 -DLDC_LLVM_SUPPORTED_TARGET_BPF=1 -DLDC_LLVM_SUPPORTED_TARGET_Hexagon=1 -DLDC_LLVM_SUPPORTED_TARGET_Lanai=1 -DLDC_LLVM_SUPPORTED_TARGET_MSP430=1 -DLDC_LLVM_SUPPORTED_TARGET_Mips=1 -DLDC_LLVM_SUPPORTED_TARGET_NVPTX=1 -DLDC_LLVM_SUPPORTED_TARGET_PowerPC=1 -DLDC_LLVM_SUPPORTED_TARGET_RISCV=1 -DLDC_LLVM_SUPPORTED_TARGET_SPIRV=1 -DLDC_LLVM_SUPPORTED_TARGET_Sparc=1 -DLDC_LLVM_SUPPORTED_TARGET_SystemZ=1 -DLDC_LLVM_SUPPORTED_TARGET_VE=1 -DLDC_LLVM_SUPPORTED_TARGET_WebAssembly=1 -DLDC_LLVM_SUPPORTED_TARGET_X86=1 -DLDC_LLVM_SUPPORTED_TARGET_XCore=1 -I/tmp/B.eu7gwbpr/BUILD/ldc-1.29.0-src/. -I/tmp/B.eu7gwbpr/BUILD/ldc-1.29.0-src/dmd -DDMDV2 -O2 -fwrapv -pipe -Wformat -Werror=format-security -gdwarf-4 -fno-debug-types-section -fvar-tracking-assignments -g2 -Wp,-D_FORTIFY_SOURCE=2 -fstack-protector-strong --param=ssp-buffer-size=4 -Werror=trampolines -fPIC -march=x86-64 -mtune=generic -gdwarf-4 -fno-debug-types-section -fvar-tracking-assignments -g2  -DNDEBUG -DQT_NO_DEBUG -I/usr/include -std=c++14   -fno-exceptions -D_GNU_SOURCE -D__STDC_CONSTANT_MACROS -D__STDC_FORMAT_MACROS -D__STDC_LIMIT_MACROS -fno-rtti  -Wall -Wextra -Wno-unused-parameter -Wno-comment -Wno-missing-field-initializers -Wno-non-virtual-dtor -Wno-pedantic -fvisibility-inlines-hidden -DLDC_POSIX  -DIN_LLVM -DOPAQUE_VTBLS "-DLDC_INSTALL_PREFIX=R\"(/usr)\"" -DLDC_LLVM_VER=1500 "-DLDC_LIBDIR_SUFFIX=R\"(64)\"" -DLDC_HOST_LDMD=1 -DLDC_HOST_FE_VER=2097 "-DLDC_LLVM_LIBDIR=R\"(/usr/lib64)\""  -DNDEBUG -MD -MT CMakeFiles/LDCShared.dir/gen/linkage.cpp.o -MF CMakeFiles/LDCShared.dir/gen/linkage.cpp.o.d -o CMakeFiles/LDCShared.dir/gen/linkage.cpp.o -c /tmp/B.eu7gwbpr/BUILD/ldc-1.29.0-src/gen/linkage.cpp
[ 18%] Building CXX object CMakeFiles/LDCShared.dir/gen/llvmhelpers.cpp.o
/usr/bin/x86_64-pld-linux-g++ -DLDC_ENABLE_PLUGINS -DLDC_LLVM_SUPPORTED_TARGET_AArch64=1 -DLDC_LLVM_SUPPORTED_TARGET_AMDGPU=1 -DLDC_LLVM_SUPPORTED_TARGET_ARM=1 -DLDC_LLVM_SUPPORTED_TARGET_AVR=1 -DLDC_LLVM_SUPPORTED_TARGET_BPF=1 -DLDC_LLVM_SUPPORTED_TARGET_Hexagon=1 -DLDC_LLVM_SUPPORTED_TARGET_Lanai=1 -DLDC_LLVM_SUPPORTED_TARGET_MSP430=1 -DLDC_LLVM_SUPPORTED_TARGET_Mips=1 -DLDC_LLVM_SUPPORTED_TARGET_NVPTX=1 -DLDC_LLVM_SUPPORTED_TARGET_PowerPC=1 -DLDC_LLVM_SUPPORTED_TARGET_RISCV=1 -DLDC_LLVM_SUPPORTED_TARGET_SPIRV=1 -DLDC_LLVM_SUPPORTED_TARGET_Sparc=1 -DLDC_LLVM_SUPPORTED_TARGET_SystemZ=1 -DLDC_LLVM_SUPPORTED_TARGET_VE=1 -DLDC_LLVM_SUPPORTED_TARGET_WebAssembly=1 -DLDC_LLVM_SUPPORTED_TARGET_X86=1 -DLDC_LLVM_SUPPORTED_TARGET_XCore=1 -I/tmp/B.eu7gwbpr/BUILD/ldc-1.29.0-src/. -I/tmp/B.eu7gwbpr/BUILD/ldc-1.29.0-src/dmd -DDMDV2 -O2 -fwrapv -pipe -Wformat -Werror=format-security -gdwarf-4 -fno-debug-types-section -fvar-tracking-assignments -g2 -Wp,-D_FORTIFY_SOURCE=2 -fstack-protector-strong --param=ssp-buffer-size=4 -Werror=trampolines -fPIC -march=x86-64 -mtune=generic -gdwarf-4 -fno-debug-types-section -fvar-tracking-assignments -g2  -DNDEBUG -DQT_NO_DEBUG -I/usr/include -std=c++14   -fno-exceptions -D_GNU_SOURCE -D__STDC_CONSTANT_MACROS -D__STDC_FORMAT_MACROS -D__STDC_LIMIT_MACROS -fno-rtti  -Wall -Wextra -Wno-unused-parameter -Wno-comment -Wno-missing-field-initializers -Wno-non-virtual-dtor -Wno-pedantic -fvisibility-inlines-hidden -DLDC_POSIX  -DIN_LLVM -DOPAQUE_VTBLS "-DLDC_INSTALL_PREFIX=R\"(/usr)\"" -DLDC_LLVM_VER=1500 "-DLDC_LIBDIR_SUFFIX=R\"(64)\"" -DLDC_HOST_LDMD=1 -DLDC_HOST_FE_VER=2097 "-DLDC_LLVM_LIBDIR=R\"(/usr/lib64)\""  -DNDEBUG -MD -MT CMakeFiles/LDCShared.dir/gen/llvmhelpers.cpp.o -MF CMakeFiles/LDCShared.dir/gen/llvmhelpers.cpp.o.d -o CMakeFiles/LDCShared.dir/gen/llvmhelpers.cpp.o -c /tmp/B.eu7gwbpr/BUILD/ldc-1.29.0-src/gen/llvmhelpers.cpp
/tmp/B.eu7gwbpr/BUILD/ldc-1.29.0-src/gen/llvmhelpers.cpp: In function 'llvm::Value* DtoAllocaDump(DValue*, llvm::Type*, int, const char*)':
/tmp/B.eu7gwbpr/BUILD/ldc-1.29.0-src/gen/llvmhelpers.cpp:240:73: warning: 'llvm::Type* llvm::Type::getPointerElementType() const' is deprecated: Deprecated without replacement, see https://llvm.org/docs/OpaquePointers.html for context and migration instructions [-Wdeprecated-declarations]
  240 |         std::min(getTypeAllocSize(lval->getType()->getPointerElementType()),
      |                                   ~~~~~~~~~~~~~~~~~~~~~~~~~~~~~~~~~~~~~~^~
In file included from /tmp/B.eu7gwbpr/BUILD/ldc-1.29.0-src/./gen/llvm.h:20,
                 from /tmp/B.eu7gwbpr/BUILD/ldc-1.29.0-src/./gen/llvmhelpers.h:21,
                 from /tmp/B.eu7gwbpr/BUILD/ldc-1.29.0-src/gen/llvmhelpers.cpp:10:
/usr/include/llvm/IR/Type.h:380:9: note: declared here
  380 |   Type *getPointerElementType() const {
      |         ^~~~~~~~~~~~~~~~~~~~~
/tmp/B.eu7gwbpr/BUILD/ldc-1.29.0-src/gen/llvmhelpers.cpp: In function 'DValue* makeVarDValue(Type*, VarDeclaration*, llvm::Value*)':
/tmp/B.eu7gwbpr/BUILD/ldc-1.29.0-src/gen/llvmhelpers.cpp:1962:68: warning: 'llvm::Type* llvm::Type::getPointerElementType() const' is deprecated: Deprecated without replacement, see https://llvm.org/docs/OpaquePointers.html for context and migration instructions [-Wdeprecated-declarations]
 1962 |     llvm::Type *pointeeType = val->getType()->getPointerElementType();
      |                               ~~~~~~~~~~~~~~~~~~~~~~~~~~~~~~~~~~~~~^~
/usr/include/llvm/IR/Type.h:380:9: note: declared here
  380 |   Type *getPointerElementType() const {
      |         ^~~~~~~~~~~~~~~~~~~~~
/tmp/B.eu7gwbpr/BUILD/ldc-1.29.0-src/gen/llvmhelpers.cpp:1964:55: warning: 'llvm::Type* llvm::Type::getPointerElementType() const' is deprecated: Deprecated without replacement, see https://llvm.org/docs/OpaquePointers.html for context and migration instructions [-Wdeprecated-declarations]
 1964 |       pointeeType = pointeeType->getPointerElementType();
      |                     ~~~~~~~~~~~~~~~~~~~~~~~~~~~~~~~~~~^~
/usr/include/llvm/IR/Type.h:380:9: note: declared here
  380 |   Type *getPointerElementType() const {
      |         ^~~~~~~~~~~~~~~~~~~~~
[ 18%] Building CXX object CMakeFiles/LDCShared.dir/gen/logger.cpp.o
/usr/bin/x86_64-pld-linux-g++ -DLDC_ENABLE_PLUGINS -DLDC_LLVM_SUPPORTED_TARGET_AArch64=1 -DLDC_LLVM_SUPPORTED_TARGET_AMDGPU=1 -DLDC_LLVM_SUPPORTED_TARGET_ARM=1 -DLDC_LLVM_SUPPORTED_TARGET_AVR=1 -DLDC_LLVM_SUPPORTED_TARGET_BPF=1 -DLDC_LLVM_SUPPORTED_TARGET_Hexagon=1 -DLDC_LLVM_SUPPORTED_TARGET_Lanai=1 -DLDC_LLVM_SUPPORTED_TARGET_MSP430=1 -DLDC_LLVM_SUPPORTED_TARGET_Mips=1 -DLDC_LLVM_SUPPORTED_TARGET_NVPTX=1 -DLDC_LLVM_SUPPORTED_TARGET_PowerPC=1 -DLDC_LLVM_SUPPORTED_TARGET_RISCV=1 -DLDC_LLVM_SUPPORTED_TARGET_SPIRV=1 -DLDC_LLVM_SUPPORTED_TARGET_Sparc=1 -DLDC_LLVM_SUPPORTED_TARGET_SystemZ=1 -DLDC_LLVM_SUPPORTED_TARGET_VE=1 -DLDC_LLVM_SUPPORTED_TARGET_WebAssembly=1 -DLDC_LLVM_SUPPORTED_TARGET_X86=1 -DLDC_LLVM_SUPPORTED_TARGET_XCore=1 -I/tmp/B.eu7gwbpr/BUILD/ldc-1.29.0-src/. -I/tmp/B.eu7gwbpr/BUILD/ldc-1.29.0-src/dmd -DDMDV2 -O2 -fwrapv -pipe -Wformat -Werror=format-security -gdwarf-4 -fno-debug-types-section -fvar-tracking-assignments -g2 -Wp,-D_FORTIFY_SOURCE=2 -fstack-protector-strong --param=ssp-buffer-size=4 -Werror=trampolines -fPIC -march=x86-64 -mtune=generic -gdwarf-4 -fno-debug-types-section -fvar-tracking-assignments -g2  -DNDEBUG -DQT_NO_DEBUG -I/usr/include -std=c++14   -fno-exceptions -D_GNU_SOURCE -D__STDC_CONSTANT_MACROS -D__STDC_FORMAT_MACROS -D__STDC_LIMIT_MACROS -fno-rtti  -Wall -Wextra -Wno-unused-parameter -Wno-comment -Wno-missing-field-initializers -Wno-non-virtual-dtor -Wno-pedantic -fvisibility-inlines-hidden -DLDC_POSIX  -DIN_LLVM -DOPAQUE_VTBLS "-DLDC_INSTALL_PREFIX=R\"(/usr)\"" -DLDC_LLVM_VER=1500 "-DLDC_LIBDIR_SUFFIX=R\"(64)\"" -DLDC_HOST_LDMD=1 -DLDC_HOST_FE_VER=2097 "-DLDC_LLVM_LIBDIR=R\"(/usr/lib64)\""  -DNDEBUG -MD -MT CMakeFiles/LDCShared.dir/gen/logger.cpp.o -MF CMakeFiles/LDCShared.dir/gen/logger.cpp.o.d -o CMakeFiles/LDCShared.dir/gen/logger.cpp.o -c /tmp/B.eu7gwbpr/BUILD/ldc-1.29.0-src/gen/logger.cpp
[ 18%] Building CXX object CMakeFiles/LDCShared.dir/gen/mangling.cpp.o
/usr/bin/x86_64-pld-linux-g++ -DLDC_ENABLE_PLUGINS -DLDC_LLVM_SUPPORTED_TARGET_AArch64=1 -DLDC_LLVM_SUPPORTED_TARGET_AMDGPU=1 -DLDC_LLVM_SUPPORTED_TARGET_ARM=1 -DLDC_LLVM_SUPPORTED_TARGET_AVR=1 -DLDC_LLVM_SUPPORTED_TARGET_BPF=1 -DLDC_LLVM_SUPPORTED_TARGET_Hexagon=1 -DLDC_LLVM_SUPPORTED_TARGET_Lanai=1 -DLDC_LLVM_SUPPORTED_TARGET_MSP430=1 -DLDC_LLVM_SUPPORTED_TARGET_Mips=1 -DLDC_LLVM_SUPPORTED_TARGET_NVPTX=1 -DLDC_LLVM_SUPPORTED_TARGET_PowerPC=1 -DLDC_LLVM_SUPPORTED_TARGET_RISCV=1 -DLDC_LLVM_SUPPORTED_TARGET_SPIRV=1 -DLDC_LLVM_SUPPORTED_TARGET_Sparc=1 -DLDC_LLVM_SUPPORTED_TARGET_SystemZ=1 -DLDC_LLVM_SUPPORTED_TARGET_VE=1 -DLDC_LLVM_SUPPORTED_TARGET_WebAssembly=1 -DLDC_LLVM_SUPPORTED_TARGET_X86=1 -DLDC_LLVM_SUPPORTED_TARGET_XCore=1 -I/tmp/B.eu7gwbpr/BUILD/ldc-1.29.0-src/. -I/tmp/B.eu7gwbpr/BUILD/ldc-1.29.0-src/dmd -DDMDV2 -O2 -fwrapv -pipe -Wformat -Werror=format-security -gdwarf-4 -fno-debug-types-section -fvar-tracking-assignments -g2 -Wp,-D_FORTIFY_SOURCE=2 -fstack-protector-strong --param=ssp-buffer-size=4 -Werror=trampolines -fPIC -march=x86-64 -mtune=generic -gdwarf-4 -fno-debug-types-section -fvar-tracking-assignments -g2  -DNDEBUG -DQT_NO_DEBUG -I/usr/include -std=c++14   -fno-exceptions -D_GNU_SOURCE -D__STDC_CONSTANT_MACROS -D__STDC_FORMAT_MACROS -D__STDC_LIMIT_MACROS -fno-rtti  -Wall -Wextra -Wno-unused-parameter -Wno-comment -Wno-missing-field-initializers -Wno-non-virtual-dtor -Wno-pedantic -fvisibility-inlines-hidden -DLDC_POSIX  -DIN_LLVM -DOPAQUE_VTBLS "-DLDC_INSTALL_PREFIX=R\"(/usr)\"" -DLDC_LLVM_VER=1500 "-DLDC_LIBDIR_SUFFIX=R\"(64)\"" -DLDC_HOST_LDMD=1 -DLDC_HOST_FE_VER=2097 "-DLDC_LLVM_LIBDIR=R\"(/usr/lib64)\""  -DNDEBUG -MD -MT CMakeFiles/LDCShared.dir/gen/mangling.cpp.o -MF CMakeFiles/LDCShared.dir/gen/mangling.cpp.o.d -o CMakeFiles/LDCShared.dir/gen/mangling.cpp.o -c /tmp/B.eu7gwbpr/BUILD/ldc-1.29.0-src/gen/mangling.cpp
[ 18%] Building CXX object CMakeFiles/LDCShared.dir/gen/moduleinfo.cpp.o
/usr/bin/x86_64-pld-linux-g++ -DLDC_ENABLE_PLUGINS -DLDC_LLVM_SUPPORTED_TARGET_AArch64=1 -DLDC_LLVM_SUPPORTED_TARGET_AMDGPU=1 -DLDC_LLVM_SUPPORTED_TARGET_ARM=1 -DLDC_LLVM_SUPPORTED_TARGET_AVR=1 -DLDC_LLVM_SUPPORTED_TARGET_BPF=1 -DLDC_LLVM_SUPPORTED_TARGET_Hexagon=1 -DLDC_LLVM_SUPPORTED_TARGET_Lanai=1 -DLDC_LLVM_SUPPORTED_TARGET_MSP430=1 -DLDC_LLVM_SUPPORTED_TARGET_Mips=1 -DLDC_LLVM_SUPPORTED_TARGET_NVPTX=1 -DLDC_LLVM_SUPPORTED_TARGET_PowerPC=1 -DLDC_LLVM_SUPPORTED_TARGET_RISCV=1 -DLDC_LLVM_SUPPORTED_TARGET_SPIRV=1 -DLDC_LLVM_SUPPORTED_TARGET_Sparc=1 -DLDC_LLVM_SUPPORTED_TARGET_SystemZ=1 -DLDC_LLVM_SUPPORTED_TARGET_VE=1 -DLDC_LLVM_SUPPORTED_TARGET_WebAssembly=1 -DLDC_LLVM_SUPPORTED_TARGET_X86=1 -DLDC_LLVM_SUPPORTED_TARGET_XCore=1 -I/tmp/B.eu7gwbpr/BUILD/ldc-1.29.0-src/. -I/tmp/B.eu7gwbpr/BUILD/ldc-1.29.0-src/dmd -DDMDV2 -O2 -fwrapv -pipe -Wformat -Werror=format-security -gdwarf-4 -fno-debug-types-section -fvar-tracking-assignments -g2 -Wp,-D_FORTIFY_SOURCE=2 -fstack-protector-strong --param=ssp-buffer-size=4 -Werror=trampolines -fPIC -march=x86-64 -mtune=generic -gdwarf-4 -fno-debug-types-section -fvar-tracking-assignments -g2  -DNDEBUG -DQT_NO_DEBUG -I/usr/include -std=c++14   -fno-exceptions -D_GNU_SOURCE -D__STDC_CONSTANT_MACROS -D__STDC_FORMAT_MACROS -D__STDC_LIMIT_MACROS -fno-rtti  -Wall -Wextra -Wno-unused-parameter -Wno-comment -Wno-missing-field-initializers -Wno-non-virtual-dtor -Wno-pedantic -fvisibility-inlines-hidden -DLDC_POSIX  -DIN_LLVM -DOPAQUE_VTBLS "-DLDC_INSTALL_PREFIX=R\"(/usr)\"" -DLDC_LLVM_VER=1500 "-DLDC_LIBDIR_SUFFIX=R\"(64)\"" -DLDC_HOST_LDMD=1 -DLDC_HOST_FE_VER=2097 "-DLDC_LLVM_LIBDIR=R\"(/usr/lib64)\""  -DNDEBUG -MD -MT CMakeFiles/LDCShared.dir/gen/moduleinfo.cpp.o -MF CMakeFiles/LDCShared.dir/gen/moduleinfo.cpp.o.d -o CMakeFiles/LDCShared.dir/gen/moduleinfo.cpp.o -c /tmp/B.eu7gwbpr/BUILD/ldc-1.29.0-src/gen/moduleinfo.cpp
[ 18%] Building CXX object CMakeFiles/LDCShared.dir/gen/modules.cpp.o
/usr/bin/x86_64-pld-linux-g++ -DLDC_ENABLE_PLUGINS -DLDC_LLVM_SUPPORTED_TARGET_AArch64=1 -DLDC_LLVM_SUPPORTED_TARGET_AMDGPU=1 -DLDC_LLVM_SUPPORTED_TARGET_ARM=1 -DLDC_LLVM_SUPPORTED_TARGET_AVR=1 -DLDC_LLVM_SUPPORTED_TARGET_BPF=1 -DLDC_LLVM_SUPPORTED_TARGET_Hexagon=1 -DLDC_LLVM_SUPPORTED_TARGET_Lanai=1 -DLDC_LLVM_SUPPORTED_TARGET_MSP430=1 -DLDC_LLVM_SUPPORTED_TARGET_Mips=1 -DLDC_LLVM_SUPPORTED_TARGET_NVPTX=1 -DLDC_LLVM_SUPPORTED_TARGET_PowerPC=1 -DLDC_LLVM_SUPPORTED_TARGET_RISCV=1 -DLDC_LLVM_SUPPORTED_TARGET_SPIRV=1 -DLDC_LLVM_SUPPORTED_TARGET_Sparc=1 -DLDC_LLVM_SUPPORTED_TARGET_SystemZ=1 -DLDC_LLVM_SUPPORTED_TARGET_VE=1 -DLDC_LLVM_SUPPORTED_TARGET_WebAssembly=1 -DLDC_LLVM_SUPPORTED_TARGET_X86=1 -DLDC_LLVM_SUPPORTED_TARGET_XCore=1 -I/tmp/B.eu7gwbpr/BUILD/ldc-1.29.0-src/. -I/tmp/B.eu7gwbpr/BUILD/ldc-1.29.0-src/dmd -DDMDV2 -O2 -fwrapv -pipe -Wformat -Werror=format-security -gdwarf-4 -fno-debug-types-section -fvar-tracking-assignments -g2 -Wp,-D_FORTIFY_SOURCE=2 -fstack-protector-strong --param=ssp-buffer-size=4 -Werror=trampolines -fPIC -march=x86-64 -mtune=generic -gdwarf-4 -fno-debug-types-section -fvar-tracking-assignments -g2  -DNDEBUG -DQT_NO_DEBUG -I/usr/include -std=c++14   -fno-exceptions -D_GNU_SOURCE -D__STDC_CONSTANT_MACROS -D__STDC_FORMAT_MACROS -D__STDC_LIMIT_MACROS -fno-rtti  -Wall -Wextra -Wno-unused-parameter -Wno-comment -Wno-missing-field-initializers -Wno-non-virtual-dtor -Wno-pedantic -fvisibility-inlines-hidden -DLDC_POSIX  -DIN_LLVM -DOPAQUE_VTBLS "-DLDC_INSTALL_PREFIX=R\"(/usr)\"" -DLDC_LLVM_VER=1500 "-DLDC_LIBDIR_SUFFIX=R\"(64)\"" -DLDC_HOST_LDMD=1 -DLDC_HOST_FE_VER=2097 "-DLDC_LLVM_LIBDIR=R\"(/usr/lib64)\""  -DNDEBUG -MD -MT CMakeFiles/LDCShared.dir/gen/modules.cpp.o -MF CMakeFiles/LDCShared.dir/gen/modules.cpp.o.d -o CMakeFiles/LDCShared.dir/gen/modules.cpp.o -c /tmp/B.eu7gwbpr/BUILD/ldc-1.29.0-src/gen/modules.cpp
[ 18%] Building CXX object CMakeFiles/LDCShared.dir/gen/ms-cxx-helper.cpp.o
/usr/bin/x86_64-pld-linux-g++ -DLDC_ENABLE_PLUGINS -DLDC_LLVM_SUPPORTED_TARGET_AArch64=1 -DLDC_LLVM_SUPPORTED_TARGET_AMDGPU=1 -DLDC_LLVM_SUPPORTED_TARGET_ARM=1 -DLDC_LLVM_SUPPORTED_TARGET_AVR=1 -DLDC_LLVM_SUPPORTED_TARGET_BPF=1 -DLDC_LLVM_SUPPORTED_TARGET_Hexagon=1 -DLDC_LLVM_SUPPORTED_TARGET_Lanai=1 -DLDC_LLVM_SUPPORTED_TARGET_MSP430=1 -DLDC_LLVM_SUPPORTED_TARGET_Mips=1 -DLDC_LLVM_SUPPORTED_TARGET_NVPTX=1 -DLDC_LLVM_SUPPORTED_TARGET_PowerPC=1 -DLDC_LLVM_SUPPORTED_TARGET_RISCV=1 -DLDC_LLVM_SUPPORTED_TARGET_SPIRV=1 -DLDC_LLVM_SUPPORTED_TARGET_Sparc=1 -DLDC_LLVM_SUPPORTED_TARGET_SystemZ=1 -DLDC_LLVM_SUPPORTED_TARGET_VE=1 -DLDC_LLVM_SUPPORTED_TARGET_WebAssembly=1 -DLDC_LLVM_SUPPORTED_TARGET_X86=1 -DLDC_LLVM_SUPPORTED_TARGET_XCore=1 -I/tmp/B.eu7gwbpr/BUILD/ldc-1.29.0-src/. -I/tmp/B.eu7gwbpr/BUILD/ldc-1.29.0-src/dmd -DDMDV2 -O2 -fwrapv -pipe -Wformat -Werror=format-security -gdwarf-4 -fno-debug-types-section -fvar-tracking-assignments -g2 -Wp,-D_FORTIFY_SOURCE=2 -fstack-protector-strong --param=ssp-buffer-size=4 -Werror=trampolines -fPIC -march=x86-64 -mtune=generic -gdwarf-4 -fno-debug-types-section -fvar-tracking-assignments -g2  -DNDEBUG -DQT_NO_DEBUG -I/usr/include -std=c++14   -fno-exceptions -D_GNU_SOURCE -D__STDC_CONSTANT_MACROS -D__STDC_FORMAT_MACROS -D__STDC_LIMIT_MACROS -fno-rtti  -Wall -Wextra -Wno-unused-parameter -Wno-comment -Wno-missing-field-initializers -Wno-non-virtual-dtor -Wno-pedantic -fvisibility-inlines-hidden -DLDC_POSIX  -DIN_LLVM -DOPAQUE_VTBLS "-DLDC_INSTALL_PREFIX=R\"(/usr)\"" -DLDC_LLVM_VER=1500 "-DLDC_LIBDIR_SUFFIX=R\"(64)\"" -DLDC_HOST_LDMD=1 -DLDC_HOST_FE_VER=2097 "-DLDC_LLVM_LIBDIR=R\"(/usr/lib64)\""  -DNDEBUG -MD -MT CMakeFiles/LDCShared.dir/gen/ms-cxx-helper.cpp.o -MF CMakeFiles/LDCShared.dir/gen/ms-cxx-helper.cpp.o.d -o CMakeFiles/LDCShared.dir/gen/ms-cxx-helper.cpp.o -c /tmp/B.eu7gwbpr/BUILD/ldc-1.29.0-src/gen/ms-cxx-helper.cpp
[ 18%] Building CXX object CMakeFiles/LDCShared.dir/gen/naked.cpp.o
/usr/bin/x86_64-pld-linux-g++ -DLDC_ENABLE_PLUGINS -DLDC_LLVM_SUPPORTED_TARGET_AArch64=1 -DLDC_LLVM_SUPPORTED_TARGET_AMDGPU=1 -DLDC_LLVM_SUPPORTED_TARGET_ARM=1 -DLDC_LLVM_SUPPORTED_TARGET_AVR=1 -DLDC_LLVM_SUPPORTED_TARGET_BPF=1 -DLDC_LLVM_SUPPORTED_TARGET_Hexagon=1 -DLDC_LLVM_SUPPORTED_TARGET_Lanai=1 -DLDC_LLVM_SUPPORTED_TARGET_MSP430=1 -DLDC_LLVM_SUPPORTED_TARGET_Mips=1 -DLDC_LLVM_SUPPORTED_TARGET_NVPTX=1 -DLDC_LLVM_SUPPORTED_TARGET_PowerPC=1 -DLDC_LLVM_SUPPORTED_TARGET_RISCV=1 -DLDC_LLVM_SUPPORTED_TARGET_SPIRV=1 -DLDC_LLVM_SUPPORTED_TARGET_Sparc=1 -DLDC_LLVM_SUPPORTED_TARGET_SystemZ=1 -DLDC_LLVM_SUPPORTED_TARGET_VE=1 -DLDC_LLVM_SUPPORTED_TARGET_WebAssembly=1 -DLDC_LLVM_SUPPORTED_TARGET_X86=1 -DLDC_LLVM_SUPPORTED_TARGET_XCore=1 -I/tmp/B.eu7gwbpr/BUILD/ldc-1.29.0-src/. -I/tmp/B.eu7gwbpr/BUILD/ldc-1.29.0-src/dmd -DDMDV2 -O2 -fwrapv -pipe -Wformat -Werror=format-security -gdwarf-4 -fno-debug-types-section -fvar-tracking-assignments -g2 -Wp,-D_FORTIFY_SOURCE=2 -fstack-protector-strong --param=ssp-buffer-size=4 -Werror=trampolines -fPIC -march=x86-64 -mtune=generic -gdwarf-4 -fno-debug-types-section -fvar-tracking-assignments -g2  -DNDEBUG -DQT_NO_DEBUG -I/usr/include -std=c++14   -fno-exceptions -D_GNU_SOURCE -D__STDC_CONSTANT_MACROS -D__STDC_FORMAT_MACROS -D__STDC_LIMIT_MACROS -fno-rtti  -Wall -Wextra -Wno-unused-parameter -Wno-comment -Wno-missing-field-initializers -Wno-non-virtual-dtor -Wno-pedantic -fvisibility-inlines-hidden -DLDC_POSIX  -DIN_LLVM -DOPAQUE_VTBLS "-DLDC_INSTALL_PREFIX=R\"(/usr)\"" -DLDC_LLVM_VER=1500 "-DLDC_LIBDIR_SUFFIX=R\"(64)\"" -DLDC_HOST_LDMD=1 -DLDC_HOST_FE_VER=2097 "-DLDC_LLVM_LIBDIR=R\"(/usr/lib64)\""  -DNDEBUG -MD -MT CMakeFiles/LDCShared.dir/gen/naked.cpp.o -MF CMakeFiles/LDCShared.dir/gen/naked.cpp.o.d -o CMakeFiles/LDCShared.dir/gen/naked.cpp.o -c /tmp/B.eu7gwbpr/BUILD/ldc-1.29.0-src/gen/naked.cpp
/tmp/B.eu7gwbpr/BUILD/ldc-1.29.0-src/gen/naked.cpp: In function 'llvm::CallInst* DtoInlineAsmExpr(const Loc&, llvm::StringRef, llvm::StringRef, llvm::ArrayRef<llvm::Value*>, llvm::Type*)':
/tmp/B.eu7gwbpr/BUILD/ldc-1.29.0-src/gen/naked.cpp:474:25: error: 'Verify' is not a member of 'llvm::InlineAsm'
  474 |   if (!llvm::InlineAsm::Verify(FT, constraints)) {
      |                         ^~~~~~
gmake[2]: *** [CMakeFiles/LDCShared.dir/build.make:681: CMakeFiles/LDCShared.dir/gen/naked.cpp.o] Error 1
gmake[2]: Leaving directory '/tmp/B.eu7gwbpr/BUILD/ldc-1.29.0-src/build-bootstrap2/build'
gmake[1]: *** [CMakeFiles/Makefile2:203: CMakeFiles/LDCShared.dir/all] Error 2
gmake[1]: Leaving directory '/tmp/B.eu7gwbpr/BUILD/ldc-1.29.0-src/build-bootstrap2/build'
gmake: *** [Makefile:169: all] Error 2
error: Bad exit status from /tmp/B.eu7gwbpr/BUILD/tmp/rpm-tmp.FKoiBi (%build)

RPM build warnings:
    Could not canonicalize hostname: ymir

RPM build errors:
    Bad exit status from /tmp/B.eu7gwbpr/BUILD/tmp/rpm-tmp.FKoiBi (%build)
ended at: Sat Oct 29 09:44:29 2022, done in 0:04:25.673514
error: No files produced.
+ chmod -R u+rwX /tmp/B.eu7gwbpr/BUILD
+ rm -rf /tmp/B.eu7gwbpr/tmp /tmp/B.eu7gwbpr/BUILD
+ rm -rf /tmp/B.eu7gwbpr
Begin-PLD-Builder-Info
Build-Time: user:249.33s sys:27.33s real:273.14s (faults io:126 non-io:5102524)

End-PLD-Builder-Info
[Back to list of logs] [View rpm -qa of builder]