FailedOk

th/SRPMS[OK]
th/x32[OK]
th/i686[OK]
th/x86_64[OK]

ac/SRPMS[OK]
ac/i386[OK]
ac/i586[OK]
ac/i686[OK]
ac/alpha[OK]
ac/amd64[OK]
ac/athlon[OK]
ac/ppc[OK]
ac/sparc[OK]
ac/sparc64[OK]

Advanced Search
main()
Powered by PLD Linux
(c) 2002-2023 PLD Team
$Revision: 1.37 $
Powered by Multics.
Your IP: 3.214.216.26

ldc 49483748-07a1-40a7-846a-159afd92cd97

Status:Failed
Source URL:https://buildlogs.pld-linux.org/pld/th/x86_64/FAIL/ldc,49483748-07a1-40a7-846a-159afd92cd97.bz2
text/plain URL:View!
rpm -qa of builder:View!
Date:2022/10/18 06:56:36
Runtime:0:04:21.052048

Toc:

  • prep
  • Executing(%prep): /bin/sh -e /tmp/B.6h_5p9b1/BUILD/tmp/rpm-tmp.lmML4v
  • build
  • Executing(%build): /bin/sh -e /tmp/B.6h_5p9b1/BUILD/tmp/rpm-tmp.NFov94
  • error 1
  • /tmp/B.6h_5p9b1/BUILD/ldc-1.29.0-src/gen/naked.cpp:474:25: error: 'Verify' is not a member of 'llvm::InlineAsm'
  • error 2
  • gmake[2]: *** [CMakeFiles/LDCShared.dir/build.make:681: CMakeFiles/LDCShared.dir/gen/naked.cpp.o] Error 1
  • error 3
  • gmake[1]: *** [CMakeFiles/Makefile2:203: CMakeFiles/LDCShared.dir/all] Error 2
  • error 4
  • error: Bad exit status from /tmp/B.6h_5p9b1/BUILD/tmp/rpm-tmp.NFov94 (%build)
  • error 5
  • RPM build errors:
  • error 6
  • error: No files produced.

Content:

request from: atler
checking if we should skip the build
started at: Tue Oct 18 06:52:06 2022
killing old processes on a builder
sending signal 9 to pid -1
cleaning up /tmp
fetching https://srcbuilder.pld-linux.org/th//srpms/49483748-07a1-40a7-846a-159afd92cd97/ldc-1.29.0-1.src.rpm
fetched 65341149 bytes, 11913.2 K/s
installing srpm: ldc-1.29.0-1.src.rpm
+ install -d /tmp/B.6h_5p9b1/BUILD /tmp/B.6h_5p9b1/RPMS
+ LC_ALL=en_US.UTF-8
+ rpm -qp --changelog ldc-1.29.0-1.src.rpm
* Tue Oct 18 2022 PLD Linux Team <feedback@pld-linux.org>
- For complete changelog see: http://git.pld-linux.org/?p=packages/ldc.git;a=log;h=master
* Thu Jun 02 2022 Jan Palus <atler@pld-linux.org> 093633b
- BRs for tar.xz source * Thu Jun 02 2022 Jan Palus <atler@pld-linux.org> 01dad94
- rpm version for noarch subpackage * Thu Jun 02 2022 Jan Palus <atler@pld-linux.org> 869f7ad
- up to 1.29.0 * Tue Nov 09 2021 Jan Palus <atler@pld-linux.org> 11f0857
- disable lld support; rel 2 * Tue Nov 09 2021 Jan Palus <atler@pld-linux.org> be32e7f
- up to 1.28.0 * Wed Aug 11 2021 Elan Ruusamäe <glen@pld-linux.org> beb01bd
- New, version 1.27.1 + rpm -Uhv --nodeps --define '_topdir /tmp/B.6h_5p9b1' --define '_specdir %{_topdir}' --define '_sourcedir %{_specdir}' --define '_rpmdir %{_topdir}/RPMS' --define '_builddir %{_topdir}/BUILD' --with bootstrap ldc-1.29.0-1.src.rpm Updating / installing... ldc-1.29.0-1 ######################################## + rm -f ldc-1.29.0-1.src.rpm + install -m 700 -d /tmp/B.6h_5p9b1/BUILD/tmp + TMPDIR=/tmp/B.6h_5p9b1/BUILD/tmp + exec nice -n 0 rpmbuild -bp --short-circuit --nodeps --define '_topdir /tmp/B.6h_5p9b1' --define '_specdir %{_topdir}' --define '_sourcedir %{_specdir}' --define '_rpmdir %{_topdir}/RPMS' --define '_builddir %{_topdir}/BUILD' --with bootstrap --target x86_64-pld-linux --define 'prep exit 0' /tmp/B.6h_5p9b1/ldc.spec warning: Could not canonicalize hostname: ymir Building target platforms: x86_64-pld-linux Building for target x86_64-pld-linux RPM build warnings: Could not canonicalize hostname: ymir checking BuildConflict-ing packages rpm: warning: Could not canonicalize hostname: ymir rpm: Building target platforms: x86_64-pld-linux rpm: Building for target x86_64-pld-linux rpm: rpm: RPM build warnings: rpm: Could not canonicalize hostname: ymir no BuildConflicts found checking BR rpm: warning: Could not canonicalize hostname: ymir rpm: Building target platforms: x86_64-pld-linux rpm: Building for target x86_64-pld-linux rpm: rpm: RPM build warnings: rpm: Could not canonicalize hostname: ymir no BR needed building RPM using: set -ex; : build-id: 49483748-07a1-40a7-846a-159afd92cd97; TMPDIR=/tmp/B.6h_5p9b1/BUILD/tmp exec nice -n 0 rpmbuild -bb --define '__jobs 28' --define '_smp_mflags -j28' --define '_make_opts -Otarget' --define '_pld_builder 1' --define '_topdir /tmp/B.6h_5p9b1' --define '_specdir %{_topdir}' --define '_sourcedir %{_specdir}' --define '_rpmdir %{_topdir}/RPMS' --define '_builddir %{_topdir}/BUILD' --with bootstrap --target x86_64-pld-linux /tmp/B.6h_5p9b1/ldc.spec + : build-id: 49483748-07a1-40a7-846a-159afd92cd97 + TMPDIR=/tmp/B.6h_5p9b1/BUILD/tmp + exec nice -n 0 rpmbuild -bb --define '__jobs 28' --define '_smp_mflags -j28' --define '_make_opts -Otarget' --define '_pld_builder 1' --define '_topdir /tmp/B.6h_5p9b1' --define '_specdir %{_topdir}' --define '_sourcedir %{_specdir}' --define '_rpmdir %{_topdir}/RPMS' --define '_builddir %{_topdir}/BUILD' --with bootstrap --target x86_64-pld-linux /tmp/B.6h_5p9b1/ldc.spec warning: Could not canonicalize hostname: ymir Building target platforms: x86_64-pld-linux Building for target x86_64-pld-linux Executing(%prep): /bin/sh -e /tmp/B.6h_5p9b1/BUILD/tmp/rpm-tmp.lmML4v + umask 022 + cd /tmp/B.6h_5p9b1/BUILD + cd /tmp/B.6h_5p9b1/BUILD + rm -rf ldc-1.29.0-src + /bin/gzip -dc /tmp/B.6h_5p9b1/ldc-1.29.0-src.tar.gz + /bin/tar -xof - + STATUS=0 + '[' 0 -ne 0 ']' + cd ldc-1.29.0-src + /bin/chmod -Rf a+rX,u+w,g-w,o-w . + echo 'Patch #0 (ldc-include-path.patch):' Patch #0 (ldc-include-path.patch): + </tmp/B.6h_5p9b1/ldc-include-path.patch + /usr/bin/patch -s -f -p1 '--fuzz=0' + echo 'Patch #1 (ldc-no-default-rpath.patch):' Patch #1 (ldc-no-default-rpath.patch): + </tmp/B.6h_5p9b1/ldc-no-default-rpath.patch + /usr/bin/patch -s -f -p1 '--fuzz=0' + install -d geany_config + set -- CHANGELOG.md CMakeCPack.cmake CMakeLists.txt Doxyfile LICENSE README.md azure-pipelines.yml bitrise.yml cmake dmd docs driver geany_config gen ir ldc2.conf.in ldc2_install.conf.in ldc2_phobos.conf.in packaging runtime tests tools utils + install -d build-bootstrap2 + cp -al CHANGELOG.md CMakeCPack.cmake CMakeLists.txt Doxyfile LICENSE README.md azure-pipelines.yml bitrise.yml cmake dmd docs driver geany_config gen ir ldc2.conf.in ldc2_install.conf.in ldc2_phobos.conf.in packaging runtime tests tools utils build-bootstrap2 + tar xf /tmp/B.6h_5p9b1/ldc2-1.27.1-linux-x86_64.tar.xz + mv ldc2-1.27.1-linux-x86_64 build-bootstrap1 + RPM_EC=0 + jobs -p + exit 0 Executing(%build): /bin/sh -e /tmp/B.6h_5p9b1/BUILD/tmp/rpm-tmp.NFov94 TMP=/home/users/builder/tmp HOME=/home/users/builder PATH=/home/users/builder/GNUstep/Tools:/bin:/usr/bin:/usr/local/bin:/home/users/builder/bin TMPDIR=/tmp/B.6h_5p9b1/BUILD/tmp + umask 022 + cd /tmp/B.6h_5p9b1/BUILD + cd ldc-1.29.0-src + cd build-bootstrap2 + pwd + CC=x86_64-pld-linux-gcc CXX=x86_64-pld-linux-g++ CPPFLAGS='' /usr/bin/cmake '-DCMAKE_VERBOSE_MAKEFILE:BOOL=ON' '-DCMAKE_BUILD_TYPE=PLD' '-DCMAKE_INSTALL_BINDIR:PATH=/usr/bin' '-DCMAKE_INSTALL_SBINDIR:PATH=/usr/sbin' '-DCMAKE_INSTALL_LIBEXECDIR:PATH=/usr/libexec' '-DCMAKE_INSTALL_SYSCONFDIR:PATH=/etc' '-DCMAKE_INSTALL_SHAREDSTATEDIRPATH:PATH=/var/lib' '-DCMAKE_INSTALL_LOCALSTATEDIRPATH:PATH=/var' '-DCMAKE_INSTALL_LIBDIR:PATH=/usr/lib64' '-DCMAKE_INSTALL_INCLUDEDIR:PATH=/usr/include' '-DCMAKE_INSTALL_OLDINCLUDEDIR:PATH=/usr/include' '-DCMAKE_INSTALL_DATAROOTDIR:PATH=/usr/share' '-DCMAKE_INSTALL_DATADIR:PATH=/usr/share' '-DCMAKE_INSTALL_INFODIR:PATH=/usr/share/info' '-DCMAKE_INSTALL_LOCALEDIR:PATH=/usr/share/locale' '-DCMAKE_INSTALL_MANDIR:PATH=/usr/share/man' '-DCMAKE_INSTALL_DOCDIR:PATH=/usr/share/doc' '-DCMAKE_INSTALL_PREFIX:PATH=/usr' '-DSYSCONF_INSTALL_DIR:PATH=/etc' '-DCMAKE_CXX_FLAGS_PLD=-O2 -fwrapv -pipe -Wformat -Werror=format-security -gdwarf-4 -fno-debug-types-section -fvar-tracking-assignments -g2 -Wp,-D_FORTIFY_SOURCE=2 -fstack-protector-strong --param=ssp-buffer-size=4 -Werror=trampolines -fPIC -march=x86-64 -mtune=generic -gdwarf-4 -fno-debug-types-section -fvar-tracking-assignments -g2 -DNDEBUG -DQT_NO_DEBUG' '-DCMAKE_C_FLAGS_PLD=-O2 -fwrapv -pipe -Wformat -Werror=format-security -gdwarf-4 -fno-debug-types-section -fvar-tracking-assignments -g2 -Wp,-D_FORTIFY_SOURCE=2 -fstack-protector-strong --param=ssp-buffer-size=4 -Werror=trampolines -fPIC -march=x86-64 -mtune=generic -gdwarf-4 -fno-debug-types-section -fvar-tracking-assignments -g2 -DNDEBUG -DQT_NO_DEBUG' '-DCMAKE_Fortran_FLAGS_PLD=-O2 -fwrapv -pipe -Wformat -Werror=format-security -gdwarf-4 -fno-debug-types-section -fvar-tracking-assignments -g2 -Wp,-D_FORTIFY_SOURCE=2 -fstack-protector-strong --param=ssp-buffer-size=4 -Werror=trampolines -fPIC -march=x86-64 -mtune=generic -gdwarf-4 -fno-debug-types-section -fvar-tracking-assignments -g2 -DNDEBUG -DQT_NO_DEBUG' '-DCMAKE_EXE_LINKER_FLAGS_PLD=-Wl,--as-needed -Wl,--no-copy-dt-needed-entries -Wl,-z,relro -Wl,-z,combreloc ' '-DCMAKE_SHARED_LINKER_FLAGS_PLD=-Wl,--as-needed -Wl,--no-copy-dt-needed-entries -Wl,-z,relro -Wl,-z,combreloc ' '-DCMAKE_MODULE_LINKER_FLAGS_PLD=-Wl,--as-needed -Wl,--no-copy-dt-needed-entries -Wl,-z,relro -Wl,-z,combreloc ' '-DLIB_SUFFIX=64' '-DBUILD_SHARED_LIBS:BOOL=ON' -S .. -B build '-DD_COMPILER:PATH=/tmp/B.6h_5p9b1/BUILD/ldc-1.29.0-src/build-bootstrap2/../build-bootstrap1/bin/ldmd2' '-DLDC_WITH_LLD:BOOL=OFF' -- The C compiler identification is GNU 12.2.0 -- The CXX compiler identification is GNU 12.2.0 -- Detecting C compiler ABI info -- Detecting C compiler ABI info - done -- Check for working C compiler: /usr/bin/x86_64-pld-linux-gcc - skipped -- Detecting C compile features -- Detecting C compile features - done -- Detecting CXX compiler ABI info -- Detecting CXX compiler ABI info - done -- Check for working CXX compiler: /usr/bin/x86_64-pld-linux-g++ - skipped -- Detecting CXX compile features -- Detecting CXX compile features - done -- Found host D compiler /tmp/B.6h_5p9b1/BUILD/ldc-1.29.0-src/build-bootstrap1/bin/ldmd2, with default flags '' -- Host D compiler ID: LDMD -- Host D compiler version: LDC - the LLVM D compiler (1.27.1) -- Host D compiler front-end version: 2097 -- LLVM_NATIVE_ARCH: X86 -- Found LLVM: /usr (found suitable version "15.0.2", minimum required is "6.0") -- -- Building LDC with SPIR-V support -- Performing Test SUPPORTS_FVISIBILITY_INLINES_HIDDEN_FLAG -- Performing Test SUPPORTS_FVISIBILITY_INLINES_HIDDEN_FLAG - Success -- LDC version identifier: 1.29.0 -- -- Building LDC with dynamic compilation support (LDC_DYNAMIC_COMPILE): OFF -- -- Building LDC with integrated LLD linker (LDC_WITH_LLD): OFF -- -- Building LDC with enabled assertions (LDC_ENABLE_ASSERTIONS): OFF -- -- Building LDC with plugin support (LDC_ENABLE_PLUGINS): ON -- Host D compiler linker program: /usr/bin/x86_64-pld-linux-gcc -- Host D compiler linker flags: -fuse-ld=gold;-L/tmp/B.6h_5p9b1/BUILD/ldc-1.29.0-src/build-bootstrap1/bin/../lib;-lphobos2-ldc;-ldruntime-ldc;-Wl,--gc-sections;-lrt;-ldl;-lpthread;-lm;-m64 -- -- Including LTO linker plugin (LDC_INSTALL_LTOPLUGIN): OFF -- -- Including LLVM compiler-rt libraries (LDC_INSTALL_LLVM_RUNTIME_LIBS): OFF -- Using path for Intrinsics.td: /usr/include -- Skip building FileCheck (source not found), assuming it can be found in LLVM bin directory -- The ASM compiler identification is GNU -- Found assembler: /usr/bin/x86_64-pld-linux-gcc -- -- LDC runtime configuration: -- -- - Building 32/64-bit libraries (MULTILIB): OFF -- -- - Building shared libraries (BUILD_SHARED_LIBS): ON -- -- - Building LTO libraries (BUILD_LTO_LIBS): OFF -- Looking for unistd.h -- Looking for unistd.h - found -- GDB 12.1 detected -- Configuring done -- Generating done CMake Warning: Manually-specified variables were not used by the project: CMAKE_Fortran_FLAGS_PLD CMAKE_INSTALL_BINDIR CMAKE_INSTALL_DATADIR CMAKE_INSTALL_DATAROOTDIR CMAKE_INSTALL_DOCDIR CMAKE_INSTALL_INCLUDEDIR CMAKE_INSTALL_INFODIR CMAKE_INSTALL_LIBEXECDIR CMAKE_INSTALL_LOCALEDIR CMAKE_INSTALL_LOCALSTATEDIRPATH CMAKE_INSTALL_MANDIR CMAKE_INSTALL_OLDINCLUDEDIR CMAKE_INSTALL_SBINDIR CMAKE_INSTALL_SHAREDSTATEDIRPATH CMAKE_INSTALL_SYSCONFDIR -- Build files have been written to: /tmp/B.6h_5p9b1/BUILD/ldc-1.29.0-src/build-bootstrap2/build + /usr/bin/cmake --build build /usr/bin/cmake -S/tmp/B.6h_5p9b1/BUILD/ldc-1.29.0-src -B/tmp/B.6h_5p9b1/BUILD/ldc-1.29.0-src/build-bootstrap2/build --check-build-system CMakeFiles/Makefile.cmake 0 /usr/bin/cmake -E cmake_progress_start /tmp/B.6h_5p9b1/BUILD/ldc-1.29.0-src/build-bootstrap2/build/CMakeFiles /tmp/B.6h_5p9b1/BUILD/ldc-1.29.0-src/build-bootstrap2/build//CMakeFiles/progress.marks /usr/bin/gmake -f CMakeFiles/Makefile2 all gmake[1]: Entering directory '/tmp/B.6h_5p9b1/BUILD/ldc-1.29.0-src/build-bootstrap2/build' /usr/bin/gmake -f CMakeFiles/LDCShared.dir/build.make CMakeFiles/LDCShared.dir/depend gmake[2]: Entering directory '/tmp/B.6h_5p9b1/BUILD/ldc-1.29.0-src/build-bootstrap2/build' cd /tmp/B.6h_5p9b1/BUILD/ldc-1.29.0-src/build-bootstrap2/build && /usr/bin/cmake -E cmake_depends "Unix Makefiles" /tmp/B.6h_5p9b1/BUILD/ldc-1.29.0-src /tmp/B.6h_5p9b1/BUILD/ldc-1.29.0-src /tmp/B.6h_5p9b1/BUILD/ldc-1.29.0-src/build-bootstrap2/build /tmp/B.6h_5p9b1/BUILD/ldc-1.29.0-src/build-bootstrap2/build /tmp/B.6h_5p9b1/BUILD/ldc-1.29.0-src/build-bootstrap2/build/CMakeFiles/LDCShared.dir/DependInfo.cmake --color= gmake[2]: Leaving directory '/tmp/B.6h_5p9b1/BUILD/ldc-1.29.0-src/build-bootstrap2/build' /usr/bin/gmake -f CMakeFiles/LDCShared.dir/build.make CMakeFiles/LDCShared.dir/build gmake[2]: Entering directory '/tmp/B.6h_5p9b1/BUILD/ldc-1.29.0-src/build-bootstrap2/build' [ 0%] Building CXX object CMakeFiles/LDCShared.dir/gen/aa.cpp.o /usr/bin/x86_64-pld-linux-g++ -DLDC_ENABLE_PLUGINS -DLDC_LLVM_SUPPORTED_TARGET_AArch64=1 -DLDC_LLVM_SUPPORTED_TARGET_AMDGPU=1 -DLDC_LLVM_SUPPORTED_TARGET_ARM=1 -DLDC_LLVM_SUPPORTED_TARGET_AVR=1 -DLDC_LLVM_SUPPORTED_TARGET_BPF=1 -DLDC_LLVM_SUPPORTED_TARGET_Hexagon=1 -DLDC_LLVM_SUPPORTED_TARGET_Lanai=1 -DLDC_LLVM_SUPPORTED_TARGET_MSP430=1 -DLDC_LLVM_SUPPORTED_TARGET_Mips=1 -DLDC_LLVM_SUPPORTED_TARGET_NVPTX=1 -DLDC_LLVM_SUPPORTED_TARGET_PowerPC=1 -DLDC_LLVM_SUPPORTED_TARGET_RISCV=1 -DLDC_LLVM_SUPPORTED_TARGET_SPIRV=1 -DLDC_LLVM_SUPPORTED_TARGET_Sparc=1 -DLDC_LLVM_SUPPORTED_TARGET_SystemZ=1 -DLDC_LLVM_SUPPORTED_TARGET_VE=1 -DLDC_LLVM_SUPPORTED_TARGET_WebAssembly=1 -DLDC_LLVM_SUPPORTED_TARGET_X86=1 -DLDC_LLVM_SUPPORTED_TARGET_XCore=1 -I/tmp/B.6h_5p9b1/BUILD/ldc-1.29.0-src/. -I/tmp/B.6h_5p9b1/BUILD/ldc-1.29.0-src/dmd -DDMDV2 -O2 -fwrapv -pipe -Wformat -Werror=format-security -gdwarf-4 -fno-debug-types-section -fvar-tracking-assignments -g2 -Wp,-D_FORTIFY_SOURCE=2 -fstack-protector-strong --param=ssp-buffer-size=4 -Werror=trampolines -fPIC -march=x86-64 -mtune=generic -gdwarf-4 -fno-debug-types-section -fvar-tracking-assignments -g2 -DNDEBUG -DQT_NO_DEBUG -I/usr/include -std=c++14 -fno-exceptions -D_GNU_SOURCE -D__STDC_CONSTANT_MACROS -D__STDC_FORMAT_MACROS -D__STDC_LIMIT_MACROS -fno-rtti -Wall -Wextra -Wno-unused-parameter -Wno-comment -Wno-missing-field-initializers -Wno-non-virtual-dtor -Wno-pedantic -fvisibility-inlines-hidden -DLDC_POSIX -DIN_LLVM -DOPAQUE_VTBLS "-DLDC_INSTALL_PREFIX=R\"(/usr)\"" -DLDC_LLVM_VER=1500 "-DLDC_LIBDIR_SUFFIX=R\"(64)\"" -DLDC_HOST_LDMD=1 -DLDC_HOST_FE_VER=2097 "-DLDC_LLVM_LIBDIR=R\"(/usr/lib64)\"" -DNDEBUG -MD -MT CMakeFiles/LDCShared.dir/gen/aa.cpp.o -MF CMakeFiles/LDCShared.dir/gen/aa.cpp.o.d -o CMakeFiles/LDCShared.dir/gen/aa.cpp.o -c /tmp/B.6h_5p9b1/BUILD/ldc-1.29.0-src/gen/aa.cpp [ 0%] Building CXX object CMakeFiles/LDCShared.dir/gen/abi-aarch64.cpp.o /usr/bin/x86_64-pld-linux-g++ -DLDC_ENABLE_PLUGINS -DLDC_LLVM_SUPPORTED_TARGET_AArch64=1 -DLDC_LLVM_SUPPORTED_TARGET_AMDGPU=1 -DLDC_LLVM_SUPPORTED_TARGET_ARM=1 -DLDC_LLVM_SUPPORTED_TARGET_AVR=1 -DLDC_LLVM_SUPPORTED_TARGET_BPF=1 -DLDC_LLVM_SUPPORTED_TARGET_Hexagon=1 -DLDC_LLVM_SUPPORTED_TARGET_Lanai=1 -DLDC_LLVM_SUPPORTED_TARGET_MSP430=1 -DLDC_LLVM_SUPPORTED_TARGET_Mips=1 -DLDC_LLVM_SUPPORTED_TARGET_NVPTX=1 -DLDC_LLVM_SUPPORTED_TARGET_PowerPC=1 -DLDC_LLVM_SUPPORTED_TARGET_RISCV=1 -DLDC_LLVM_SUPPORTED_TARGET_SPIRV=1 -DLDC_LLVM_SUPPORTED_TARGET_Sparc=1 -DLDC_LLVM_SUPPORTED_TARGET_SystemZ=1 -DLDC_LLVM_SUPPORTED_TARGET_VE=1 -DLDC_LLVM_SUPPORTED_TARGET_WebAssembly=1 -DLDC_LLVM_SUPPORTED_TARGET_X86=1 -DLDC_LLVM_SUPPORTED_TARGET_XCore=1 -I/tmp/B.6h_5p9b1/BUILD/ldc-1.29.0-src/. -I/tmp/B.6h_5p9b1/BUILD/ldc-1.29.0-src/dmd -DDMDV2 -O2 -fwrapv -pipe -Wformat -Werror=format-security -gdwarf-4 -fno-debug-types-section -fvar-tracking-assignments -g2 -Wp,-D_FORTIFY_SOURCE=2 -fstack-protector-strong --param=ssp-buffer-size=4 -Werror=trampolines -fPIC -march=x86-64 -mtune=generic -gdwarf-4 -fno-debug-types-section -fvar-tracking-assignments -g2 -DNDEBUG -DQT_NO_DEBUG -I/usr/include -std=c++14 -fno-exceptions -D_GNU_SOURCE -D__STDC_CONSTANT_MACROS -D__STDC_FORMAT_MACROS -D__STDC_LIMIT_MACROS -fno-rtti -Wall -Wextra -Wno-unused-parameter -Wno-comment -Wno-missing-field-initializers -Wno-non-virtual-dtor -Wno-pedantic -fvisibility-inlines-hidden -DLDC_POSIX -DIN_LLVM -DOPAQUE_VTBLS "-DLDC_INSTALL_PREFIX=R\"(/usr)\"" -DLDC_LLVM_VER=1500 "-DLDC_LIBDIR_SUFFIX=R\"(64)\"" -DLDC_HOST_LDMD=1 -DLDC_HOST_FE_VER=2097 "-DLDC_LLVM_LIBDIR=R\"(/usr/lib64)\"" -DNDEBUG -MD -MT CMakeFiles/LDCShared.dir/gen/abi-aarch64.cpp.o -MF CMakeFiles/LDCShared.dir/gen/abi-aarch64.cpp.o.d -o CMakeFiles/LDCShared.dir/gen/abi-aarch64.cpp.o -c /tmp/B.6h_5p9b1/BUILD/ldc-1.29.0-src/gen/abi-aarch64.cpp In file included from /tmp/B.6h_5p9b1/BUILD/ldc-1.29.0-src/gen/abi-aarch64.cpp:20: /tmp/B.6h_5p9b1/BUILD/ldc-1.29.0-src/./gen/abi-generic.h: In member function 'virtual llvm::Value* BaseBitcastABIRewrite::put(DValue*, bool, bool)': /tmp/B.6h_5p9b1/BUILD/ldc-1.29.0-src/./gen/abi-generic.h:142:68: warning: 'llvm::Type* llvm::Type::getPointerElementType() const' is deprecated: Deprecated without replacement, see https://llvm.org/docs/OpaquePointers.html for context and migration instructions [-Wdeprecated-declarations] 142 | LLType *pointeeType = address->getType()->getPointerElementType(); | ~~~~~~~~~~~~~~~~~~~~~~~~~~~~~~~~~~~~~~~~~^~ In file included from /tmp/B.6h_5p9b1/BUILD/ldc-1.29.0-src/./gen/llvm.h:20, from /tmp/B.6h_5p9b1/BUILD/ldc-1.29.0-src/./gen/attributes.h:12, from /tmp/B.6h_5p9b1/BUILD/ldc-1.29.0-src/./gen/tollvm.h:22, from /tmp/B.6h_5p9b1/BUILD/ldc-1.29.0-src/./gen/dibuilder.h:12, from /tmp/B.6h_5p9b1/BUILD/ldc-1.29.0-src/./gen/irstate.h:18, from /tmp/B.6h_5p9b1/BUILD/ldc-1.29.0-src/./gen/abi-generic.h:17: /usr/include/llvm/IR/Type.h:380:9: note: declared here 380 | Type *getPointerElementType() const { | ^~~~~~~~~~~~~~~~~~~~~ [ 0%] Building CXX object CMakeFiles/LDCShared.dir/gen/abi-arm.cpp.o /usr/bin/x86_64-pld-linux-g++ -DLDC_ENABLE_PLUGINS -DLDC_LLVM_SUPPORTED_TARGET_AArch64=1 -DLDC_LLVM_SUPPORTED_TARGET_AMDGPU=1 -DLDC_LLVM_SUPPORTED_TARGET_ARM=1 -DLDC_LLVM_SUPPORTED_TARGET_AVR=1 -DLDC_LLVM_SUPPORTED_TARGET_BPF=1 -DLDC_LLVM_SUPPORTED_TARGET_Hexagon=1 -DLDC_LLVM_SUPPORTED_TARGET_Lanai=1 -DLDC_LLVM_SUPPORTED_TARGET_MSP430=1 -DLDC_LLVM_SUPPORTED_TARGET_Mips=1 -DLDC_LLVM_SUPPORTED_TARGET_NVPTX=1 -DLDC_LLVM_SUPPORTED_TARGET_PowerPC=1 -DLDC_LLVM_SUPPORTED_TARGET_RISCV=1 -DLDC_LLVM_SUPPORTED_TARGET_SPIRV=1 -DLDC_LLVM_SUPPORTED_TARGET_Sparc=1 -DLDC_LLVM_SUPPORTED_TARGET_SystemZ=1 -DLDC_LLVM_SUPPORTED_TARGET_VE=1 -DLDC_LLVM_SUPPORTED_TARGET_WebAssembly=1 -DLDC_LLVM_SUPPORTED_TARGET_X86=1 -DLDC_LLVM_SUPPORTED_TARGET_XCore=1 -I/tmp/B.6h_5p9b1/BUILD/ldc-1.29.0-src/. -I/tmp/B.6h_5p9b1/BUILD/ldc-1.29.0-src/dmd -DDMDV2 -O2 -fwrapv -pipe -Wformat -Werror=format-security -gdwarf-4 -fno-debug-types-section -fvar-tracking-assignments -g2 -Wp,-D_FORTIFY_SOURCE=2 -fstack-protector-strong --param=ssp-buffer-size=4 -Werror=trampolines -fPIC -march=x86-64 -mtune=generic -gdwarf-4 -fno-debug-types-section -fvar-tracking-assignments -g2 -DNDEBUG -DQT_NO_DEBUG -I/usr/include -std=c++14 -fno-exceptions -D_GNU_SOURCE -D__STDC_CONSTANT_MACROS -D__STDC_FORMAT_MACROS -D__STDC_LIMIT_MACROS -fno-rtti -Wall -Wextra -Wno-unused-parameter -Wno-comment -Wno-missing-field-initializers -Wno-non-virtual-dtor -Wno-pedantic -fvisibility-inlines-hidden -DLDC_POSIX -DIN_LLVM -DOPAQUE_VTBLS "-DLDC_INSTALL_PREFIX=R\"(/usr)\"" -DLDC_LLVM_VER=1500 "-DLDC_LIBDIR_SUFFIX=R\"(64)\"" -DLDC_HOST_LDMD=1 -DLDC_HOST_FE_VER=2097 "-DLDC_LLVM_LIBDIR=R\"(/usr/lib64)\"" -DNDEBUG -MD -MT CMakeFiles/LDCShared.dir/gen/abi-arm.cpp.o -MF CMakeFiles/LDCShared.dir/gen/abi-arm.cpp.o.d -o CMakeFiles/LDCShared.dir/gen/abi-arm.cpp.o -c /tmp/B.6h_5p9b1/BUILD/ldc-1.29.0-src/gen/abi-arm.cpp In file included from /tmp/B.6h_5p9b1/BUILD/ldc-1.29.0-src/gen/abi-arm.cpp:20: /tmp/B.6h_5p9b1/BUILD/ldc-1.29.0-src/./gen/abi-generic.h: In member function 'virtual llvm::Value* BaseBitcastABIRewrite::put(DValue*, bool, bool)': /tmp/B.6h_5p9b1/BUILD/ldc-1.29.0-src/./gen/abi-generic.h:142:68: warning: 'llvm::Type* llvm::Type::getPointerElementType() const' is deprecated: Deprecated without replacement, see https://llvm.org/docs/OpaquePointers.html for context and migration instructions [-Wdeprecated-declarations] 142 | LLType *pointeeType = address->getType()->getPointerElementType(); | ~~~~~~~~~~~~~~~~~~~~~~~~~~~~~~~~~~~~~~~~~^~ In file included from /tmp/B.6h_5p9b1/BUILD/ldc-1.29.0-src/./gen/llvm.h:20, from /tmp/B.6h_5p9b1/BUILD/ldc-1.29.0-src/./gen/attributes.h:12, from /tmp/B.6h_5p9b1/BUILD/ldc-1.29.0-src/./gen/tollvm.h:22, from /tmp/B.6h_5p9b1/BUILD/ldc-1.29.0-src/./gen/dibuilder.h:12, from /tmp/B.6h_5p9b1/BUILD/ldc-1.29.0-src/./gen/irstate.h:18, from /tmp/B.6h_5p9b1/BUILD/ldc-1.29.0-src/./gen/abi-generic.h:17: /usr/include/llvm/IR/Type.h:380:9: note: declared here 380 | Type *getPointerElementType() const { | ^~~~~~~~~~~~~~~~~~~~~ [ 0%] Building CXX object CMakeFiles/LDCShared.dir/gen/abi-mips64.cpp.o /usr/bin/x86_64-pld-linux-g++ -DLDC_ENABLE_PLUGINS -DLDC_LLVM_SUPPORTED_TARGET_AArch64=1 -DLDC_LLVM_SUPPORTED_TARGET_AMDGPU=1 -DLDC_LLVM_SUPPORTED_TARGET_ARM=1 -DLDC_LLVM_SUPPORTED_TARGET_AVR=1 -DLDC_LLVM_SUPPORTED_TARGET_BPF=1 -DLDC_LLVM_SUPPORTED_TARGET_Hexagon=1 -DLDC_LLVM_SUPPORTED_TARGET_Lanai=1 -DLDC_LLVM_SUPPORTED_TARGET_MSP430=1 -DLDC_LLVM_SUPPORTED_TARGET_Mips=1 -DLDC_LLVM_SUPPORTED_TARGET_NVPTX=1 -DLDC_LLVM_SUPPORTED_TARGET_PowerPC=1 -DLDC_LLVM_SUPPORTED_TARGET_RISCV=1 -DLDC_LLVM_SUPPORTED_TARGET_SPIRV=1 -DLDC_LLVM_SUPPORTED_TARGET_Sparc=1 -DLDC_LLVM_SUPPORTED_TARGET_SystemZ=1 -DLDC_LLVM_SUPPORTED_TARGET_VE=1 -DLDC_LLVM_SUPPORTED_TARGET_WebAssembly=1 -DLDC_LLVM_SUPPORTED_TARGET_X86=1 -DLDC_LLVM_SUPPORTED_TARGET_XCore=1 -I/tmp/B.6h_5p9b1/BUILD/ldc-1.29.0-src/. -I/tmp/B.6h_5p9b1/BUILD/ldc-1.29.0-src/dmd -DDMDV2 -O2 -fwrapv -pipe -Wformat -Werror=format-security -gdwarf-4 -fno-debug-types-section -fvar-tracking-assignments -g2 -Wp,-D_FORTIFY_SOURCE=2 -fstack-protector-strong --param=ssp-buffer-size=4 -Werror=trampolines -fPIC -march=x86-64 -mtune=generic -gdwarf-4 -fno-debug-types-section -fvar-tracking-assignments -g2 -DNDEBUG -DQT_NO_DEBUG -I/usr/include -std=c++14 -fno-exceptions -D_GNU_SOURCE -D__STDC_CONSTANT_MACROS -D__STDC_FORMAT_MACROS -D__STDC_LIMIT_MACROS -fno-rtti -Wall -Wextra -Wno-unused-parameter -Wno-comment -Wno-missing-field-initializers -Wno-non-virtual-dtor -Wno-pedantic -fvisibility-inlines-hidden -DLDC_POSIX -DIN_LLVM -DOPAQUE_VTBLS "-DLDC_INSTALL_PREFIX=R\"(/usr)\"" -DLDC_LLVM_VER=1500 "-DLDC_LIBDIR_SUFFIX=R\"(64)\"" -DLDC_HOST_LDMD=1 -DLDC_HOST_FE_VER=2097 "-DLDC_LLVM_LIBDIR=R\"(/usr/lib64)\"" -DNDEBUG -MD -MT CMakeFiles/LDCShared.dir/gen/abi-mips64.cpp.o -MF CMakeFiles/LDCShared.dir/gen/abi-mips64.cpp.o.d -o CMakeFiles/LDCShared.dir/gen/abi-mips64.cpp.o -c /tmp/B.6h_5p9b1/BUILD/ldc-1.29.0-src/gen/abi-mips64.cpp In file included from /tmp/B.6h_5p9b1/BUILD/ldc-1.29.0-src/gen/abi-mips64.cpp:16: /tmp/B.6h_5p9b1/BUILD/ldc-1.29.0-src/./gen/abi-generic.h: In member function 'virtual llvm::Value* BaseBitcastABIRewrite::put(DValue*, bool, bool)': /tmp/B.6h_5p9b1/BUILD/ldc-1.29.0-src/./gen/abi-generic.h:142:68: warning: 'llvm::Type* llvm::Type::getPointerElementType() const' is deprecated: Deprecated without replacement, see https://llvm.org/docs/OpaquePointers.html for context and migration instructions [-Wdeprecated-declarations] 142 | LLType *pointeeType = address->getType()->getPointerElementType(); | ~~~~~~~~~~~~~~~~~~~~~~~~~~~~~~~~~~~~~~~~~^~ In file included from /tmp/B.6h_5p9b1/BUILD/ldc-1.29.0-src/./gen/llvm.h:20, from /tmp/B.6h_5p9b1/BUILD/ldc-1.29.0-src/./gen/attributes.h:12, from /tmp/B.6h_5p9b1/BUILD/ldc-1.29.0-src/./gen/tollvm.h:22, from /tmp/B.6h_5p9b1/BUILD/ldc-1.29.0-src/./gen/dibuilder.h:12, from /tmp/B.6h_5p9b1/BUILD/ldc-1.29.0-src/./gen/irstate.h:18, from /tmp/B.6h_5p9b1/BUILD/ldc-1.29.0-src/./gen/abi-generic.h:17: /usr/include/llvm/IR/Type.h:380:9: note: declared here 380 | Type *getPointerElementType() const { | ^~~~~~~~~~~~~~~~~~~~~ [ 0%] Building CXX object CMakeFiles/LDCShared.dir/gen/abi-nvptx.cpp.o /usr/bin/x86_64-pld-linux-g++ -DLDC_ENABLE_PLUGINS -DLDC_LLVM_SUPPORTED_TARGET_AArch64=1 -DLDC_LLVM_SUPPORTED_TARGET_AMDGPU=1 -DLDC_LLVM_SUPPORTED_TARGET_ARM=1 -DLDC_LLVM_SUPPORTED_TARGET_AVR=1 -DLDC_LLVM_SUPPORTED_TARGET_BPF=1 -DLDC_LLVM_SUPPORTED_TARGET_Hexagon=1 -DLDC_LLVM_SUPPORTED_TARGET_Lanai=1 -DLDC_LLVM_SUPPORTED_TARGET_MSP430=1 -DLDC_LLVM_SUPPORTED_TARGET_Mips=1 -DLDC_LLVM_SUPPORTED_TARGET_NVPTX=1 -DLDC_LLVM_SUPPORTED_TARGET_PowerPC=1 -DLDC_LLVM_SUPPORTED_TARGET_RISCV=1 -DLDC_LLVM_SUPPORTED_TARGET_SPIRV=1 -DLDC_LLVM_SUPPORTED_TARGET_Sparc=1 -DLDC_LLVM_SUPPORTED_TARGET_SystemZ=1 -DLDC_LLVM_SUPPORTED_TARGET_VE=1 -DLDC_LLVM_SUPPORTED_TARGET_WebAssembly=1 -DLDC_LLVM_SUPPORTED_TARGET_X86=1 -DLDC_LLVM_SUPPORTED_TARGET_XCore=1 -I/tmp/B.6h_5p9b1/BUILD/ldc-1.29.0-src/. -I/tmp/B.6h_5p9b1/BUILD/ldc-1.29.0-src/dmd -DDMDV2 -O2 -fwrapv -pipe -Wformat -Werror=format-security -gdwarf-4 -fno-debug-types-section -fvar-tracking-assignments -g2 -Wp,-D_FORTIFY_SOURCE=2 -fstack-protector-strong --param=ssp-buffer-size=4 -Werror=trampolines -fPIC -march=x86-64 -mtune=generic -gdwarf-4 -fno-debug-types-section -fvar-tracking-assignments -g2 -DNDEBUG -DQT_NO_DEBUG -I/usr/include -std=c++14 -fno-exceptions -D_GNU_SOURCE -D__STDC_CONSTANT_MACROS -D__STDC_FORMAT_MACROS -D__STDC_LIMIT_MACROS -fno-rtti -Wall -Wextra -Wno-unused-parameter -Wno-comment -Wno-missing-field-initializers -Wno-non-virtual-dtor -Wno-pedantic -fvisibility-inlines-hidden -DLDC_POSIX -DIN_LLVM -DOPAQUE_VTBLS "-DLDC_INSTALL_PREFIX=R\"(/usr)\"" -DLDC_LLVM_VER=1500 "-DLDC_LIBDIR_SUFFIX=R\"(64)\"" -DLDC_HOST_LDMD=1 -DLDC_HOST_FE_VER=2097 "-DLDC_LLVM_LIBDIR=R\"(/usr/lib64)\"" -DNDEBUG -MD -MT CMakeFiles/LDCShared.dir/gen/abi-nvptx.cpp.o -MF CMakeFiles/LDCShared.dir/gen/abi-nvptx.cpp.o.d -o CMakeFiles/LDCShared.dir/gen/abi-nvptx.cpp.o -c /tmp/B.6h_5p9b1/BUILD/ldc-1.29.0-src/gen/abi-nvptx.cpp In file included from /tmp/B.6h_5p9b1/BUILD/ldc-1.29.0-src/./gen/dcompute/abi-rewrites.h:16, from /tmp/B.6h_5p9b1/BUILD/ldc-1.29.0-src/gen/abi-nvptx.cpp:15: /tmp/B.6h_5p9b1/BUILD/ldc-1.29.0-src/./gen/abi-generic.h: In member function 'virtual llvm::Value* BaseBitcastABIRewrite::put(DValue*, bool, bool)': /tmp/B.6h_5p9b1/BUILD/ldc-1.29.0-src/./gen/abi-generic.h:142:68: warning: 'llvm::Type* llvm::Type::getPointerElementType() const' is deprecated: Deprecated without replacement, see https://llvm.org/docs/OpaquePointers.html for context and migration instructions [-Wdeprecated-declarations] 142 | LLType *pointeeType = address->getType()->getPointerElementType(); | ~~~~~~~~~~~~~~~~~~~~~~~~~~~~~~~~~~~~~~~~~^~ In file included from /tmp/B.6h_5p9b1/BUILD/ldc-1.29.0-src/./gen/llvm.h:20, from /tmp/B.6h_5p9b1/BUILD/ldc-1.29.0-src/./gen/attributes.h:12, from /tmp/B.6h_5p9b1/BUILD/ldc-1.29.0-src/./gen/tollvm.h:22, from /tmp/B.6h_5p9b1/BUILD/ldc-1.29.0-src/./gen/dibuilder.h:12, from /tmp/B.6h_5p9b1/BUILD/ldc-1.29.0-src/./gen/irstate.h:18, from /tmp/B.6h_5p9b1/BUILD/ldc-1.29.0-src/./gen/dcompute/target.h:12, from /tmp/B.6h_5p9b1/BUILD/ldc-1.29.0-src/./gen/dcompute/druntime.h:16, from /tmp/B.6h_5p9b1/BUILD/ldc-1.29.0-src/gen/abi-nvptx.cpp:11: /usr/include/llvm/IR/Type.h:380:9: note: declared here 380 | Type *getPointerElementType() const { | ^~~~~~~~~~~~~~~~~~~~~ [ 0%] Building CXX object CMakeFiles/LDCShared.dir/gen/abi-ppc.cpp.o /usr/bin/x86_64-pld-linux-g++ -DLDC_ENABLE_PLUGINS -DLDC_LLVM_SUPPORTED_TARGET_AArch64=1 -DLDC_LLVM_SUPPORTED_TARGET_AMDGPU=1 -DLDC_LLVM_SUPPORTED_TARGET_ARM=1 -DLDC_LLVM_SUPPORTED_TARGET_AVR=1 -DLDC_LLVM_SUPPORTED_TARGET_BPF=1 -DLDC_LLVM_SUPPORTED_TARGET_Hexagon=1 -DLDC_LLVM_SUPPORTED_TARGET_Lanai=1 -DLDC_LLVM_SUPPORTED_TARGET_MSP430=1 -DLDC_LLVM_SUPPORTED_TARGET_Mips=1 -DLDC_LLVM_SUPPORTED_TARGET_NVPTX=1 -DLDC_LLVM_SUPPORTED_TARGET_PowerPC=1 -DLDC_LLVM_SUPPORTED_TARGET_RISCV=1 -DLDC_LLVM_SUPPORTED_TARGET_SPIRV=1 -DLDC_LLVM_SUPPORTED_TARGET_Sparc=1 -DLDC_LLVM_SUPPORTED_TARGET_SystemZ=1 -DLDC_LLVM_SUPPORTED_TARGET_VE=1 -DLDC_LLVM_SUPPORTED_TARGET_WebAssembly=1 -DLDC_LLVM_SUPPORTED_TARGET_X86=1 -DLDC_LLVM_SUPPORTED_TARGET_XCore=1 -I/tmp/B.6h_5p9b1/BUILD/ldc-1.29.0-src/. -I/tmp/B.6h_5p9b1/BUILD/ldc-1.29.0-src/dmd -DDMDV2 -O2 -fwrapv -pipe -Wformat -Werror=format-security -gdwarf-4 -fno-debug-types-section -fvar-tracking-assignments -g2 -Wp,-D_FORTIFY_SOURCE=2 -fstack-protector-strong --param=ssp-buffer-size=4 -Werror=trampolines -fPIC -march=x86-64 -mtune=generic -gdwarf-4 -fno-debug-types-section -fvar-tracking-assignments -g2 -DNDEBUG -DQT_NO_DEBUG -I/usr/include -std=c++14 -fno-exceptions -D_GNU_SOURCE -D__STDC_CONSTANT_MACROS -D__STDC_FORMAT_MACROS -D__STDC_LIMIT_MACROS -fno-rtti -Wall -Wextra -Wno-unused-parameter -Wno-comment -Wno-missing-field-initializers -Wno-non-virtual-dtor -Wno-pedantic -fvisibility-inlines-hidden -DLDC_POSIX -DIN_LLVM -DOPAQUE_VTBLS "-DLDC_INSTALL_PREFIX=R\"(/usr)\"" -DLDC_LLVM_VER=1500 "-DLDC_LIBDIR_SUFFIX=R\"(64)\"" -DLDC_HOST_LDMD=1 -DLDC_HOST_FE_VER=2097 "-DLDC_LLVM_LIBDIR=R\"(/usr/lib64)\"" -DNDEBUG -MD -MT CMakeFiles/LDCShared.dir/gen/abi-ppc.cpp.o -MF CMakeFiles/LDCShared.dir/gen/abi-ppc.cpp.o.d -o CMakeFiles/LDCShared.dir/gen/abi-ppc.cpp.o -c /tmp/B.6h_5p9b1/BUILD/ldc-1.29.0-src/gen/abi-ppc.cpp In file included from /tmp/B.6h_5p9b1/BUILD/ldc-1.29.0-src/gen/abi-ppc.cpp:23: /tmp/B.6h_5p9b1/BUILD/ldc-1.29.0-src/./gen/abi-generic.h: In member function 'virtual llvm::Value* BaseBitcastABIRewrite::put(DValue*, bool, bool)': /tmp/B.6h_5p9b1/BUILD/ldc-1.29.0-src/./gen/abi-generic.h:142:68: warning: 'llvm::Type* llvm::Type::getPointerElementType() const' is deprecated: Deprecated without replacement, see https://llvm.org/docs/OpaquePointers.html for context and migration instructions [-Wdeprecated-declarations] 142 | LLType *pointeeType = address->getType()->getPointerElementType(); | ~~~~~~~~~~~~~~~~~~~~~~~~~~~~~~~~~~~~~~~~~^~ In file included from /tmp/B.6h_5p9b1/BUILD/ldc-1.29.0-src/./gen/llvm.h:20, from /tmp/B.6h_5p9b1/BUILD/ldc-1.29.0-src/./gen/attributes.h:12, from /tmp/B.6h_5p9b1/BUILD/ldc-1.29.0-src/./gen/tollvm.h:22, from /tmp/B.6h_5p9b1/BUILD/ldc-1.29.0-src/./gen/dibuilder.h:12, from /tmp/B.6h_5p9b1/BUILD/ldc-1.29.0-src/./gen/irstate.h:18, from /tmp/B.6h_5p9b1/BUILD/ldc-1.29.0-src/./gen/abi-generic.h:17: /usr/include/llvm/IR/Type.h:380:9: note: declared here 380 | Type *getPointerElementType() const { | ^~~~~~~~~~~~~~~~~~~~~ [ 0%] Building CXX object CMakeFiles/LDCShared.dir/gen/abi-ppc64le.cpp.o /usr/bin/x86_64-pld-linux-g++ -DLDC_ENABLE_PLUGINS -DLDC_LLVM_SUPPORTED_TARGET_AArch64=1 -DLDC_LLVM_SUPPORTED_TARGET_AMDGPU=1 -DLDC_LLVM_SUPPORTED_TARGET_ARM=1 -DLDC_LLVM_SUPPORTED_TARGET_AVR=1 -DLDC_LLVM_SUPPORTED_TARGET_BPF=1 -DLDC_LLVM_SUPPORTED_TARGET_Hexagon=1 -DLDC_LLVM_SUPPORTED_TARGET_Lanai=1 -DLDC_LLVM_SUPPORTED_TARGET_MSP430=1 -DLDC_LLVM_SUPPORTED_TARGET_Mips=1 -DLDC_LLVM_SUPPORTED_TARGET_NVPTX=1 -DLDC_LLVM_SUPPORTED_TARGET_PowerPC=1 -DLDC_LLVM_SUPPORTED_TARGET_RISCV=1 -DLDC_LLVM_SUPPORTED_TARGET_SPIRV=1 -DLDC_LLVM_SUPPORTED_TARGET_Sparc=1 -DLDC_LLVM_SUPPORTED_TARGET_SystemZ=1 -DLDC_LLVM_SUPPORTED_TARGET_VE=1 -DLDC_LLVM_SUPPORTED_TARGET_WebAssembly=1 -DLDC_LLVM_SUPPORTED_TARGET_X86=1 -DLDC_LLVM_SUPPORTED_TARGET_XCore=1 -I/tmp/B.6h_5p9b1/BUILD/ldc-1.29.0-src/. -I/tmp/B.6h_5p9b1/BUILD/ldc-1.29.0-src/dmd -DDMDV2 -O2 -fwrapv -pipe -Wformat -Werror=format-security -gdwarf-4 -fno-debug-types-section -fvar-tracking-assignments -g2 -Wp,-D_FORTIFY_SOURCE=2 -fstack-protector-strong --param=ssp-buffer-size=4 -Werror=trampolines -fPIC -march=x86-64 -mtune=generic -gdwarf-4 -fno-debug-types-section -fvar-tracking-assignments -g2 -DNDEBUG -DQT_NO_DEBUG -I/usr/include -std=c++14 -fno-exceptions -D_GNU_SOURCE -D__STDC_CONSTANT_MACROS -D__STDC_FORMAT_MACROS -D__STDC_LIMIT_MACROS -fno-rtti -Wall -Wextra -Wno-unused-parameter -Wno-comment -Wno-missing-field-initializers -Wno-non-virtual-dtor -Wno-pedantic -fvisibility-inlines-hidden -DLDC_POSIX -DIN_LLVM -DOPAQUE_VTBLS "-DLDC_INSTALL_PREFIX=R\"(/usr)\"" -DLDC_LLVM_VER=1500 "-DLDC_LIBDIR_SUFFIX=R\"(64)\"" -DLDC_HOST_LDMD=1 -DLDC_HOST_FE_VER=2097 "-DLDC_LLVM_LIBDIR=R\"(/usr/lib64)\"" -DNDEBUG -MD -MT CMakeFiles/LDCShared.dir/gen/abi-ppc64le.cpp.o -MF CMakeFiles/LDCShared.dir/gen/abi-ppc64le.cpp.o.d -o CMakeFiles/LDCShared.dir/gen/abi-ppc64le.cpp.o -c /tmp/B.6h_5p9b1/BUILD/ldc-1.29.0-src/gen/abi-ppc64le.cpp In file included from /tmp/B.6h_5p9b1/BUILD/ldc-1.29.0-src/gen/abi-ppc64le.cpp:17: /tmp/B.6h_5p9b1/BUILD/ldc-1.29.0-src/./gen/abi-generic.h: In member function 'virtual llvm::Value* BaseBitcastABIRewrite::put(DValue*, bool, bool)': /tmp/B.6h_5p9b1/BUILD/ldc-1.29.0-src/./gen/abi-generic.h:142:68: warning: 'llvm::Type* llvm::Type::getPointerElementType() const' is deprecated: Deprecated without replacement, see https://llvm.org/docs/OpaquePointers.html for context and migration instructions [-Wdeprecated-declarations] 142 | LLType *pointeeType = address->getType()->getPointerElementType(); | ~~~~~~~~~~~~~~~~~~~~~~~~~~~~~~~~~~~~~~~~~^~ In file included from /tmp/B.6h_5p9b1/BUILD/ldc-1.29.0-src/./gen/llvm.h:20, from /tmp/B.6h_5p9b1/BUILD/ldc-1.29.0-src/./gen/attributes.h:12, from /tmp/B.6h_5p9b1/BUILD/ldc-1.29.0-src/./gen/tollvm.h:22, from /tmp/B.6h_5p9b1/BUILD/ldc-1.29.0-src/./gen/dibuilder.h:12, from /tmp/B.6h_5p9b1/BUILD/ldc-1.29.0-src/./gen/irstate.h:18, from /tmp/B.6h_5p9b1/BUILD/ldc-1.29.0-src/./gen/abi-generic.h:17: /usr/include/llvm/IR/Type.h:380:9: note: declared here 380 | Type *getPointerElementType() const { | ^~~~~~~~~~~~~~~~~~~~~ [ 0%] Building CXX object CMakeFiles/LDCShared.dir/gen/abi-spirv.cpp.o /usr/bin/x86_64-pld-linux-g++ -DLDC_ENABLE_PLUGINS -DLDC_LLVM_SUPPORTED_TARGET_AArch64=1 -DLDC_LLVM_SUPPORTED_TARGET_AMDGPU=1 -DLDC_LLVM_SUPPORTED_TARGET_ARM=1 -DLDC_LLVM_SUPPORTED_TARGET_AVR=1 -DLDC_LLVM_SUPPORTED_TARGET_BPF=1 -DLDC_LLVM_SUPPORTED_TARGET_Hexagon=1 -DLDC_LLVM_SUPPORTED_TARGET_Lanai=1 -DLDC_LLVM_SUPPORTED_TARGET_MSP430=1 -DLDC_LLVM_SUPPORTED_TARGET_Mips=1 -DLDC_LLVM_SUPPORTED_TARGET_NVPTX=1 -DLDC_LLVM_SUPPORTED_TARGET_PowerPC=1 -DLDC_LLVM_SUPPORTED_TARGET_RISCV=1 -DLDC_LLVM_SUPPORTED_TARGET_SPIRV=1 -DLDC_LLVM_SUPPORTED_TARGET_Sparc=1 -DLDC_LLVM_SUPPORTED_TARGET_SystemZ=1 -DLDC_LLVM_SUPPORTED_TARGET_VE=1 -DLDC_LLVM_SUPPORTED_TARGET_WebAssembly=1 -DLDC_LLVM_SUPPORTED_TARGET_X86=1 -DLDC_LLVM_SUPPORTED_TARGET_XCore=1 -I/tmp/B.6h_5p9b1/BUILD/ldc-1.29.0-src/. -I/tmp/B.6h_5p9b1/BUILD/ldc-1.29.0-src/dmd -DDMDV2 -O2 -fwrapv -pipe -Wformat -Werror=format-security -gdwarf-4 -fno-debug-types-section -fvar-tracking-assignments -g2 -Wp,-D_FORTIFY_SOURCE=2 -fstack-protector-strong --param=ssp-buffer-size=4 -Werror=trampolines -fPIC -march=x86-64 -mtune=generic -gdwarf-4 -fno-debug-types-section -fvar-tracking-assignments -g2 -DNDEBUG -DQT_NO_DEBUG -I/usr/include -std=c++14 -fno-exceptions -D_GNU_SOURCE -D__STDC_CONSTANT_MACROS -D__STDC_FORMAT_MACROS -D__STDC_LIMIT_MACROS -fno-rtti -Wall -Wextra -Wno-unused-parameter -Wno-comment -Wno-missing-field-initializers -Wno-non-virtual-dtor -Wno-pedantic -fvisibility-inlines-hidden -DLDC_POSIX -DIN_LLVM -DOPAQUE_VTBLS "-DLDC_INSTALL_PREFIX=R\"(/usr)\"" -DLDC_LLVM_VER=1500 "-DLDC_LIBDIR_SUFFIX=R\"(64)\"" -DLDC_HOST_LDMD=1 -DLDC_HOST_FE_VER=2097 "-DLDC_LLVM_LIBDIR=R\"(/usr/lib64)\"" -DNDEBUG -MD -MT CMakeFiles/LDCShared.dir/gen/abi-spirv.cpp.o -MF CMakeFiles/LDCShared.dir/gen/abi-spirv.cpp.o.d -o CMakeFiles/LDCShared.dir/gen/abi-spirv.cpp.o -c /tmp/B.6h_5p9b1/BUILD/ldc-1.29.0-src/gen/abi-spirv.cpp In file included from /tmp/B.6h_5p9b1/BUILD/ldc-1.29.0-src/./gen/dcompute/abi-rewrites.h:16, from /tmp/B.6h_5p9b1/BUILD/ldc-1.29.0-src/gen/abi-spirv.cpp:15: /tmp/B.6h_5p9b1/BUILD/ldc-1.29.0-src/./gen/abi-generic.h: In member function 'virtual llvm::Value* BaseBitcastABIRewrite::put(DValue*, bool, bool)': /tmp/B.6h_5p9b1/BUILD/ldc-1.29.0-src/./gen/abi-generic.h:142:68: warning: 'llvm::Type* llvm::Type::getPointerElementType() const' is deprecated: Deprecated without replacement, see https://llvm.org/docs/OpaquePointers.html for context and migration instructions [-Wdeprecated-declarations] 142 | LLType *pointeeType = address->getType()->getPointerElementType(); | ~~~~~~~~~~~~~~~~~~~~~~~~~~~~~~~~~~~~~~~~~^~ In file included from /tmp/B.6h_5p9b1/BUILD/ldc-1.29.0-src/./gen/llvm.h:20, from /tmp/B.6h_5p9b1/BUILD/ldc-1.29.0-src/./gen/attributes.h:12, from /tmp/B.6h_5p9b1/BUILD/ldc-1.29.0-src/./gen/tollvm.h:22, from /tmp/B.6h_5p9b1/BUILD/ldc-1.29.0-src/./gen/dibuilder.h:12, from /tmp/B.6h_5p9b1/BUILD/ldc-1.29.0-src/./gen/irstate.h:18, from /tmp/B.6h_5p9b1/BUILD/ldc-1.29.0-src/./gen/dcompute/target.h:12, from /tmp/B.6h_5p9b1/BUILD/ldc-1.29.0-src/./gen/dcompute/druntime.h:16, from /tmp/B.6h_5p9b1/BUILD/ldc-1.29.0-src/gen/abi-spirv.cpp:11: /usr/include/llvm/IR/Type.h:380:9: note: declared here 380 | Type *getPointerElementType() const { | ^~~~~~~~~~~~~~~~~~~~~ [ 0%] Building CXX object CMakeFiles/LDCShared.dir/gen/abi-win64.cpp.o /usr/bin/x86_64-pld-linux-g++ -DLDC_ENABLE_PLUGINS -DLDC_LLVM_SUPPORTED_TARGET_AArch64=1 -DLDC_LLVM_SUPPORTED_TARGET_AMDGPU=1 -DLDC_LLVM_SUPPORTED_TARGET_ARM=1 -DLDC_LLVM_SUPPORTED_TARGET_AVR=1 -DLDC_LLVM_SUPPORTED_TARGET_BPF=1 -DLDC_LLVM_SUPPORTED_TARGET_Hexagon=1 -DLDC_LLVM_SUPPORTED_TARGET_Lanai=1 -DLDC_LLVM_SUPPORTED_TARGET_MSP430=1 -DLDC_LLVM_SUPPORTED_TARGET_Mips=1 -DLDC_LLVM_SUPPORTED_TARGET_NVPTX=1 -DLDC_LLVM_SUPPORTED_TARGET_PowerPC=1 -DLDC_LLVM_SUPPORTED_TARGET_RISCV=1 -DLDC_LLVM_SUPPORTED_TARGET_SPIRV=1 -DLDC_LLVM_SUPPORTED_TARGET_Sparc=1 -DLDC_LLVM_SUPPORTED_TARGET_SystemZ=1 -DLDC_LLVM_SUPPORTED_TARGET_VE=1 -DLDC_LLVM_SUPPORTED_TARGET_WebAssembly=1 -DLDC_LLVM_SUPPORTED_TARGET_X86=1 -DLDC_LLVM_SUPPORTED_TARGET_XCore=1 -I/tmp/B.6h_5p9b1/BUILD/ldc-1.29.0-src/. -I/tmp/B.6h_5p9b1/BUILD/ldc-1.29.0-src/dmd -DDMDV2 -O2 -fwrapv -pipe -Wformat -Werror=format-security -gdwarf-4 -fno-debug-types-section -fvar-tracking-assignments -g2 -Wp,-D_FORTIFY_SOURCE=2 -fstack-protector-strong --param=ssp-buffer-size=4 -Werror=trampolines -fPIC -march=x86-64 -mtune=generic -gdwarf-4 -fno-debug-types-section -fvar-tracking-assignments -g2 -DNDEBUG -DQT_NO_DEBUG -I/usr/include -std=c++14 -fno-exceptions -D_GNU_SOURCE -D__STDC_CONSTANT_MACROS -D__STDC_FORMAT_MACROS -D__STDC_LIMIT_MACROS -fno-rtti -Wall -Wextra -Wno-unused-parameter -Wno-comment -Wno-missing-field-initializers -Wno-non-virtual-dtor -Wno-pedantic -fvisibility-inlines-hidden -DLDC_POSIX -DIN_LLVM -DOPAQUE_VTBLS "-DLDC_INSTALL_PREFIX=R\"(/usr)\"" -DLDC_LLVM_VER=1500 "-DLDC_LIBDIR_SUFFIX=R\"(64)\"" -DLDC_HOST_LDMD=1 -DLDC_HOST_FE_VER=2097 "-DLDC_LLVM_LIBDIR=R\"(/usr/lib64)\"" -DNDEBUG -MD -MT CMakeFiles/LDCShared.dir/gen/abi-win64.cpp.o -MF CMakeFiles/LDCShared.dir/gen/abi-win64.cpp.o.d -o CMakeFiles/LDCShared.dir/gen/abi-win64.cpp.o -c /tmp/B.6h_5p9b1/BUILD/ldc-1.29.0-src/gen/abi-win64.cpp In file included from /tmp/B.6h_5p9b1/BUILD/ldc-1.29.0-src/gen/abi-win64.cpp:21: /tmp/B.6h_5p9b1/BUILD/ldc-1.29.0-src/./gen/abi-generic.h: In member function 'virtual llvm::Value* BaseBitcastABIRewrite::put(DValue*, bool, bool)': /tmp/B.6h_5p9b1/BUILD/ldc-1.29.0-src/./gen/abi-generic.h:142:68: warning: 'llvm::Type* llvm::Type::getPointerElementType() const' is deprecated: Deprecated without replacement, see https://llvm.org/docs/OpaquePointers.html for context and migration instructions [-Wdeprecated-declarations] 142 | LLType *pointeeType = address->getType()->getPointerElementType(); | ~~~~~~~~~~~~~~~~~~~~~~~~~~~~~~~~~~~~~~~~~^~ In file included from /tmp/B.6h_5p9b1/BUILD/ldc-1.29.0-src/./gen/llvm.h:20, from /tmp/B.6h_5p9b1/BUILD/ldc-1.29.0-src/./gen/attributes.h:12, from /tmp/B.6h_5p9b1/BUILD/ldc-1.29.0-src/./gen/tollvm.h:22, from /tmp/B.6h_5p9b1/BUILD/ldc-1.29.0-src/./gen/dibuilder.h:12, from /tmp/B.6h_5p9b1/BUILD/ldc-1.29.0-src/./gen/irstate.h:18, from /tmp/B.6h_5p9b1/BUILD/ldc-1.29.0-src/./gen/abi-generic.h:17: /usr/include/llvm/IR/Type.h:380:9: note: declared here 380 | Type *getPointerElementType() const { | ^~~~~~~~~~~~~~~~~~~~~ [ 0%] Building CXX object CMakeFiles/LDCShared.dir/gen/abi-x86-64.cpp.o /usr/bin/x86_64-pld-linux-g++ -DLDC_ENABLE_PLUGINS -DLDC_LLVM_SUPPORTED_TARGET_AArch64=1 -DLDC_LLVM_SUPPORTED_TARGET_AMDGPU=1 -DLDC_LLVM_SUPPORTED_TARGET_ARM=1 -DLDC_LLVM_SUPPORTED_TARGET_AVR=1 -DLDC_LLVM_SUPPORTED_TARGET_BPF=1 -DLDC_LLVM_SUPPORTED_TARGET_Hexagon=1 -DLDC_LLVM_SUPPORTED_TARGET_Lanai=1 -DLDC_LLVM_SUPPORTED_TARGET_MSP430=1 -DLDC_LLVM_SUPPORTED_TARGET_Mips=1 -DLDC_LLVM_SUPPORTED_TARGET_NVPTX=1 -DLDC_LLVM_SUPPORTED_TARGET_PowerPC=1 -DLDC_LLVM_SUPPORTED_TARGET_RISCV=1 -DLDC_LLVM_SUPPORTED_TARGET_SPIRV=1 -DLDC_LLVM_SUPPORTED_TARGET_Sparc=1 -DLDC_LLVM_SUPPORTED_TARGET_SystemZ=1 -DLDC_LLVM_SUPPORTED_TARGET_VE=1 -DLDC_LLVM_SUPPORTED_TARGET_WebAssembly=1 -DLDC_LLVM_SUPPORTED_TARGET_X86=1 -DLDC_LLVM_SUPPORTED_TARGET_XCore=1 -I/tmp/B.6h_5p9b1/BUILD/ldc-1.29.0-src/. -I/tmp/B.6h_5p9b1/BUILD/ldc-1.29.0-src/dmd -DDMDV2 -O2 -fwrapv -pipe -Wformat -Werror=format-security -gdwarf-4 -fno-debug-types-section -fvar-tracking-assignments -g2 -Wp,-D_FORTIFY_SOURCE=2 -fstack-protector-strong --param=ssp-buffer-size=4 -Werror=trampolines -fPIC -march=x86-64 -mtune=generic -gdwarf-4 -fno-debug-types-section -fvar-tracking-assignments -g2 -DNDEBUG -DQT_NO_DEBUG -I/usr/include -std=c++14 -fno-exceptions -D_GNU_SOURCE -D__STDC_CONSTANT_MACROS -D__STDC_FORMAT_MACROS -D__STDC_LIMIT_MACROS -fno-rtti -Wall -Wextra -Wno-unused-parameter -Wno-comment -Wno-missing-field-initializers -Wno-non-virtual-dtor -Wno-pedantic -fvisibility-inlines-hidden -DLDC_POSIX -DIN_LLVM -DOPAQUE_VTBLS "-DLDC_INSTALL_PREFIX=R\"(/usr)\"" -DLDC_LLVM_VER=1500 "-DLDC_LIBDIR_SUFFIX=R\"(64)\"" -DLDC_HOST_LDMD=1 -DLDC_HOST_FE_VER=2097 "-DLDC_LLVM_LIBDIR=R\"(/usr/lib64)\"" -DNDEBUG -MD -MT CMakeFiles/LDCShared.dir/gen/abi-x86-64.cpp.o -MF CMakeFiles/LDCShared.dir/gen/abi-x86-64.cpp.o.d -o CMakeFiles/LDCShared.dir/gen/abi-x86-64.cpp.o -c /tmp/B.6h_5p9b1/BUILD/ldc-1.29.0-src/gen/abi-x86-64.cpp In file included from /tmp/B.6h_5p9b1/BUILD/ldc-1.29.0-src/gen/abi-x86-64.cpp:38: /tmp/B.6h_5p9b1/BUILD/ldc-1.29.0-src/./gen/abi-generic.h: In member function 'virtual llvm::Value* BaseBitcastABIRewrite::put(DValue*, bool, bool)': /tmp/B.6h_5p9b1/BUILD/ldc-1.29.0-src/./gen/abi-generic.h:142:68: warning: 'llvm::Type* llvm::Type::getPointerElementType() const' is deprecated: Deprecated without replacement, see https://llvm.org/docs/OpaquePointers.html for context and migration instructions [-Wdeprecated-declarations] 142 | LLType *pointeeType = address->getType()->getPointerElementType(); | ~~~~~~~~~~~~~~~~~~~~~~~~~~~~~~~~~~~~~~~~~^~ In file included from /tmp/B.6h_5p9b1/BUILD/ldc-1.29.0-src/./gen/llvm.h:20, from /tmp/B.6h_5p9b1/BUILD/ldc-1.29.0-src/./gen/attributes.h:12, from /tmp/B.6h_5p9b1/BUILD/ldc-1.29.0-src/./gen/tollvm.h:22, from /tmp/B.6h_5p9b1/BUILD/ldc-1.29.0-src/./gen/dibuilder.h:12, from /tmp/B.6h_5p9b1/BUILD/ldc-1.29.0-src/./gen/irstate.h:18, from /tmp/B.6h_5p9b1/BUILD/ldc-1.29.0-src/./gen/abi-generic.h:17: /usr/include/llvm/IR/Type.h:380:9: note: declared here 380 | Type *getPointerElementType() const { | ^~~~~~~~~~~~~~~~~~~~~ /tmp/B.6h_5p9b1/BUILD/ldc-1.29.0-src/gen/abi-x86-64.cpp: In member function '{anonymous}::RegCount& X86_64TargetABI::getRegCount(IrFuncTy&)': /tmp/B.6h_5p9b1/BUILD/ldc-1.29.0-src/gen/abi-x86-64.cpp:194:45: warning: dereferencing type-punned pointer will break strict-aliasing rules [-Wstrict-aliasing] 194 | return reinterpret_cast<RegCount &>(fty.tag); | ~~~~^~~ [ 0%] Building CXX object CMakeFiles/LDCShared.dir/gen/abi-x86.cpp.o /usr/bin/x86_64-pld-linux-g++ -DLDC_ENABLE_PLUGINS -DLDC_LLVM_SUPPORTED_TARGET_AArch64=1 -DLDC_LLVM_SUPPORTED_TARGET_AMDGPU=1 -DLDC_LLVM_SUPPORTED_TARGET_ARM=1 -DLDC_LLVM_SUPPORTED_TARGET_AVR=1 -DLDC_LLVM_SUPPORTED_TARGET_BPF=1 -DLDC_LLVM_SUPPORTED_TARGET_Hexagon=1 -DLDC_LLVM_SUPPORTED_TARGET_Lanai=1 -DLDC_LLVM_SUPPORTED_TARGET_MSP430=1 -DLDC_LLVM_SUPPORTED_TARGET_Mips=1 -DLDC_LLVM_SUPPORTED_TARGET_NVPTX=1 -DLDC_LLVM_SUPPORTED_TARGET_PowerPC=1 -DLDC_LLVM_SUPPORTED_TARGET_RISCV=1 -DLDC_LLVM_SUPPORTED_TARGET_SPIRV=1 -DLDC_LLVM_SUPPORTED_TARGET_Sparc=1 -DLDC_LLVM_SUPPORTED_TARGET_SystemZ=1 -DLDC_LLVM_SUPPORTED_TARGET_VE=1 -DLDC_LLVM_SUPPORTED_TARGET_WebAssembly=1 -DLDC_LLVM_SUPPORTED_TARGET_X86=1 -DLDC_LLVM_SUPPORTED_TARGET_XCore=1 -I/tmp/B.6h_5p9b1/BUILD/ldc-1.29.0-src/. -I/tmp/B.6h_5p9b1/BUILD/ldc-1.29.0-src/dmd -DDMDV2 -O2 -fwrapv -pipe -Wformat -Werror=format-security -gdwarf-4 -fno-debug-types-section -fvar-tracking-assignments -g2 -Wp,-D_FORTIFY_SOURCE=2 -fstack-protector-strong --param=ssp-buffer-size=4 -Werror=trampolines -fPIC -march=x86-64 -mtune=generic -gdwarf-4 -fno-debug-types-section -fvar-tracking-assignments -g2 -DNDEBUG -DQT_NO_DEBUG -I/usr/include -std=c++14 -fno-exceptions -D_GNU_SOURCE -D__STDC_CONSTANT_MACROS -D__STDC_FORMAT_MACROS -D__STDC_LIMIT_MACROS -fno-rtti -Wall -Wextra -Wno-unused-parameter -Wno-comment -Wno-missing-field-initializers -Wno-non-virtual-dtor -Wno-pedantic -fvisibility-inlines-hidden -DLDC_POSIX -DIN_LLVM -DOPAQUE_VTBLS "-DLDC_INSTALL_PREFIX=R\"(/usr)\"" -DLDC_LLVM_VER=1500 "-DLDC_LIBDIR_SUFFIX=R\"(64)\"" -DLDC_HOST_LDMD=1 -DLDC_HOST_FE_VER=2097 "-DLDC_LLVM_LIBDIR=R\"(/usr/lib64)\"" -DNDEBUG -MD -MT CMakeFiles/LDCShared.dir/gen/abi-x86.cpp.o -MF CMakeFiles/LDCShared.dir/gen/abi-x86.cpp.o.d -o CMakeFiles/LDCShared.dir/gen/abi-x86.cpp.o -c /tmp/B.6h_5p9b1/BUILD/ldc-1.29.0-src/gen/abi-x86.cpp In file included from /tmp/B.6h_5p9b1/BUILD/ldc-1.29.0-src/gen/abi-x86.cpp:12: /tmp/B.6h_5p9b1/BUILD/ldc-1.29.0-src/./gen/abi-generic.h: In member function 'virtual llvm::Value* BaseBitcastABIRewrite::put(DValue*, bool, bool)': /tmp/B.6h_5p9b1/BUILD/ldc-1.29.0-src/./gen/abi-generic.h:142:68: warning: 'llvm::Type* llvm::Type::getPointerElementType() const' is deprecated: Deprecated without replacement, see https://llvm.org/docs/OpaquePointers.html for context and migration instructions [-Wdeprecated-declarations] 142 | LLType *pointeeType = address->getType()->getPointerElementType(); | ~~~~~~~~~~~~~~~~~~~~~~~~~~~~~~~~~~~~~~~~~^~ In file included from /tmp/B.6h_5p9b1/BUILD/ldc-1.29.0-src/./gen/llvm.h:20, from /tmp/B.6h_5p9b1/BUILD/ldc-1.29.0-src/./gen/attributes.h:12, from /tmp/B.6h_5p9b1/BUILD/ldc-1.29.0-src/./gen/tollvm.h:22, from /tmp/B.6h_5p9b1/BUILD/ldc-1.29.0-src/./gen/dibuilder.h:12, from /tmp/B.6h_5p9b1/BUILD/ldc-1.29.0-src/./gen/irstate.h:18, from /tmp/B.6h_5p9b1/BUILD/ldc-1.29.0-src/./gen/abi-generic.h:17: /usr/include/llvm/IR/Type.h:380:9: note: declared here 380 | Type *getPointerElementType() const { | ^~~~~~~~~~~~~~~~~~~~~ /tmp/B.6h_5p9b1/BUILD/ldc-1.29.0-src/gen/abi-x86.cpp: In member function 'void X86TargetABI::workaroundIssue1356(std::vector<IrFuncTyArg*>&) const': /tmp/B.6h_5p9b1/BUILD/ldc-1.29.0-src/gen/abi-x86.cpp:270:51: warning: 'T llvm::Optional<T>::getValueOr(U&&) && [with U = llvm::Align&; T = llvm::Align]' is deprecated: Use value_or instead. [-Wdeprecated-declarations] 270 | if (arg->attrs.getAlignment().getValueOr(align4) > align4) | ~~~~~~~~~~~~~~~~~~~~~~~~~~~~~~~~~~~~^~~~~~~~ In file included from /usr/include/llvm/Support/VersionTuple.h:19, from /usr/include/llvm/ADT/Triple.h:13, from /tmp/B.6h_5p9b1/BUILD/ldc-1.29.0-src/./dmd/globals.h:20, from /tmp/B.6h_5p9b1/BUILD/ldc-1.29.0-src/./dmd/dsymbol.h:15, from /tmp/B.6h_5p9b1/BUILD/ldc-1.29.0-src/./dmd/enum.h:13, from /tmp/B.6h_5p9b1/BUILD/ldc-1.29.0-src/gen/abi-x86.cpp:10: /usr/include/llvm/ADT/Optional.h:343:45: note: declared here 343 | [[deprecated("Use value_or instead.")]] T getValueOr(U &&alt) && { | ^~~~~~~~~~ [ 6%] Building CXX object CMakeFiles/LDCShared.dir/gen/abi.cpp.o /usr/bin/x86_64-pld-linux-g++ -DLDC_ENABLE_PLUGINS -DLDC_LLVM_SUPPORTED_TARGET_AArch64=1 -DLDC_LLVM_SUPPORTED_TARGET_AMDGPU=1 -DLDC_LLVM_SUPPORTED_TARGET_ARM=1 -DLDC_LLVM_SUPPORTED_TARGET_AVR=1 -DLDC_LLVM_SUPPORTED_TARGET_BPF=1 -DLDC_LLVM_SUPPORTED_TARGET_Hexagon=1 -DLDC_LLVM_SUPPORTED_TARGET_Lanai=1 -DLDC_LLVM_SUPPORTED_TARGET_MSP430=1 -DLDC_LLVM_SUPPORTED_TARGET_Mips=1 -DLDC_LLVM_SUPPORTED_TARGET_NVPTX=1 -DLDC_LLVM_SUPPORTED_TARGET_PowerPC=1 -DLDC_LLVM_SUPPORTED_TARGET_RISCV=1 -DLDC_LLVM_SUPPORTED_TARGET_SPIRV=1 -DLDC_LLVM_SUPPORTED_TARGET_Sparc=1 -DLDC_LLVM_SUPPORTED_TARGET_SystemZ=1 -DLDC_LLVM_SUPPORTED_TARGET_VE=1 -DLDC_LLVM_SUPPORTED_TARGET_WebAssembly=1 -DLDC_LLVM_SUPPORTED_TARGET_X86=1 -DLDC_LLVM_SUPPORTED_TARGET_XCore=1 -I/tmp/B.6h_5p9b1/BUILD/ldc-1.29.0-src/. -I/tmp/B.6h_5p9b1/BUILD/ldc-1.29.0-src/dmd -DDMDV2 -O2 -fwrapv -pipe -Wformat -Werror=format-security -gdwarf-4 -fno-debug-types-section -fvar-tracking-assignments -g2 -Wp,-D_FORTIFY_SOURCE=2 -fstack-protector-strong --param=ssp-buffer-size=4 -Werror=trampolines -fPIC -march=x86-64 -mtune=generic -gdwarf-4 -fno-debug-types-section -fvar-tracking-assignments -g2 -DNDEBUG -DQT_NO_DEBUG -I/usr/include -std=c++14 -fno-exceptions -D_GNU_SOURCE -D__STDC_CONSTANT_MACROS -D__STDC_FORMAT_MACROS -D__STDC_LIMIT_MACROS -fno-rtti -Wall -Wextra -Wno-unused-parameter -Wno-comment -Wno-missing-field-initializers -Wno-non-virtual-dtor -Wno-pedantic -fvisibility-inlines-hidden -DLDC_POSIX -DIN_LLVM -DOPAQUE_VTBLS "-DLDC_INSTALL_PREFIX=R\"(/usr)\"" -DLDC_LLVM_VER=1500 "-DLDC_LIBDIR_SUFFIX=R\"(64)\"" -DLDC_HOST_LDMD=1 -DLDC_HOST_FE_VER=2097 "-DLDC_LLVM_LIBDIR=R\"(/usr/lib64)\"" -DNDEBUG -MD -MT CMakeFiles/LDCShared.dir/gen/abi.cpp.o -MF CMakeFiles/LDCShared.dir/gen/abi.cpp.o.d -o CMakeFiles/LDCShared.dir/gen/abi.cpp.o -c /tmp/B.6h_5p9b1/BUILD/ldc-1.29.0-src/gen/abi.cpp In file included from /tmp/B.6h_5p9b1/BUILD/ldc-1.29.0-src/gen/abi.cpp:18: /tmp/B.6h_5p9b1/BUILD/ldc-1.29.0-src/./gen/abi-generic.h: In member function 'virtual llvm::Value* BaseBitcastABIRewrite::put(DValue*, bool, bool)': /tmp/B.6h_5p9b1/BUILD/ldc-1.29.0-src/./gen/abi-generic.h:142:68: warning: 'llvm::Type* llvm::Type::getPointerElementType() const' is deprecated: Deprecated without replacement, see https://llvm.org/docs/OpaquePointers.html for context and migration instructions [-Wdeprecated-declarations] 142 | LLType *pointeeType = address->getType()->getPointerElementType(); | ~~~~~~~~~~~~~~~~~~~~~~~~~~~~~~~~~~~~~~~~~^~ In file included from /tmp/B.6h_5p9b1/BUILD/ldc-1.29.0-src/./gen/llvm.h:20, from /tmp/B.6h_5p9b1/BUILD/ldc-1.29.0-src/./gen/attributes.h:12, from /tmp/B.6h_5p9b1/BUILD/ldc-1.29.0-src/./gen/tollvm.h:22, from /tmp/B.6h_5p9b1/BUILD/ldc-1.29.0-src/./gen/dibuilder.h:12, from /tmp/B.6h_5p9b1/BUILD/ldc-1.29.0-src/./gen/irstate.h:18, from /tmp/B.6h_5p9b1/BUILD/ldc-1.29.0-src/./gen/abi-generic.h:17: /usr/include/llvm/IR/Type.h:380:9: note: declared here 380 | Type *getPointerElementType() const { | ^~~~~~~~~~~~~~~~~~~~~ [ 6%] Building CXX object CMakeFiles/LDCShared.dir/gen/arrays.cpp.o /usr/bin/x86_64-pld-linux-g++ -DLDC_ENABLE_PLUGINS -DLDC_LLVM_SUPPORTED_TARGET_AArch64=1 -DLDC_LLVM_SUPPORTED_TARGET_AMDGPU=1 -DLDC_LLVM_SUPPORTED_TARGET_ARM=1 -DLDC_LLVM_SUPPORTED_TARGET_AVR=1 -DLDC_LLVM_SUPPORTED_TARGET_BPF=1 -DLDC_LLVM_SUPPORTED_TARGET_Hexagon=1 -DLDC_LLVM_SUPPORTED_TARGET_Lanai=1 -DLDC_LLVM_SUPPORTED_TARGET_MSP430=1 -DLDC_LLVM_SUPPORTED_TARGET_Mips=1 -DLDC_LLVM_SUPPORTED_TARGET_NVPTX=1 -DLDC_LLVM_SUPPORTED_TARGET_PowerPC=1 -DLDC_LLVM_SUPPORTED_TARGET_RISCV=1 -DLDC_LLVM_SUPPORTED_TARGET_SPIRV=1 -DLDC_LLVM_SUPPORTED_TARGET_Sparc=1 -DLDC_LLVM_SUPPORTED_TARGET_SystemZ=1 -DLDC_LLVM_SUPPORTED_TARGET_VE=1 -DLDC_LLVM_SUPPORTED_TARGET_WebAssembly=1 -DLDC_LLVM_SUPPORTED_TARGET_X86=1 -DLDC_LLVM_SUPPORTED_TARGET_XCore=1 -I/tmp/B.6h_5p9b1/BUILD/ldc-1.29.0-src/. -I/tmp/B.6h_5p9b1/BUILD/ldc-1.29.0-src/dmd -DDMDV2 -O2 -fwrapv -pipe -Wformat -Werror=format-security -gdwarf-4 -fno-debug-types-section -fvar-tracking-assignments -g2 -Wp,-D_FORTIFY_SOURCE=2 -fstack-protector-strong --param=ssp-buffer-size=4 -Werror=trampolines -fPIC -march=x86-64 -mtune=generic -gdwarf-4 -fno-debug-types-section -fvar-tracking-assignments -g2 -DNDEBUG -DQT_NO_DEBUG -I/usr/include -std=c++14 -fno-exceptions -D_GNU_SOURCE -D__STDC_CONSTANT_MACROS -D__STDC_FORMAT_MACROS -D__STDC_LIMIT_MACROS -fno-rtti -Wall -Wextra -Wno-unused-parameter -Wno-comment -Wno-missing-field-initializers -Wno-non-virtual-dtor -Wno-pedantic -fvisibility-inlines-hidden -DLDC_POSIX -DIN_LLVM -DOPAQUE_VTBLS "-DLDC_INSTALL_PREFIX=R\"(/usr)\"" -DLDC_LLVM_VER=1500 "-DLDC_LIBDIR_SUFFIX=R\"(64)\"" -DLDC_HOST_LDMD=1 -DLDC_HOST_FE_VER=2097 "-DLDC_LLVM_LIBDIR=R\"(/usr/lib64)\"" -DNDEBUG -MD -MT CMakeFiles/LDCShared.dir/gen/arrays.cpp.o -MF CMakeFiles/LDCShared.dir/gen/arrays.cpp.o.d -o CMakeFiles/LDCShared.dir/gen/arrays.cpp.o -c /tmp/B.6h_5p9b1/BUILD/ldc-1.29.0-src/gen/arrays.cpp /tmp/B.6h_5p9b1/BUILD/ldc-1.29.0-src/gen/arrays.cpp: In function 'DSliceValue* DtoCatArrays(const Loc&, Type*, Expression*, Expression*)': /tmp/B.6h_5p9b1/BUILD/ldc-1.29.0-src/gen/arrays.cpp:879:76: warning: 'llvm::Type* llvm::Type::getPointerElementType() const' is deprecated: Deprecated without replacement, see https://llvm.org/docs/OpaquePointers.html for context and migration instructions [-Wdeprecated-declarations] 879 | LLStructType *arraytype = isaStruct(ptrarraytype->getPointerElementType()); | ~~~~~~~~~~~~~~~~~~~~~~~~~~~~~~~~~~~^~ In file included from /tmp/B.6h_5p9b1/BUILD/ldc-1.29.0-src/./gen/llvm.h:20, from /tmp/B.6h_5p9b1/BUILD/ldc-1.29.0-src/./gen/arrays.h:17, from /tmp/B.6h_5p9b1/BUILD/ldc-1.29.0-src/gen/arrays.cpp:10: /usr/include/llvm/IR/Type.h:380:9: note: declared here 380 | Type *getPointerElementType() const { | ^~~~~~~~~~~~~~~~~~~~~ [ 6%] Building CXX object CMakeFiles/LDCShared.dir/gen/asm-gcc.cpp.o /usr/bin/x86_64-pld-linux-g++ -DLDC_ENABLE_PLUGINS -DLDC_LLVM_SUPPORTED_TARGET_AArch64=1 -DLDC_LLVM_SUPPORTED_TARGET_AMDGPU=1 -DLDC_LLVM_SUPPORTED_TARGET_ARM=1 -DLDC_LLVM_SUPPORTED_TARGET_AVR=1 -DLDC_LLVM_SUPPORTED_TARGET_BPF=1 -DLDC_LLVM_SUPPORTED_TARGET_Hexagon=1 -DLDC_LLVM_SUPPORTED_TARGET_Lanai=1 -DLDC_LLVM_SUPPORTED_TARGET_MSP430=1 -DLDC_LLVM_SUPPORTED_TARGET_Mips=1 -DLDC_LLVM_SUPPORTED_TARGET_NVPTX=1 -DLDC_LLVM_SUPPORTED_TARGET_PowerPC=1 -DLDC_LLVM_SUPPORTED_TARGET_RISCV=1 -DLDC_LLVM_SUPPORTED_TARGET_SPIRV=1 -DLDC_LLVM_SUPPORTED_TARGET_Sparc=1 -DLDC_LLVM_SUPPORTED_TARGET_SystemZ=1 -DLDC_LLVM_SUPPORTED_TARGET_VE=1 -DLDC_LLVM_SUPPORTED_TARGET_WebAssembly=1 -DLDC_LLVM_SUPPORTED_TARGET_X86=1 -DLDC_LLVM_SUPPORTED_TARGET_XCore=1 -I/tmp/B.6h_5p9b1/BUILD/ldc-1.29.0-src/. -I/tmp/B.6h_5p9b1/BUILD/ldc-1.29.0-src/dmd -DDMDV2 -O2 -fwrapv -pipe -Wformat -Werror=format-security -gdwarf-4 -fno-debug-types-section -fvar-tracking-assignments -g2 -Wp,-D_FORTIFY_SOURCE=2 -fstack-protector-strong --param=ssp-buffer-size=4 -Werror=trampolines -fPIC -march=x86-64 -mtune=generic -gdwarf-4 -fno-debug-types-section -fvar-tracking-assignments -g2 -DNDEBUG -DQT_NO_DEBUG -I/usr/include -std=c++14 -fno-exceptions -D_GNU_SOURCE -D__STDC_CONSTANT_MACROS -D__STDC_FORMAT_MACROS -D__STDC_LIMIT_MACROS -fno-rtti -Wall -Wextra -Wno-unused-parameter -Wno-comment -Wno-missing-field-initializers -Wno-non-virtual-dtor -Wno-pedantic -fvisibility-inlines-hidden -DLDC_POSIX -DIN_LLVM -DOPAQUE_VTBLS "-DLDC_INSTALL_PREFIX=R\"(/usr)\"" -DLDC_LLVM_VER=1500 "-DLDC_LIBDIR_SUFFIX=R\"(64)\"" -DLDC_HOST_LDMD=1 -DLDC_HOST_FE_VER=2097 "-DLDC_LLVM_LIBDIR=R\"(/usr/lib64)\"" -DNDEBUG -MD -MT CMakeFiles/LDCShared.dir/gen/asm-gcc.cpp.o -MF CMakeFiles/LDCShared.dir/gen/asm-gcc.cpp.o.d -o CMakeFiles/LDCShared.dir/gen/asm-gcc.cpp.o -c /tmp/B.6h_5p9b1/BUILD/ldc-1.29.0-src/gen/asm-gcc.cpp /tmp/B.6h_5p9b1/BUILD/ldc-1.29.0-src/gen/asm-gcc.cpp: In function 'void GccAsmStatement_toIR(GccAsmStatement*, IRState*)': /tmp/B.6h_5p9b1/BUILD/ldc-1.29.0-src/gen/asm-gcc.cpp:217:71: warning: 'llvm::Type* llvm::Type::getPointerElementType() const' is deprecated: Deprecated without replacement, see https://llvm.org/docs/OpaquePointers.html for context and migration instructions [-Wdeprecated-declarations] 217 | outputTypes.push_back(lval->getType()->getPointerElementType()); | ~~~~~~~~~~~~~~~~~~~~~~~~~~~~~~~~~~~~~~^~ In file included from /tmp/B.6h_5p9b1/BUILD/ldc-1.29.0-src/./gen/llvm.h:20, from /tmp/B.6h_5p9b1/BUILD/ldc-1.29.0-src/./gen/attributes.h:12, from /tmp/B.6h_5p9b1/BUILD/ldc-1.29.0-src/./gen/tollvm.h:22, from /tmp/B.6h_5p9b1/BUILD/ldc-1.29.0-src/./gen/dibuilder.h:12, from /tmp/B.6h_5p9b1/BUILD/ldc-1.29.0-src/./gen/irstate.h:18, from /tmp/B.6h_5p9b1/BUILD/ldc-1.29.0-src/gen/asm-gcc.cpp:13: /usr/include/llvm/IR/Type.h:380:9: note: declared here 380 | Type *getPointerElementType() const { | ^~~~~~~~~~~~~~~~~~~~~ [ 6%] Building CXX object CMakeFiles/LDCShared.dir/gen/asmstmt.cpp.o /usr/bin/x86_64-pld-linux-g++ -DLDC_ENABLE_PLUGINS -DLDC_LLVM_SUPPORTED_TARGET_AArch64=1 -DLDC_LLVM_SUPPORTED_TARGET_AMDGPU=1 -DLDC_LLVM_SUPPORTED_TARGET_ARM=1 -DLDC_LLVM_SUPPORTED_TARGET_AVR=1 -DLDC_LLVM_SUPPORTED_TARGET_BPF=1 -DLDC_LLVM_SUPPORTED_TARGET_Hexagon=1 -DLDC_LLVM_SUPPORTED_TARGET_Lanai=1 -DLDC_LLVM_SUPPORTED_TARGET_MSP430=1 -DLDC_LLVM_SUPPORTED_TARGET_Mips=1 -DLDC_LLVM_SUPPORTED_TARGET_NVPTX=1 -DLDC_LLVM_SUPPORTED_TARGET_PowerPC=1 -DLDC_LLVM_SUPPORTED_TARGET_RISCV=1 -DLDC_LLVM_SUPPORTED_TARGET_SPIRV=1 -DLDC_LLVM_SUPPORTED_TARGET_Sparc=1 -DLDC_LLVM_SUPPORTED_TARGET_SystemZ=1 -DLDC_LLVM_SUPPORTED_TARGET_VE=1 -DLDC_LLVM_SUPPORTED_TARGET_WebAssembly=1 -DLDC_LLVM_SUPPORTED_TARGET_X86=1 -DLDC_LLVM_SUPPORTED_TARGET_XCore=1 -I/tmp/B.6h_5p9b1/BUILD/ldc-1.29.0-src/. -I/tmp/B.6h_5p9b1/BUILD/ldc-1.29.0-src/dmd -DDMDV2 -O2 -fwrapv -pipe -Wformat -Werror=format-security -gdwarf-4 -fno-debug-types-section -fvar-tracking-assignments -g2 -Wp,-D_FORTIFY_SOURCE=2 -fstack-protector-strong --param=ssp-buffer-size=4 -Werror=trampolines -fPIC -march=x86-64 -mtune=generic -gdwarf-4 -fno-debug-types-section -fvar-tracking-assignments -g2 -DNDEBUG -DQT_NO_DEBUG -I/usr/include -std=c++14 -fno-exceptions -D_GNU_SOURCE -D__STDC_CONSTANT_MACROS -D__STDC_FORMAT_MACROS -D__STDC_LIMIT_MACROS -fno-rtti -Wall -Wextra -Wno-unused-parameter -Wno-comment -Wno-missing-field-initializers -Wno-non-virtual-dtor -Wno-pedantic -fvisibility-inlines-hidden -DLDC_POSIX -DIN_LLVM -DOPAQUE_VTBLS "-DLDC_INSTALL_PREFIX=R\"(/usr)\"" -DLDC_LLVM_VER=1500 "-DLDC_LIBDIR_SUFFIX=R\"(64)\"" -DLDC_HOST_LDMD=1 -DLDC_HOST_FE_VER=2097 "-DLDC_LLVM_LIBDIR=R\"(/usr/lib64)\"" -DNDEBUG -MD -MT CMakeFiles/LDCShared.dir/gen/asmstmt.cpp.o -MF CMakeFiles/LDCShared.dir/gen/asmstmt.cpp.o.d -o CMakeFiles/LDCShared.dir/gen/asmstmt.cpp.o -c /tmp/B.6h_5p9b1/BUILD/ldc-1.29.0-src/gen/asmstmt.cpp In file included from /tmp/B.6h_5p9b1/BUILD/ldc-1.29.0-src/gen/asmstmt.cpp:73: /tmp/B.6h_5p9b1/BUILD/ldc-1.29.0-src/gen/asm-x86.h: In member function 'void AsmParserx8632::AsmProcessor::doInstruction()': /tmp/B.6h_5p9b1/BUILD/ldc-1.29.0-src/gen/asm-x86.h:2204:11: warning: 'void* memset(void*, int, size_t)' clearing an object of type 'struct AsmParserx8632::AsmProcessor::Operand' with no trivial copy-assignment; use assignment or value-initialization instead [-Wclass-memaccess] 2204 | memset(operands, 0, sizeof(operands)); | ~~~~~~^~~~~~~~~~~~~~~~~~~~~~~~~~~~~~~ /tmp/B.6h_5p9b1/BUILD/ldc-1.29.0-src/gen/asm-x86.h:2027:10: note: 'struct AsmParserx8632::AsmProcessor::Operand' declared here 2027 | struct Operand { | ^~~~~~~ /tmp/B.6h_5p9b1/BUILD/ldc-1.29.0-src/gen/asm-x86.h: In member function 'void AsmParserx8632::AsmProcessor::doData()': /tmp/B.6h_5p9b1/BUILD/ldc-1.29.0-src/gen/asm-x86.h:3869:63: warning: dereferencing type-punned pointer will break strict-aliasing rules [-Wstrict-aliasing] 3869 | insnTemplate << reinterpret_cast<const d_uns32 &>(value); | ^~~~~ /tmp/B.6h_5p9b1/BUILD/ldc-1.29.0-src/gen/asm-x86.h:3872:63: warning: dereferencing type-punned pointer will break strict-aliasing rules [-Wstrict-aliasing] 3872 | insnTemplate << reinterpret_cast<const d_uns64 &>(value); | ^~~~~ In file included from /tmp/B.6h_5p9b1/BUILD/ldc-1.29.0-src/gen/asmstmt.cpp:75: /tmp/B.6h_5p9b1/BUILD/ldc-1.29.0-src/gen/asm-x86.h: In member function 'void AsmParserx8664::AsmProcessor::doInstruction()': /tmp/B.6h_5p9b1/BUILD/ldc-1.29.0-src/gen/asm-x86.h:2204:11: warning: 'void* memset(void*, int, size_t)' clearing an object of type 'struct AsmParserx8664::AsmProcessor::Operand' with no trivial copy-assignment; use assignment or value-initialization instead [-Wclass-memaccess] 2204 | memset(operands, 0, sizeof(operands)); | ~~~~~~^~~~~~~~~~~~~~~~~~~~~~~~~~~~~~~ /tmp/B.6h_5p9b1/BUILD/ldc-1.29.0-src/gen/asm-x86.h:2027:10: note: 'struct AsmParserx8664::AsmProcessor::Operand' declared here 2027 | struct Operand { | ^~~~~~~ /tmp/B.6h_5p9b1/BUILD/ldc-1.29.0-src/gen/asm-x86.h: In member function 'bool AsmParserx8664::AsmProcessor::formatInstruction(int, AsmCode*)': /tmp/B.6h_5p9b1/BUILD/ldc-1.29.0-src/gen/asm-x86.h:2615:13: warning: 'void* memset(void*, int, size_t)' clearing an object of type 'struct AsmParserx8664::AsmProcessor::Operand' with no trivial copy-assignment; use assignment or value-initialization instead [-Wclass-memaccess] 2615 | memset(operands, 0, sizeof(Operand)); | ~~~~~~^~~~~~~~~~~~~~~~~~~~~~~~~~~~~~ /tmp/B.6h_5p9b1/BUILD/ldc-1.29.0-src/gen/asm-x86.h:2027:10: note: 'struct AsmParserx8664::AsmProcessor::Operand' declared here 2027 | struct Operand { | ^~~~~~~ /tmp/B.6h_5p9b1/BUILD/ldc-1.29.0-src/gen/asm-x86.h: In member function 'void AsmParserx8664::AsmProcessor::doData()': /tmp/B.6h_5p9b1/BUILD/ldc-1.29.0-src/gen/asm-x86.h:3869:63: warning: dereferencing type-punned pointer will break strict-aliasing rules [-Wstrict-aliasing] 3869 | insnTemplate << reinterpret_cast<const d_uns32 &>(value); | ^~~~~ /tmp/B.6h_5p9b1/BUILD/ldc-1.29.0-src/gen/asm-x86.h:3872:63: warning: dereferencing type-punned pointer will break strict-aliasing rules [-Wstrict-aliasing] 3872 | insnTemplate << reinterpret_cast<const d_uns64 &>(value); | ^~~~~ [ 6%] Building CXX object CMakeFiles/LDCShared.dir/gen/attributes.cpp.o /usr/bin/x86_64-pld-linux-g++ -DLDC_ENABLE_PLUGINS -DLDC_LLVM_SUPPORTED_TARGET_AArch64=1 -DLDC_LLVM_SUPPORTED_TARGET_AMDGPU=1 -DLDC_LLVM_SUPPORTED_TARGET_ARM=1 -DLDC_LLVM_SUPPORTED_TARGET_AVR=1 -DLDC_LLVM_SUPPORTED_TARGET_BPF=1 -DLDC_LLVM_SUPPORTED_TARGET_Hexagon=1 -DLDC_LLVM_SUPPORTED_TARGET_Lanai=1 -DLDC_LLVM_SUPPORTED_TARGET_MSP430=1 -DLDC_LLVM_SUPPORTED_TARGET_Mips=1 -DLDC_LLVM_SUPPORTED_TARGET_NVPTX=1 -DLDC_LLVM_SUPPORTED_TARGET_PowerPC=1 -DLDC_LLVM_SUPPORTED_TARGET_RISCV=1 -DLDC_LLVM_SUPPORTED_TARGET_SPIRV=1 -DLDC_LLVM_SUPPORTED_TARGET_Sparc=1 -DLDC_LLVM_SUPPORTED_TARGET_SystemZ=1 -DLDC_LLVM_SUPPORTED_TARGET_VE=1 -DLDC_LLVM_SUPPORTED_TARGET_WebAssembly=1 -DLDC_LLVM_SUPPORTED_TARGET_X86=1 -DLDC_LLVM_SUPPORTED_TARGET_XCore=1 -I/tmp/B.6h_5p9b1/BUILD/ldc-1.29.0-src/. -I/tmp/B.6h_5p9b1/BUILD/ldc-1.29.0-src/dmd -DDMDV2 -O2 -fwrapv -pipe -Wformat -Werror=format-security -gdwarf-4 -fno-debug-types-section -fvar-tracking-assignments -g2 -Wp,-D_FORTIFY_SOURCE=2 -fstack-protector-strong --param=ssp-buffer-size=4 -Werror=trampolines -fPIC -march=x86-64 -mtune=generic -gdwarf-4 -fno-debug-types-section -fvar-tracking-assignments -g2 -DNDEBUG -DQT_NO_DEBUG -I/usr/include -std=c++14 -fno-exceptions -D_GNU_SOURCE -D__STDC_CONSTANT_MACROS -D__STDC_FORMAT_MACROS -D__STDC_LIMIT_MACROS -fno-rtti -Wall -Wextra -Wno-unused-parameter -Wno-comment -Wno-missing-field-initializers -Wno-non-virtual-dtor -Wno-pedantic -fvisibility-inlines-hidden -DLDC_POSIX -DIN_LLVM -DOPAQUE_VTBLS "-DLDC_INSTALL_PREFIX=R\"(/usr)\"" -DLDC_LLVM_VER=1500 "-DLDC_LIBDIR_SUFFIX=R\"(64)\"" -DLDC_HOST_LDMD=1 -DLDC_HOST_FE_VER=2097 "-DLDC_LLVM_LIBDIR=R\"(/usr/lib64)\"" -DNDEBUG -MD -MT CMakeFiles/LDCShared.dir/gen/attributes.cpp.o -MF CMakeFiles/LDCShared.dir/gen/attributes.cpp.o.d -o CMakeFiles/LDCShared.dir/gen/attributes.cpp.o -c /tmp/B.6h_5p9b1/BUILD/ldc-1.29.0-src/gen/attributes.cpp [ 6%] Building CXX object CMakeFiles/LDCShared.dir/gen/binops.cpp.o /usr/bin/x86_64-pld-linux-g++ -DLDC_ENABLE_PLUGINS -DLDC_LLVM_SUPPORTED_TARGET_AArch64=1 -DLDC_LLVM_SUPPORTED_TARGET_AMDGPU=1 -DLDC_LLVM_SUPPORTED_TARGET_ARM=1 -DLDC_LLVM_SUPPORTED_TARGET_AVR=1 -DLDC_LLVM_SUPPORTED_TARGET_BPF=1 -DLDC_LLVM_SUPPORTED_TARGET_Hexagon=1 -DLDC_LLVM_SUPPORTED_TARGET_Lanai=1 -DLDC_LLVM_SUPPORTED_TARGET_MSP430=1 -DLDC_LLVM_SUPPORTED_TARGET_Mips=1 -DLDC_LLVM_SUPPORTED_TARGET_NVPTX=1 -DLDC_LLVM_SUPPORTED_TARGET_PowerPC=1 -DLDC_LLVM_SUPPORTED_TARGET_RISCV=1 -DLDC_LLVM_SUPPORTED_TARGET_SPIRV=1 -DLDC_LLVM_SUPPORTED_TARGET_Sparc=1 -DLDC_LLVM_SUPPORTED_TARGET_SystemZ=1 -DLDC_LLVM_SUPPORTED_TARGET_VE=1 -DLDC_LLVM_SUPPORTED_TARGET_WebAssembly=1 -DLDC_LLVM_SUPPORTED_TARGET_X86=1 -DLDC_LLVM_SUPPORTED_TARGET_XCore=1 -I/tmp/B.6h_5p9b1/BUILD/ldc-1.29.0-src/. -I/tmp/B.6h_5p9b1/BUILD/ldc-1.29.0-src/dmd -DDMDV2 -O2 -fwrapv -pipe -Wformat -Werror=format-security -gdwarf-4 -fno-debug-types-section -fvar-tracking-assignments -g2 -Wp,-D_FORTIFY_SOURCE=2 -fstack-protector-strong --param=ssp-buffer-size=4 -Werror=trampolines -fPIC -march=x86-64 -mtune=generic -gdwarf-4 -fno-debug-types-section -fvar-tracking-assignments -g2 -DNDEBUG -DQT_NO_DEBUG -I/usr/include -std=c++14 -fno-exceptions -D_GNU_SOURCE -D__STDC_CONSTANT_MACROS -D__STDC_FORMAT_MACROS -D__STDC_LIMIT_MACROS -fno-rtti -Wall -Wextra -Wno-unused-parameter -Wno-comment -Wno-missing-field-initializers -Wno-non-virtual-dtor -Wno-pedantic -fvisibility-inlines-hidden -DLDC_POSIX -DIN_LLVM -DOPAQUE_VTBLS "-DLDC_INSTALL_PREFIX=R\"(/usr)\"" -DLDC_LLVM_VER=1500 "-DLDC_LIBDIR_SUFFIX=R\"(64)\"" -DLDC_HOST_LDMD=1 -DLDC_HOST_FE_VER=2097 "-DLDC_LLVM_LIBDIR=R\"(/usr/lib64)\"" -DNDEBUG -MD -MT CMakeFiles/LDCShared.dir/gen/binops.cpp.o -MF CMakeFiles/LDCShared.dir/gen/binops.cpp.o.d -o CMakeFiles/LDCShared.dir/gen/binops.cpp.o -c /tmp/B.6h_5p9b1/BUILD/ldc-1.29.0-src/gen/binops.cpp [ 6%] Building CXX object CMakeFiles/LDCShared.dir/gen/cl_helpers.cpp.o /usr/bin/x86_64-pld-linux-g++ -DLDC_ENABLE_PLUGINS -DLDC_LLVM_SUPPORTED_TARGET_AArch64=1 -DLDC_LLVM_SUPPORTED_TARGET_AMDGPU=1 -DLDC_LLVM_SUPPORTED_TARGET_ARM=1 -DLDC_LLVM_SUPPORTED_TARGET_AVR=1 -DLDC_LLVM_SUPPORTED_TARGET_BPF=1 -DLDC_LLVM_SUPPORTED_TARGET_Hexagon=1 -DLDC_LLVM_SUPPORTED_TARGET_Lanai=1 -DLDC_LLVM_SUPPORTED_TARGET_MSP430=1 -DLDC_LLVM_SUPPORTED_TARGET_Mips=1 -DLDC_LLVM_SUPPORTED_TARGET_NVPTX=1 -DLDC_LLVM_SUPPORTED_TARGET_PowerPC=1 -DLDC_LLVM_SUPPORTED_TARGET_RISCV=1 -DLDC_LLVM_SUPPORTED_TARGET_SPIRV=1 -DLDC_LLVM_SUPPORTED_TARGET_Sparc=1 -DLDC_LLVM_SUPPORTED_TARGET_SystemZ=1 -DLDC_LLVM_SUPPORTED_TARGET_VE=1 -DLDC_LLVM_SUPPORTED_TARGET_WebAssembly=1 -DLDC_LLVM_SUPPORTED_TARGET_X86=1 -DLDC_LLVM_SUPPORTED_TARGET_XCore=1 -I/tmp/B.6h_5p9b1/BUILD/ldc-1.29.0-src/. -I/tmp/B.6h_5p9b1/BUILD/ldc-1.29.0-src/dmd -DDMDV2 -O2 -fwrapv -pipe -Wformat -Werror=format-security -gdwarf-4 -fno-debug-types-section -fvar-tracking-assignments -g2 -Wp,-D_FORTIFY_SOURCE=2 -fstack-protector-strong --param=ssp-buffer-size=4 -Werror=trampolines -fPIC -march=x86-64 -mtune=generic -gdwarf-4 -fno-debug-types-section -fvar-tracking-assignments -g2 -DNDEBUG -DQT_NO_DEBUG -I/usr/include -std=c++14 -fno-exceptions -D_GNU_SOURCE -D__STDC_CONSTANT_MACROS -D__STDC_FORMAT_MACROS -D__STDC_LIMIT_MACROS -fno-rtti -Wall -Wextra -Wno-unused-parameter -Wno-comment -Wno-missing-field-initializers -Wno-non-virtual-dtor -Wno-pedantic -fvisibility-inlines-hidden -DLDC_POSIX -DIN_LLVM -DOPAQUE_VTBLS "-DLDC_INSTALL_PREFIX=R\"(/usr)\"" -DLDC_LLVM_VER=1500 "-DLDC_LIBDIR_SUFFIX=R\"(64)\"" -DLDC_HOST_LDMD=1 -DLDC_HOST_FE_VER=2097 "-DLDC_LLVM_LIBDIR=R\"(/usr/lib64)\"" -DNDEBUG -MD -MT CMakeFiles/LDCShared.dir/gen/cl_helpers.cpp.o -MF CMakeFiles/LDCShared.dir/gen/cl_helpers.cpp.o.d -o CMakeFiles/LDCShared.dir/gen/cl_helpers.cpp.o -c /tmp/B.6h_5p9b1/BUILD/ldc-1.29.0-src/gen/cl_helpers.cpp [ 6%] Building CXX object CMakeFiles/LDCShared.dir/gen/classes.cpp.o /usr/bin/x86_64-pld-linux-g++ -DLDC_ENABLE_PLUGINS -DLDC_LLVM_SUPPORTED_TARGET_AArch64=1 -DLDC_LLVM_SUPPORTED_TARGET_AMDGPU=1 -DLDC_LLVM_SUPPORTED_TARGET_ARM=1 -DLDC_LLVM_SUPPORTED_TARGET_AVR=1 -DLDC_LLVM_SUPPORTED_TARGET_BPF=1 -DLDC_LLVM_SUPPORTED_TARGET_Hexagon=1 -DLDC_LLVM_SUPPORTED_TARGET_Lanai=1 -DLDC_LLVM_SUPPORTED_TARGET_MSP430=1 -DLDC_LLVM_SUPPORTED_TARGET_Mips=1 -DLDC_LLVM_SUPPORTED_TARGET_NVPTX=1 -DLDC_LLVM_SUPPORTED_TARGET_PowerPC=1 -DLDC_LLVM_SUPPORTED_TARGET_RISCV=1 -DLDC_LLVM_SUPPORTED_TARGET_SPIRV=1 -DLDC_LLVM_SUPPORTED_TARGET_Sparc=1 -DLDC_LLVM_SUPPORTED_TARGET_SystemZ=1 -DLDC_LLVM_SUPPORTED_TARGET_VE=1 -DLDC_LLVM_SUPPORTED_TARGET_WebAssembly=1 -DLDC_LLVM_SUPPORTED_TARGET_X86=1 -DLDC_LLVM_SUPPORTED_TARGET_XCore=1 -I/tmp/B.6h_5p9b1/BUILD/ldc-1.29.0-src/. -I/tmp/B.6h_5p9b1/BUILD/ldc-1.29.0-src/dmd -DDMDV2 -O2 -fwrapv -pipe -Wformat -Werror=format-security -gdwarf-4 -fno-debug-types-section -fvar-tracking-assignments -g2 -Wp,-D_FORTIFY_SOURCE=2 -fstack-protector-strong --param=ssp-buffer-size=4 -Werror=trampolines -fPIC -march=x86-64 -mtune=generic -gdwarf-4 -fno-debug-types-section -fvar-tracking-assignments -g2 -DNDEBUG -DQT_NO_DEBUG -I/usr/include -std=c++14 -fno-exceptions -D_GNU_SOURCE -D__STDC_CONSTANT_MACROS -D__STDC_FORMAT_MACROS -D__STDC_LIMIT_MACROS -fno-rtti -Wall -Wextra -Wno-unused-parameter -Wno-comment -Wno-missing-field-initializers -Wno-non-virtual-dtor -Wno-pedantic -fvisibility-inlines-hidden -DLDC_POSIX -DIN_LLVM -DOPAQUE_VTBLS "-DLDC_INSTALL_PREFIX=R\"(/usr)\"" -DLDC_LLVM_VER=1500 "-DLDC_LIBDIR_SUFFIX=R\"(64)\"" -DLDC_HOST_LDMD=1 -DLDC_HOST_FE_VER=2097 "-DLDC_LLVM_LIBDIR=R\"(/usr/lib64)\"" -DNDEBUG -MD -MT CMakeFiles/LDCShared.dir/gen/classes.cpp.o -MF CMakeFiles/LDCShared.dir/gen/classes.cpp.o.d -o CMakeFiles/LDCShared.dir/gen/classes.cpp.o -c /tmp/B.6h_5p9b1/BUILD/ldc-1.29.0-src/gen/classes.cpp [ 6%] Building CXX object CMakeFiles/LDCShared.dir/gen/complex.cpp.o /usr/bin/x86_64-pld-linux-g++ -DLDC_ENABLE_PLUGINS -DLDC_LLVM_SUPPORTED_TARGET_AArch64=1 -DLDC_LLVM_SUPPORTED_TARGET_AMDGPU=1 -DLDC_LLVM_SUPPORTED_TARGET_ARM=1 -DLDC_LLVM_SUPPORTED_TARGET_AVR=1 -DLDC_LLVM_SUPPORTED_TARGET_BPF=1 -DLDC_LLVM_SUPPORTED_TARGET_Hexagon=1 -DLDC_LLVM_SUPPORTED_TARGET_Lanai=1 -DLDC_LLVM_SUPPORTED_TARGET_MSP430=1 -DLDC_LLVM_SUPPORTED_TARGET_Mips=1 -DLDC_LLVM_SUPPORTED_TARGET_NVPTX=1 -DLDC_LLVM_SUPPORTED_TARGET_PowerPC=1 -DLDC_LLVM_SUPPORTED_TARGET_RISCV=1 -DLDC_LLVM_SUPPORTED_TARGET_SPIRV=1 -DLDC_LLVM_SUPPORTED_TARGET_Sparc=1 -DLDC_LLVM_SUPPORTED_TARGET_SystemZ=1 -DLDC_LLVM_SUPPORTED_TARGET_VE=1 -DLDC_LLVM_SUPPORTED_TARGET_WebAssembly=1 -DLDC_LLVM_SUPPORTED_TARGET_X86=1 -DLDC_LLVM_SUPPORTED_TARGET_XCore=1 -I/tmp/B.6h_5p9b1/BUILD/ldc-1.29.0-src/. -I/tmp/B.6h_5p9b1/BUILD/ldc-1.29.0-src/dmd -DDMDV2 -O2 -fwrapv -pipe -Wformat -Werror=format-security -gdwarf-4 -fno-debug-types-section -fvar-tracking-assignments -g2 -Wp,-D_FORTIFY_SOURCE=2 -fstack-protector-strong --param=ssp-buffer-size=4 -Werror=trampolines -fPIC -march=x86-64 -mtune=generic -gdwarf-4 -fno-debug-types-section -fvar-tracking-assignments -g2 -DNDEBUG -DQT_NO_DEBUG -I/usr/include -std=c++14 -fno-exceptions -D_GNU_SOURCE -D__STDC_CONSTANT_MACROS -D__STDC_FORMAT_MACROS -D__STDC_LIMIT_MACROS -fno-rtti -Wall -Wextra -Wno-unused-parameter -Wno-comment -Wno-missing-field-initializers -Wno-non-virtual-dtor -Wno-pedantic -fvisibility-inlines-hidden -DLDC_POSIX -DIN_LLVM -DOPAQUE_VTBLS "-DLDC_INSTALL_PREFIX=R\"(/usr)\"" -DLDC_LLVM_VER=1500 "-DLDC_LIBDIR_SUFFIX=R\"(64)\"" -DLDC_HOST_LDMD=1 -DLDC_HOST_FE_VER=2097 "-DLDC_LLVM_LIBDIR=R\"(/usr/lib64)\"" -DNDEBUG -MD -MT CMakeFiles/LDCShared.dir/gen/complex.cpp.o -MF CMakeFiles/LDCShared.dir/gen/complex.cpp.o.d -o CMakeFiles/LDCShared.dir/gen/complex.cpp.o -c /tmp/B.6h_5p9b1/BUILD/ldc-1.29.0-src/gen/complex.cpp [ 6%] Building CXX object CMakeFiles/LDCShared.dir/gen/coverage.cpp.o /usr/bin/x86_64-pld-linux-g++ -DLDC_ENABLE_PLUGINS -DLDC_LLVM_SUPPORTED_TARGET_AArch64=1 -DLDC_LLVM_SUPPORTED_TARGET_AMDGPU=1 -DLDC_LLVM_SUPPORTED_TARGET_ARM=1 -DLDC_LLVM_SUPPORTED_TARGET_AVR=1 -DLDC_LLVM_SUPPORTED_TARGET_BPF=1 -DLDC_LLVM_SUPPORTED_TARGET_Hexagon=1 -DLDC_LLVM_SUPPORTED_TARGET_Lanai=1 -DLDC_LLVM_SUPPORTED_TARGET_MSP430=1 -DLDC_LLVM_SUPPORTED_TARGET_Mips=1 -DLDC_LLVM_SUPPORTED_TARGET_NVPTX=1 -DLDC_LLVM_SUPPORTED_TARGET_PowerPC=1 -DLDC_LLVM_SUPPORTED_TARGET_RISCV=1 -DLDC_LLVM_SUPPORTED_TARGET_SPIRV=1 -DLDC_LLVM_SUPPORTED_TARGET_Sparc=1 -DLDC_LLVM_SUPPORTED_TARGET_SystemZ=1 -DLDC_LLVM_SUPPORTED_TARGET_VE=1 -DLDC_LLVM_SUPPORTED_TARGET_WebAssembly=1 -DLDC_LLVM_SUPPORTED_TARGET_X86=1 -DLDC_LLVM_SUPPORTED_TARGET_XCore=1 -I/tmp/B.6h_5p9b1/BUILD/ldc-1.29.0-src/. -I/tmp/B.6h_5p9b1/BUILD/ldc-1.29.0-src/dmd -DDMDV2 -O2 -fwrapv -pipe -Wformat -Werror=format-security -gdwarf-4 -fno-debug-types-section -fvar-tracking-assignments -g2 -Wp,-D_FORTIFY_SOURCE=2 -fstack-protector-strong --param=ssp-buffer-size=4 -Werror=trampolines -fPIC -march=x86-64 -mtune=generic -gdwarf-4 -fno-debug-types-section -fvar-tracking-assignments -g2 -DNDEBUG -DQT_NO_DEBUG -I/usr/include -std=c++14 -fno-exceptions -D_GNU_SOURCE -D__STDC_CONSTANT_MACROS -D__STDC_FORMAT_MACROS -D__STDC_LIMIT_MACROS -fno-rtti -Wall -Wextra -Wno-unused-parameter -Wno-comment -Wno-missing-field-initializers -Wno-non-virtual-dtor -Wno-pedantic -fvisibility-inlines-hidden -DLDC_POSIX -DIN_LLVM -DOPAQUE_VTBLS "-DLDC_INSTALL_PREFIX=R\"(/usr)\"" -DLDC_LLVM_VER=1500 "-DLDC_LIBDIR_SUFFIX=R\"(64)\"" -DLDC_HOST_LDMD=1 -DLDC_HOST_FE_VER=2097 "-DLDC_LLVM_LIBDIR=R\"(/usr/lib64)\"" -DNDEBUG -MD -MT CMakeFiles/LDCShared.dir/gen/coverage.cpp.o -MF CMakeFiles/LDCShared.dir/gen/coverage.cpp.o.d -o CMakeFiles/LDCShared.dir/gen/coverage.cpp.o -c /tmp/B.6h_5p9b1/BUILD/ldc-1.29.0-src/gen/coverage.cpp [ 6%] Building CXX object CMakeFiles/LDCShared.dir/gen/ctfloat.cpp.o /usr/bin/x86_64-pld-linux-g++ -DLDC_ENABLE_PLUGINS -DLDC_LLVM_SUPPORTED_TARGET_AArch64=1 -DLDC_LLVM_SUPPORTED_TARGET_AMDGPU=1 -DLDC_LLVM_SUPPORTED_TARGET_ARM=1 -DLDC_LLVM_SUPPORTED_TARGET_AVR=1 -DLDC_LLVM_SUPPORTED_TARGET_BPF=1 -DLDC_LLVM_SUPPORTED_TARGET_Hexagon=1 -DLDC_LLVM_SUPPORTED_TARGET_Lanai=1 -DLDC_LLVM_SUPPORTED_TARGET_MSP430=1 -DLDC_LLVM_SUPPORTED_TARGET_Mips=1 -DLDC_LLVM_SUPPORTED_TARGET_NVPTX=1 -DLDC_LLVM_SUPPORTED_TARGET_PowerPC=1 -DLDC_LLVM_SUPPORTED_TARGET_RISCV=1 -DLDC_LLVM_SUPPORTED_TARGET_SPIRV=1 -DLDC_LLVM_SUPPORTED_TARGET_Sparc=1 -DLDC_LLVM_SUPPORTED_TARGET_SystemZ=1 -DLDC_LLVM_SUPPORTED_TARGET_VE=1 -DLDC_LLVM_SUPPORTED_TARGET_WebAssembly=1 -DLDC_LLVM_SUPPORTED_TARGET_X86=1 -DLDC_LLVM_SUPPORTED_TARGET_XCore=1 -I/tmp/B.6h_5p9b1/BUILD/ldc-1.29.0-src/. -I/tmp/B.6h_5p9b1/BUILD/ldc-1.29.0-src/dmd -DDMDV2 -O2 -fwrapv -pipe -Wformat -Werror=format-security -gdwarf-4 -fno-debug-types-section -fvar-tracking-assignments -g2 -Wp,-D_FORTIFY_SOURCE=2 -fstack-protector-strong --param=ssp-buffer-size=4 -Werror=trampolines -fPIC -march=x86-64 -mtune=generic -gdwarf-4 -fno-debug-types-section -fvar-tracking-assignments -g2 -DNDEBUG -DQT_NO_DEBUG -I/usr/include -std=c++14 -fno-exceptions -D_GNU_SOURCE -D__STDC_CONSTANT_MACROS -D__STDC_FORMAT_MACROS -D__STDC_LIMIT_MACROS -fno-rtti -Wall -Wextra -Wno-unused-parameter -Wno-comment -Wno-missing-field-initializers -Wno-non-virtual-dtor -Wno-pedantic -fvisibility-inlines-hidden -DLDC_POSIX -DIN_LLVM -DOPAQUE_VTBLS "-DLDC_INSTALL_PREFIX=R\"(/usr)\"" -DLDC_LLVM_VER=1500 "-DLDC_LIBDIR_SUFFIX=R\"(64)\"" -DLDC_HOST_LDMD=1 -DLDC_HOST_FE_VER=2097 "-DLDC_LLVM_LIBDIR=R\"(/usr/lib64)\"" -DNDEBUG -MD -MT CMakeFiles/LDCShared.dir/gen/ctfloat.cpp.o -MF CMakeFiles/LDCShared.dir/gen/ctfloat.cpp.o.d -o CMakeFiles/LDCShared.dir/gen/ctfloat.cpp.o -c /tmp/B.6h_5p9b1/BUILD/ldc-1.29.0-src/gen/ctfloat.cpp [ 6%] Building CXX object CMakeFiles/LDCShared.dir/gen/dcompute/druntime.cpp.o /usr/bin/x86_64-pld-linux-g++ -DLDC_ENABLE_PLUGINS -DLDC_LLVM_SUPPORTED_TARGET_AArch64=1 -DLDC_LLVM_SUPPORTED_TARGET_AMDGPU=1 -DLDC_LLVM_SUPPORTED_TARGET_ARM=1 -DLDC_LLVM_SUPPORTED_TARGET_AVR=1 -DLDC_LLVM_SUPPORTED_TARGET_BPF=1 -DLDC_LLVM_SUPPORTED_TARGET_Hexagon=1 -DLDC_LLVM_SUPPORTED_TARGET_Lanai=1 -DLDC_LLVM_SUPPORTED_TARGET_MSP430=1 -DLDC_LLVM_SUPPORTED_TARGET_Mips=1 -DLDC_LLVM_SUPPORTED_TARGET_NVPTX=1 -DLDC_LLVM_SUPPORTED_TARGET_PowerPC=1 -DLDC_LLVM_SUPPORTED_TARGET_RISCV=1 -DLDC_LLVM_SUPPORTED_TARGET_SPIRV=1 -DLDC_LLVM_SUPPORTED_TARGET_Sparc=1 -DLDC_LLVM_SUPPORTED_TARGET_SystemZ=1 -DLDC_LLVM_SUPPORTED_TARGET_VE=1 -DLDC_LLVM_SUPPORTED_TARGET_WebAssembly=1 -DLDC_LLVM_SUPPORTED_TARGET_X86=1 -DLDC_LLVM_SUPPORTED_TARGET_XCore=1 -I/tmp/B.6h_5p9b1/BUILD/ldc-1.29.0-src/. -I/tmp/B.6h_5p9b1/BUILD/ldc-1.29.0-src/dmd -DDMDV2 -O2 -fwrapv -pipe -Wformat -Werror=format-security -gdwarf-4 -fno-debug-types-section -fvar-tracking-assignments -g2 -Wp,-D_FORTIFY_SOURCE=2 -fstack-protector-strong --param=ssp-buffer-size=4 -Werror=trampolines -fPIC -march=x86-64 -mtune=generic -gdwarf-4 -fno-debug-types-section -fvar-tracking-assignments -g2 -DNDEBUG -DQT_NO_DEBUG -I/usr/include -std=c++14 -fno-exceptions -D_GNU_SOURCE -D__STDC_CONSTANT_MACROS -D__STDC_FORMAT_MACROS -D__STDC_LIMIT_MACROS -fno-rtti -Wall -Wextra -Wno-unused-parameter -Wno-comment -Wno-missing-field-initializers -Wno-non-virtual-dtor -Wno-pedantic -fvisibility-inlines-hidden -DLDC_POSIX -DIN_LLVM -DOPAQUE_VTBLS "-DLDC_INSTALL_PREFIX=R\"(/usr)\"" -DLDC_LLVM_VER=1500 "-DLDC_LIBDIR_SUFFIX=R\"(64)\"" -DLDC_HOST_LDMD=1 -DLDC_HOST_FE_VER=2097 "-DLDC_LLVM_LIBDIR=R\"(/usr/lib64)\"" -DNDEBUG -MD -MT CMakeFiles/LDCShared.dir/gen/dcompute/druntime.cpp.o -MF CMakeFiles/LDCShared.dir/gen/dcompute/druntime.cpp.o.d -o CMakeFiles/LDCShared.dir/gen/dcompute/druntime.cpp.o -c /tmp/B.6h_5p9b1/BUILD/ldc-1.29.0-src/gen/dcompute/druntime.cpp [ 12%] Building CXX object CMakeFiles/LDCShared.dir/gen/dcompute/target.cpp.o /usr/bin/x86_64-pld-linux-g++ -DLDC_ENABLE_PLUGINS -DLDC_LLVM_SUPPORTED_TARGET_AArch64=1 -DLDC_LLVM_SUPPORTED_TARGET_AMDGPU=1 -DLDC_LLVM_SUPPORTED_TARGET_ARM=1 -DLDC_LLVM_SUPPORTED_TARGET_AVR=1 -DLDC_LLVM_SUPPORTED_TARGET_BPF=1 -DLDC_LLVM_SUPPORTED_TARGET_Hexagon=1 -DLDC_LLVM_SUPPORTED_TARGET_Lanai=1 -DLDC_LLVM_SUPPORTED_TARGET_MSP430=1 -DLDC_LLVM_SUPPORTED_TARGET_Mips=1 -DLDC_LLVM_SUPPORTED_TARGET_NVPTX=1 -DLDC_LLVM_SUPPORTED_TARGET_PowerPC=1 -DLDC_LLVM_SUPPORTED_TARGET_RISCV=1 -DLDC_LLVM_SUPPORTED_TARGET_SPIRV=1 -DLDC_LLVM_SUPPORTED_TARGET_Sparc=1 -DLDC_LLVM_SUPPORTED_TARGET_SystemZ=1 -DLDC_LLVM_SUPPORTED_TARGET_VE=1 -DLDC_LLVM_SUPPORTED_TARGET_WebAssembly=1 -DLDC_LLVM_SUPPORTED_TARGET_X86=1 -DLDC_LLVM_SUPPORTED_TARGET_XCore=1 -I/tmp/B.6h_5p9b1/BUILD/ldc-1.29.0-src/. -I/tmp/B.6h_5p9b1/BUILD/ldc-1.29.0-src/dmd -DDMDV2 -O2 -fwrapv -pipe -Wformat -Werror=format-security -gdwarf-4 -fno-debug-types-section -fvar-tracking-assignments -g2 -Wp,-D_FORTIFY_SOURCE=2 -fstack-protector-strong --param=ssp-buffer-size=4 -Werror=trampolines -fPIC -march=x86-64 -mtune=generic -gdwarf-4 -fno-debug-types-section -fvar-tracking-assignments -g2 -DNDEBUG -DQT_NO_DEBUG -I/usr/include -std=c++14 -fno-exceptions -D_GNU_SOURCE -D__STDC_CONSTANT_MACROS -D__STDC_FORMAT_MACROS -D__STDC_LIMIT_MACROS -fno-rtti -Wall -Wextra -Wno-unused-parameter -Wno-comment -Wno-missing-field-initializers -Wno-non-virtual-dtor -Wno-pedantic -fvisibility-inlines-hidden -DLDC_POSIX -DIN_LLVM -DOPAQUE_VTBLS "-DLDC_INSTALL_PREFIX=R\"(/usr)\"" -DLDC_LLVM_VER=1500 "-DLDC_LIBDIR_SUFFIX=R\"(64)\"" -DLDC_HOST_LDMD=1 -DLDC_HOST_FE_VER=2097 "-DLDC_LLVM_LIBDIR=R\"(/usr/lib64)\"" -DNDEBUG -MD -MT CMakeFiles/LDCShared.dir/gen/dcompute/target.cpp.o -MF CMakeFiles/LDCShared.dir/gen/dcompute/target.cpp.o.d -o CMakeFiles/LDCShared.dir/gen/dcompute/target.cpp.o -c /tmp/B.6h_5p9b1/BUILD/ldc-1.29.0-src/gen/dcompute/target.cpp [ 12%] Building CXX object CMakeFiles/LDCShared.dir/gen/dcompute/targetCUDA.cpp.o /usr/bin/x86_64-pld-linux-g++ -DLDC_ENABLE_PLUGINS -DLDC_LLVM_SUPPORTED_TARGET_AArch64=1 -DLDC_LLVM_SUPPORTED_TARGET_AMDGPU=1 -DLDC_LLVM_SUPPORTED_TARGET_ARM=1 -DLDC_LLVM_SUPPORTED_TARGET_AVR=1 -DLDC_LLVM_SUPPORTED_TARGET_BPF=1 -DLDC_LLVM_SUPPORTED_TARGET_Hexagon=1 -DLDC_LLVM_SUPPORTED_TARGET_Lanai=1 -DLDC_LLVM_SUPPORTED_TARGET_MSP430=1 -DLDC_LLVM_SUPPORTED_TARGET_Mips=1 -DLDC_LLVM_SUPPORTED_TARGET_NVPTX=1 -DLDC_LLVM_SUPPORTED_TARGET_PowerPC=1 -DLDC_LLVM_SUPPORTED_TARGET_RISCV=1 -DLDC_LLVM_SUPPORTED_TARGET_SPIRV=1 -DLDC_LLVM_SUPPORTED_TARGET_Sparc=1 -DLDC_LLVM_SUPPORTED_TARGET_SystemZ=1 -DLDC_LLVM_SUPPORTED_TARGET_VE=1 -DLDC_LLVM_SUPPORTED_TARGET_WebAssembly=1 -DLDC_LLVM_SUPPORTED_TARGET_X86=1 -DLDC_LLVM_SUPPORTED_TARGET_XCore=1 -I/tmp/B.6h_5p9b1/BUILD/ldc-1.29.0-src/. -I/tmp/B.6h_5p9b1/BUILD/ldc-1.29.0-src/dmd -DDMDV2 -O2 -fwrapv -pipe -Wformat -Werror=format-security -gdwarf-4 -fno-debug-types-section -fvar-tracking-assignments -g2 -Wp,-D_FORTIFY_SOURCE=2 -fstack-protector-strong --param=ssp-buffer-size=4 -Werror=trampolines -fPIC -march=x86-64 -mtune=generic -gdwarf-4 -fno-debug-types-section -fvar-tracking-assignments -g2 -DNDEBUG -DQT_NO_DEBUG -I/usr/include -std=c++14 -fno-exceptions -D_GNU_SOURCE -D__STDC_CONSTANT_MACROS -D__STDC_FORMAT_MACROS -D__STDC_LIMIT_MACROS -fno-rtti -Wall -Wextra -Wno-unused-parameter -Wno-comment -Wno-missing-field-initializers -Wno-non-virtual-dtor -Wno-pedantic -fvisibility-inlines-hidden -DLDC_POSIX -DIN_LLVM -DOPAQUE_VTBLS "-DLDC_INSTALL_PREFIX=R\"(/usr)\"" -DLDC_LLVM_VER=1500 "-DLDC_LIBDIR_SUFFIX=R\"(64)\"" -DLDC_HOST_LDMD=1 -DLDC_HOST_FE_VER=2097 "-DLDC_LLVM_LIBDIR=R\"(/usr/lib64)\"" -DNDEBUG -MD -MT CMakeFiles/LDCShared.dir/gen/dcompute/targetCUDA.cpp.o -MF CMakeFiles/LDCShared.dir/gen/dcompute/targetCUDA.cpp.o.d -o CMakeFiles/LDCShared.dir/gen/dcompute/targetCUDA.cpp.o -c /tmp/B.6h_5p9b1/BUILD/ldc-1.29.0-src/gen/dcompute/targetCUDA.cpp [ 12%] Building CXX object CMakeFiles/LDCShared.dir/gen/dcompute/targetOCL.cpp.o /usr/bin/x86_64-pld-linux-g++ -DLDC_ENABLE_PLUGINS -DLDC_LLVM_SUPPORTED_TARGET_AArch64=1 -DLDC_LLVM_SUPPORTED_TARGET_AMDGPU=1 -DLDC_LLVM_SUPPORTED_TARGET_ARM=1 -DLDC_LLVM_SUPPORTED_TARGET_AVR=1 -DLDC_LLVM_SUPPORTED_TARGET_BPF=1 -DLDC_LLVM_SUPPORTED_TARGET_Hexagon=1 -DLDC_LLVM_SUPPORTED_TARGET_Lanai=1 -DLDC_LLVM_SUPPORTED_TARGET_MSP430=1 -DLDC_LLVM_SUPPORTED_TARGET_Mips=1 -DLDC_LLVM_SUPPORTED_TARGET_NVPTX=1 -DLDC_LLVM_SUPPORTED_TARGET_PowerPC=1 -DLDC_LLVM_SUPPORTED_TARGET_RISCV=1 -DLDC_LLVM_SUPPORTED_TARGET_SPIRV=1 -DLDC_LLVM_SUPPORTED_TARGET_Sparc=1 -DLDC_LLVM_SUPPORTED_TARGET_SystemZ=1 -DLDC_LLVM_SUPPORTED_TARGET_VE=1 -DLDC_LLVM_SUPPORTED_TARGET_WebAssembly=1 -DLDC_LLVM_SUPPORTED_TARGET_X86=1 -DLDC_LLVM_SUPPORTED_TARGET_XCore=1 -I/tmp/B.6h_5p9b1/BUILD/ldc-1.29.0-src/. -I/tmp/B.6h_5p9b1/BUILD/ldc-1.29.0-src/dmd -DDMDV2 -O2 -fwrapv -pipe -Wformat -Werror=format-security -gdwarf-4 -fno-debug-types-section -fvar-tracking-assignments -g2 -Wp,-D_FORTIFY_SOURCE=2 -fstack-protector-strong --param=ssp-buffer-size=4 -Werror=trampolines -fPIC -march=x86-64 -mtune=generic -gdwarf-4 -fno-debug-types-section -fvar-tracking-assignments -g2 -DNDEBUG -DQT_NO_DEBUG -I/usr/include -std=c++14 -fno-exceptions -D_GNU_SOURCE -D__STDC_CONSTANT_MACROS -D__STDC_FORMAT_MACROS -D__STDC_LIMIT_MACROS -fno-rtti -Wall -Wextra -Wno-unused-parameter -Wno-comment -Wno-missing-field-initializers -Wno-non-virtual-dtor -Wno-pedantic -fvisibility-inlines-hidden -DLDC_POSIX -DIN_LLVM -DOPAQUE_VTBLS "-DLDC_INSTALL_PREFIX=R\"(/usr)\"" -DLDC_LLVM_VER=1500 "-DLDC_LIBDIR_SUFFIX=R\"(64)\"" -DLDC_HOST_LDMD=1 -DLDC_HOST_FE_VER=2097 "-DLDC_LLVM_LIBDIR=R\"(/usr/lib64)\"" -DNDEBUG -MD -MT CMakeFiles/LDCShared.dir/gen/dcompute/targetOCL.cpp.o -MF CMakeFiles/LDCShared.dir/gen/dcompute/targetOCL.cpp.o.d -o CMakeFiles/LDCShared.dir/gen/dcompute/targetOCL.cpp.o -c /tmp/B.6h_5p9b1/BUILD/ldc-1.29.0-src/gen/dcompute/targetOCL.cpp [ 12%] Building CXX object CMakeFiles/LDCShared.dir/gen/declarations.cpp.o /usr/bin/x86_64-pld-linux-g++ -DLDC_ENABLE_PLUGINS -DLDC_LLVM_SUPPORTED_TARGET_AArch64=1 -DLDC_LLVM_SUPPORTED_TARGET_AMDGPU=1 -DLDC_LLVM_SUPPORTED_TARGET_ARM=1 -DLDC_LLVM_SUPPORTED_TARGET_AVR=1 -DLDC_LLVM_SUPPORTED_TARGET_BPF=1 -DLDC_LLVM_SUPPORTED_TARGET_Hexagon=1 -DLDC_LLVM_SUPPORTED_TARGET_Lanai=1 -DLDC_LLVM_SUPPORTED_TARGET_MSP430=1 -DLDC_LLVM_SUPPORTED_TARGET_Mips=1 -DLDC_LLVM_SUPPORTED_TARGET_NVPTX=1 -DLDC_LLVM_SUPPORTED_TARGET_PowerPC=1 -DLDC_LLVM_SUPPORTED_TARGET_RISCV=1 -DLDC_LLVM_SUPPORTED_TARGET_SPIRV=1 -DLDC_LLVM_SUPPORTED_TARGET_Sparc=1 -DLDC_LLVM_SUPPORTED_TARGET_SystemZ=1 -DLDC_LLVM_SUPPORTED_TARGET_VE=1 -DLDC_LLVM_SUPPORTED_TARGET_WebAssembly=1 -DLDC_LLVM_SUPPORTED_TARGET_X86=1 -DLDC_LLVM_SUPPORTED_TARGET_XCore=1 -I/tmp/B.6h_5p9b1/BUILD/ldc-1.29.0-src/. -I/tmp/B.6h_5p9b1/BUILD/ldc-1.29.0-src/dmd -DDMDV2 -O2 -fwrapv -pipe -Wformat -Werror=format-security -gdwarf-4 -fno-debug-types-section -fvar-tracking-assignments -g2 -Wp,-D_FORTIFY_SOURCE=2 -fstack-protector-strong --param=ssp-buffer-size=4 -Werror=trampolines -fPIC -march=x86-64 -mtune=generic -gdwarf-4 -fno-debug-types-section -fvar-tracking-assignments -g2 -DNDEBUG -DQT_NO_DEBUG -I/usr/include -std=c++14 -fno-exceptions -D_GNU_SOURCE -D__STDC_CONSTANT_MACROS -D__STDC_FORMAT_MACROS -D__STDC_LIMIT_MACROS -fno-rtti -Wall -Wextra -Wno-unused-parameter -Wno-comment -Wno-missing-field-initializers -Wno-non-virtual-dtor -Wno-pedantic -fvisibility-inlines-hidden -DLDC_POSIX -DIN_LLVM -DOPAQUE_VTBLS "-DLDC_INSTALL_PREFIX=R\"(/usr)\"" -DLDC_LLVM_VER=1500 "-DLDC_LIBDIR_SUFFIX=R\"(64)\"" -DLDC_HOST_LDMD=1 -DLDC_HOST_FE_VER=2097 "-DLDC_LLVM_LIBDIR=R\"(/usr/lib64)\"" -DNDEBUG -MD -MT CMakeFiles/LDCShared.dir/gen/declarations.cpp.o -MF CMakeFiles/LDCShared.dir/gen/declarations.cpp.o.d -o CMakeFiles/LDCShared.dir/gen/declarations.cpp.o -c /tmp/B.6h_5p9b1/BUILD/ldc-1.29.0-src/gen/declarations.cpp [ 12%] Building CXX object CMakeFiles/LDCShared.dir/gen/dibuilder.cpp.o /usr/bin/x86_64-pld-linux-g++ -DLDC_ENABLE_PLUGINS -DLDC_LLVM_SUPPORTED_TARGET_AArch64=1 -DLDC_LLVM_SUPPORTED_TARGET_AMDGPU=1 -DLDC_LLVM_SUPPORTED_TARGET_ARM=1 -DLDC_LLVM_SUPPORTED_TARGET_AVR=1 -DLDC_LLVM_SUPPORTED_TARGET_BPF=1 -DLDC_LLVM_SUPPORTED_TARGET_Hexagon=1 -DLDC_LLVM_SUPPORTED_TARGET_Lanai=1 -DLDC_LLVM_SUPPORTED_TARGET_MSP430=1 -DLDC_LLVM_SUPPORTED_TARGET_Mips=1 -DLDC_LLVM_SUPPORTED_TARGET_NVPTX=1 -DLDC_LLVM_SUPPORTED_TARGET_PowerPC=1 -DLDC_LLVM_SUPPORTED_TARGET_RISCV=1 -DLDC_LLVM_SUPPORTED_TARGET_SPIRV=1 -DLDC_LLVM_SUPPORTED_TARGET_Sparc=1 -DLDC_LLVM_SUPPORTED_TARGET_SystemZ=1 -DLDC_LLVM_SUPPORTED_TARGET_VE=1 -DLDC_LLVM_SUPPORTED_TARGET_WebAssembly=1 -DLDC_LLVM_SUPPORTED_TARGET_X86=1 -DLDC_LLVM_SUPPORTED_TARGET_XCore=1 -I/tmp/B.6h_5p9b1/BUILD/ldc-1.29.0-src/. -I/tmp/B.6h_5p9b1/BUILD/ldc-1.29.0-src/dmd -DDMDV2 -O2 -fwrapv -pipe -Wformat -Werror=format-security -gdwarf-4 -fno-debug-types-section -fvar-tracking-assignments -g2 -Wp,-D_FORTIFY_SOURCE=2 -fstack-protector-strong --param=ssp-buffer-size=4 -Werror=trampolines -fPIC -march=x86-64 -mtune=generic -gdwarf-4 -fno-debug-types-section -fvar-tracking-assignments -g2 -DNDEBUG -DQT_NO_DEBUG -I/usr/include -std=c++14 -fno-exceptions -D_GNU_SOURCE -D__STDC_CONSTANT_MACROS -D__STDC_FORMAT_MACROS -D__STDC_LIMIT_MACROS -fno-rtti -Wall -Wextra -Wno-unused-parameter -Wno-comment -Wno-missing-field-initializers -Wno-non-virtual-dtor -Wno-pedantic -fvisibility-inlines-hidden -DLDC_POSIX -DIN_LLVM -DOPAQUE_VTBLS "-DLDC_INSTALL_PREFIX=R\"(/usr)\"" -DLDC_LLVM_VER=1500 "-DLDC_LIBDIR_SUFFIX=R\"(64)\"" -DLDC_HOST_LDMD=1 -DLDC_HOST_FE_VER=2097 "-DLDC_LLVM_LIBDIR=R\"(/usr/lib64)\"" -DNDEBUG -MD -MT CMakeFiles/LDCShared.dir/gen/dibuilder.cpp.o -MF CMakeFiles/LDCShared.dir/gen/dibuilder.cpp.o.d -o CMakeFiles/LDCShared.dir/gen/dibuilder.cpp.o -c /tmp/B.6h_5p9b1/BUILD/ldc-1.29.0-src/gen/dibuilder.cpp /tmp/B.6h_5p9b1/BUILD/ldc-1.29.0-src/gen/dibuilder.cpp: In member function 'llvm::DIType* ldc::DIBuilder::CreateCompositeType(Type*)': /tmp/B.6h_5p9b1/BUILD/ldc-1.29.0-src/gen/dibuilder.cpp:550:33: warning: 'llvm::Type* llvm::Type::getPointerElementType() const' is deprecated: Deprecated without replacement, see https://llvm.org/docs/OpaquePointers.html for context and migration instructions [-Wdeprecated-declarations] 550 | T = T->getPointerElementType(); | ~~~~~~~~~~~~~~~~~~~~~~~~^~ In file included from /tmp/B.6h_5p9b1/BUILD/ldc-1.29.0-src/./gen/llvm.h:20, from /tmp/B.6h_5p9b1/BUILD/ldc-1.29.0-src/./gen/attributes.h:12, from /tmp/B.6h_5p9b1/BUILD/ldc-1.29.0-src/./gen/tollvm.h:22, from /tmp/B.6h_5p9b1/BUILD/ldc-1.29.0-src/./gen/dibuilder.h:12, from /tmp/B.6h_5p9b1/BUILD/ldc-1.29.0-src/gen/dibuilder.cpp:10: /usr/include/llvm/IR/Type.h:380:9: note: declared here 380 | Type *getPointerElementType() const { | ^~~~~~~~~~~~~~~~~~~~~ [ 12%] Building CXX object CMakeFiles/LDCShared.dir/gen/dvalue.cpp.o /usr/bin/x86_64-pld-linux-g++ -DLDC_ENABLE_PLUGINS -DLDC_LLVM_SUPPORTED_TARGET_AArch64=1 -DLDC_LLVM_SUPPORTED_TARGET_AMDGPU=1 -DLDC_LLVM_SUPPORTED_TARGET_ARM=1 -DLDC_LLVM_SUPPORTED_TARGET_AVR=1 -DLDC_LLVM_SUPPORTED_TARGET_BPF=1 -DLDC_LLVM_SUPPORTED_TARGET_Hexagon=1 -DLDC_LLVM_SUPPORTED_TARGET_Lanai=1 -DLDC_LLVM_SUPPORTED_TARGET_MSP430=1 -DLDC_LLVM_SUPPORTED_TARGET_Mips=1 -DLDC_LLVM_SUPPORTED_TARGET_NVPTX=1 -DLDC_LLVM_SUPPORTED_TARGET_PowerPC=1 -DLDC_LLVM_SUPPORTED_TARGET_RISCV=1 -DLDC_LLVM_SUPPORTED_TARGET_SPIRV=1 -DLDC_LLVM_SUPPORTED_TARGET_Sparc=1 -DLDC_LLVM_SUPPORTED_TARGET_SystemZ=1 -DLDC_LLVM_SUPPORTED_TARGET_VE=1 -DLDC_LLVM_SUPPORTED_TARGET_WebAssembly=1 -DLDC_LLVM_SUPPORTED_TARGET_X86=1 -DLDC_LLVM_SUPPORTED_TARGET_XCore=1 -I/tmp/B.6h_5p9b1/BUILD/ldc-1.29.0-src/. -I/tmp/B.6h_5p9b1/BUILD/ldc-1.29.0-src/dmd -DDMDV2 -O2 -fwrapv -pipe -Wformat -Werror=format-security -gdwarf-4 -fno-debug-types-section -fvar-tracking-assignments -g2 -Wp,-D_FORTIFY_SOURCE=2 -fstack-protector-strong --param=ssp-buffer-size=4 -Werror=trampolines -fPIC -march=x86-64 -mtune=generic -gdwarf-4 -fno-debug-types-section -fvar-tracking-assignments -g2 -DNDEBUG -DQT_NO_DEBUG -I/usr/include -std=c++14 -fno-exceptions -D_GNU_SOURCE -D__STDC_CONSTANT_MACROS -D__STDC_FORMAT_MACROS -D__STDC_LIMIT_MACROS -fno-rtti -Wall -Wextra -Wno-unused-parameter -Wno-comment -Wno-missing-field-initializers -Wno-non-virtual-dtor -Wno-pedantic -fvisibility-inlines-hidden -DLDC_POSIX -DIN_LLVM -DOPAQUE_VTBLS "-DLDC_INSTALL_PREFIX=R\"(/usr)\"" -DLDC_LLVM_VER=1500 "-DLDC_LIBDIR_SUFFIX=R\"(64)\"" -DLDC_HOST_LDMD=1 -DLDC_HOST_FE_VER=2097 "-DLDC_LLVM_LIBDIR=R\"(/usr/lib64)\"" -DNDEBUG -MD -MT CMakeFiles/LDCShared.dir/gen/dvalue.cpp.o -MF CMakeFiles/LDCShared.dir/gen/dvalue.cpp.o.d -o CMakeFiles/LDCShared.dir/gen/dvalue.cpp.o -c /tmp/B.6h_5p9b1/BUILD/ldc-1.29.0-src/gen/dvalue.cpp [ 12%] Building CXX object CMakeFiles/LDCShared.dir/gen/dynamiccompile.cpp.o /usr/bin/x86_64-pld-linux-g++ -DLDC_ENABLE_PLUGINS -DLDC_LLVM_SUPPORTED_TARGET_AArch64=1 -DLDC_LLVM_SUPPORTED_TARGET_AMDGPU=1 -DLDC_LLVM_SUPPORTED_TARGET_ARM=1 -DLDC_LLVM_SUPPORTED_TARGET_AVR=1 -DLDC_LLVM_SUPPORTED_TARGET_BPF=1 -DLDC_LLVM_SUPPORTED_TARGET_Hexagon=1 -DLDC_LLVM_SUPPORTED_TARGET_Lanai=1 -DLDC_LLVM_SUPPORTED_TARGET_MSP430=1 -DLDC_LLVM_SUPPORTED_TARGET_Mips=1 -DLDC_LLVM_SUPPORTED_TARGET_NVPTX=1 -DLDC_LLVM_SUPPORTED_TARGET_PowerPC=1 -DLDC_LLVM_SUPPORTED_TARGET_RISCV=1 -DLDC_LLVM_SUPPORTED_TARGET_SPIRV=1 -DLDC_LLVM_SUPPORTED_TARGET_Sparc=1 -DLDC_LLVM_SUPPORTED_TARGET_SystemZ=1 -DLDC_LLVM_SUPPORTED_TARGET_VE=1 -DLDC_LLVM_SUPPORTED_TARGET_WebAssembly=1 -DLDC_LLVM_SUPPORTED_TARGET_X86=1 -DLDC_LLVM_SUPPORTED_TARGET_XCore=1 -I/tmp/B.6h_5p9b1/BUILD/ldc-1.29.0-src/. -I/tmp/B.6h_5p9b1/BUILD/ldc-1.29.0-src/dmd -DDMDV2 -O2 -fwrapv -pipe -Wformat -Werror=format-security -gdwarf-4 -fno-debug-types-section -fvar-tracking-assignments -g2 -Wp,-D_FORTIFY_SOURCE=2 -fstack-protector-strong --param=ssp-buffer-size=4 -Werror=trampolines -fPIC -march=x86-64 -mtune=generic -gdwarf-4 -fno-debug-types-section -fvar-tracking-assignments -g2 -DNDEBUG -DQT_NO_DEBUG -I/usr/include -std=c++14 -fno-exceptions -D_GNU_SOURCE -D__STDC_CONSTANT_MACROS -D__STDC_FORMAT_MACROS -D__STDC_LIMIT_MACROS -fno-rtti -Wall -Wextra -Wno-unused-parameter -Wno-comment -Wno-missing-field-initializers -Wno-non-virtual-dtor -Wno-pedantic -fvisibility-inlines-hidden -DLDC_POSIX -DIN_LLVM -DOPAQUE_VTBLS "-DLDC_INSTALL_PREFIX=R\"(/usr)\"" -DLDC_LLVM_VER=1500 "-DLDC_LIBDIR_SUFFIX=R\"(64)\"" -DLDC_HOST_LDMD=1 -DLDC_HOST_FE_VER=2097 "-DLDC_LLVM_LIBDIR=R\"(/usr/lib64)\"" -DNDEBUG -MD -MT CMakeFiles/LDCShared.dir/gen/dynamiccompile.cpp.o -MF CMakeFiles/LDCShared.dir/gen/dynamiccompile.cpp.o.d -o CMakeFiles/LDCShared.dir/gen/dynamiccompile.cpp.o -c /tmp/B.6h_5p9b1/BUILD/ldc-1.29.0-src/gen/dynamiccompile.cpp [ 12%] Building CXX object CMakeFiles/LDCShared.dir/gen/funcgenstate.cpp.o /usr/bin/x86_64-pld-linux-g++ -DLDC_ENABLE_PLUGINS -DLDC_LLVM_SUPPORTED_TARGET_AArch64=1 -DLDC_LLVM_SUPPORTED_TARGET_AMDGPU=1 -DLDC_LLVM_SUPPORTED_TARGET_ARM=1 -DLDC_LLVM_SUPPORTED_TARGET_AVR=1 -DLDC_LLVM_SUPPORTED_TARGET_BPF=1 -DLDC_LLVM_SUPPORTED_TARGET_Hexagon=1 -DLDC_LLVM_SUPPORTED_TARGET_Lanai=1 -DLDC_LLVM_SUPPORTED_TARGET_MSP430=1 -DLDC_LLVM_SUPPORTED_TARGET_Mips=1 -DLDC_LLVM_SUPPORTED_TARGET_NVPTX=1 -DLDC_LLVM_SUPPORTED_TARGET_PowerPC=1 -DLDC_LLVM_SUPPORTED_TARGET_RISCV=1 -DLDC_LLVM_SUPPORTED_TARGET_SPIRV=1 -DLDC_LLVM_SUPPORTED_TARGET_Sparc=1 -DLDC_LLVM_SUPPORTED_TARGET_SystemZ=1 -DLDC_LLVM_SUPPORTED_TARGET_VE=1 -DLDC_LLVM_SUPPORTED_TARGET_WebAssembly=1 -DLDC_LLVM_SUPPORTED_TARGET_X86=1 -DLDC_LLVM_SUPPORTED_TARGET_XCore=1 -I/tmp/B.6h_5p9b1/BUILD/ldc-1.29.0-src/. -I/tmp/B.6h_5p9b1/BUILD/ldc-1.29.0-src/dmd -DDMDV2 -O2 -fwrapv -pipe -Wformat -Werror=format-security -gdwarf-4 -fno-debug-types-section -fvar-tracking-assignments -g2 -Wp,-D_FORTIFY_SOURCE=2 -fstack-protector-strong --param=ssp-buffer-size=4 -Werror=trampolines -fPIC -march=x86-64 -mtune=generic -gdwarf-4 -fno-debug-types-section -fvar-tracking-assignments -g2 -DNDEBUG -DQT_NO_DEBUG -I/usr/include -std=c++14 -fno-exceptions -D_GNU_SOURCE -D__STDC_CONSTANT_MACROS -D__STDC_FORMAT_MACROS -D__STDC_LIMIT_MACROS -fno-rtti -Wall -Wextra -Wno-unused-parameter -Wno-comment -Wno-missing-field-initializers -Wno-non-virtual-dtor -Wno-pedantic -fvisibility-inlines-hidden -DLDC_POSIX -DIN_LLVM -DOPAQUE_VTBLS "-DLDC_INSTALL_PREFIX=R\"(/usr)\"" -DLDC_LLVM_VER=1500 "-DLDC_LIBDIR_SUFFIX=R\"(64)\"" -DLDC_HOST_LDMD=1 -DLDC_HOST_FE_VER=2097 "-DLDC_LLVM_LIBDIR=R\"(/usr/lib64)\"" -DNDEBUG -MD -MT CMakeFiles/LDCShared.dir/gen/funcgenstate.cpp.o -MF CMakeFiles/LDCShared.dir/gen/funcgenstate.cpp.o.d -o CMakeFiles/LDCShared.dir/gen/funcgenstate.cpp.o -c /tmp/B.6h_5p9b1/BUILD/ldc-1.29.0-src/gen/funcgenstate.cpp [ 12%] Building CXX object CMakeFiles/LDCShared.dir/gen/function-inlining.cpp.o /usr/bin/x86_64-pld-linux-g++ -DLDC_ENABLE_PLUGINS -DLDC_LLVM_SUPPORTED_TARGET_AArch64=1 -DLDC_LLVM_SUPPORTED_TARGET_AMDGPU=1 -DLDC_LLVM_SUPPORTED_TARGET_ARM=1 -DLDC_LLVM_SUPPORTED_TARGET_AVR=1 -DLDC_LLVM_SUPPORTED_TARGET_BPF=1 -DLDC_LLVM_SUPPORTED_TARGET_Hexagon=1 -DLDC_LLVM_SUPPORTED_TARGET_Lanai=1 -DLDC_LLVM_SUPPORTED_TARGET_MSP430=1 -DLDC_LLVM_SUPPORTED_TARGET_Mips=1 -DLDC_LLVM_SUPPORTED_TARGET_NVPTX=1 -DLDC_LLVM_SUPPORTED_TARGET_PowerPC=1 -DLDC_LLVM_SUPPORTED_TARGET_RISCV=1 -DLDC_LLVM_SUPPORTED_TARGET_SPIRV=1 -DLDC_LLVM_SUPPORTED_TARGET_Sparc=1 -DLDC_LLVM_SUPPORTED_TARGET_SystemZ=1 -DLDC_LLVM_SUPPORTED_TARGET_VE=1 -DLDC_LLVM_SUPPORTED_TARGET_WebAssembly=1 -DLDC_LLVM_SUPPORTED_TARGET_X86=1 -DLDC_LLVM_SUPPORTED_TARGET_XCore=1 -I/tmp/B.6h_5p9b1/BUILD/ldc-1.29.0-src/. -I/tmp/B.6h_5p9b1/BUILD/ldc-1.29.0-src/dmd -DDMDV2 -O2 -fwrapv -pipe -Wformat -Werror=format-security -gdwarf-4 -fno-debug-types-section -fvar-tracking-assignments -g2 -Wp,-D_FORTIFY_SOURCE=2 -fstack-protector-strong --param=ssp-buffer-size=4 -Werror=trampolines -fPIC -march=x86-64 -mtune=generic -gdwarf-4 -fno-debug-types-section -fvar-tracking-assignments -g2 -DNDEBUG -DQT_NO_DEBUG -I/usr/include -std=c++14 -fno-exceptions -D_GNU_SOURCE -D__STDC_CONSTANT_MACROS -D__STDC_FORMAT_MACROS -D__STDC_LIMIT_MACROS -fno-rtti -Wall -Wextra -Wno-unused-parameter -Wno-comment -Wno-missing-field-initializers -Wno-non-virtual-dtor -Wno-pedantic -fvisibility-inlines-hidden -DLDC_POSIX -DIN_LLVM -DOPAQUE_VTBLS "-DLDC_INSTALL_PREFIX=R\"(/usr)\"" -DLDC_LLVM_VER=1500 "-DLDC_LIBDIR_SUFFIX=R\"(64)\"" -DLDC_HOST_LDMD=1 -DLDC_HOST_FE_VER=2097 "-DLDC_LLVM_LIBDIR=R\"(/usr/lib64)\"" -DNDEBUG -MD -MT CMakeFiles/LDCShared.dir/gen/function-inlining.cpp.o -MF CMakeFiles/LDCShared.dir/gen/function-inlining.cpp.o.d -o CMakeFiles/LDCShared.dir/gen/function-inlining.cpp.o -c /tmp/B.6h_5p9b1/BUILD/ldc-1.29.0-src/gen/function-inlining.cpp [ 12%] Building CXX object CMakeFiles/LDCShared.dir/gen/functions.cpp.o /usr/bin/x86_64-pld-linux-g++ -DLDC_ENABLE_PLUGINS -DLDC_LLVM_SUPPORTED_TARGET_AArch64=1 -DLDC_LLVM_SUPPORTED_TARGET_AMDGPU=1 -DLDC_LLVM_SUPPORTED_TARGET_ARM=1 -DLDC_LLVM_SUPPORTED_TARGET_AVR=1 -DLDC_LLVM_SUPPORTED_TARGET_BPF=1 -DLDC_LLVM_SUPPORTED_TARGET_Hexagon=1 -DLDC_LLVM_SUPPORTED_TARGET_Lanai=1 -DLDC_LLVM_SUPPORTED_TARGET_MSP430=1 -DLDC_LLVM_SUPPORTED_TARGET_Mips=1 -DLDC_LLVM_SUPPORTED_TARGET_NVPTX=1 -DLDC_LLVM_SUPPORTED_TARGET_PowerPC=1 -DLDC_LLVM_SUPPORTED_TARGET_RISCV=1 -DLDC_LLVM_SUPPORTED_TARGET_SPIRV=1 -DLDC_LLVM_SUPPORTED_TARGET_Sparc=1 -DLDC_LLVM_SUPPORTED_TARGET_SystemZ=1 -DLDC_LLVM_SUPPORTED_TARGET_VE=1 -DLDC_LLVM_SUPPORTED_TARGET_WebAssembly=1 -DLDC_LLVM_SUPPORTED_TARGET_X86=1 -DLDC_LLVM_SUPPORTED_TARGET_XCore=1 -I/tmp/B.6h_5p9b1/BUILD/ldc-1.29.0-src/. -I/tmp/B.6h_5p9b1/BUILD/ldc-1.29.0-src/dmd -DDMDV2 -O2 -fwrapv -pipe -Wformat -Werror=format-security -gdwarf-4 -fno-debug-types-section -fvar-tracking-assignments -g2 -Wp,-D_FORTIFY_SOURCE=2 -fstack-protector-strong --param=ssp-buffer-size=4 -Werror=trampolines -fPIC -march=x86-64 -mtune=generic -gdwarf-4 -fno-debug-types-section -fvar-tracking-assignments -g2 -DNDEBUG -DQT_NO_DEBUG -I/usr/include -std=c++14 -fno-exceptions -D_GNU_SOURCE -D__STDC_CONSTANT_MACROS -D__STDC_FORMAT_MACROS -D__STDC_LIMIT_MACROS -fno-rtti -Wall -Wextra -Wno-unused-parameter -Wno-comment -Wno-missing-field-initializers -Wno-non-virtual-dtor -Wno-pedantic -fvisibility-inlines-hidden -DLDC_POSIX -DIN_LLVM -DOPAQUE_VTBLS "-DLDC_INSTALL_PREFIX=R\"(/usr)\"" -DLDC_LLVM_VER=1500 "-DLDC_LIBDIR_SUFFIX=R\"(64)\"" -DLDC_HOST_LDMD=1 -DLDC_HOST_FE_VER=2097 "-DLDC_LLVM_LIBDIR=R\"(/usr/lib64)\"" -DNDEBUG -MD -MT CMakeFiles/LDCShared.dir/gen/functions.cpp.o -MF CMakeFiles/LDCShared.dir/gen/functions.cpp.o.d -o CMakeFiles/LDCShared.dir/gen/functions.cpp.o -c /tmp/B.6h_5p9b1/BUILD/ldc-1.29.0-src/gen/functions.cpp [ 12%] Building CXX object CMakeFiles/LDCShared.dir/gen/inlineir.cpp.o /usr/bin/x86_64-pld-linux-g++ -DLDC_ENABLE_PLUGINS -DLDC_LLVM_SUPPORTED_TARGET_AArch64=1 -DLDC_LLVM_SUPPORTED_TARGET_AMDGPU=1 -DLDC_LLVM_SUPPORTED_TARGET_ARM=1 -DLDC_LLVM_SUPPORTED_TARGET_AVR=1 -DLDC_LLVM_SUPPORTED_TARGET_BPF=1 -DLDC_LLVM_SUPPORTED_TARGET_Hexagon=1 -DLDC_LLVM_SUPPORTED_TARGET_Lanai=1 -DLDC_LLVM_SUPPORTED_TARGET_MSP430=1 -DLDC_LLVM_SUPPORTED_TARGET_Mips=1 -DLDC_LLVM_SUPPORTED_TARGET_NVPTX=1 -DLDC_LLVM_SUPPORTED_TARGET_PowerPC=1 -DLDC_LLVM_SUPPORTED_TARGET_RISCV=1 -DLDC_LLVM_SUPPORTED_TARGET_SPIRV=1 -DLDC_LLVM_SUPPORTED_TARGET_Sparc=1 -DLDC_LLVM_SUPPORTED_TARGET_SystemZ=1 -DLDC_LLVM_SUPPORTED_TARGET_VE=1 -DLDC_LLVM_SUPPORTED_TARGET_WebAssembly=1 -DLDC_LLVM_SUPPORTED_TARGET_X86=1 -DLDC_LLVM_SUPPORTED_TARGET_XCore=1 -I/tmp/B.6h_5p9b1/BUILD/ldc-1.29.0-src/. -I/tmp/B.6h_5p9b1/BUILD/ldc-1.29.0-src/dmd -DDMDV2 -O2 -fwrapv -pipe -Wformat -Werror=format-security -gdwarf-4 -fno-debug-types-section -fvar-tracking-assignments -g2 -Wp,-D_FORTIFY_SOURCE=2 -fstack-protector-strong --param=ssp-buffer-size=4 -Werror=trampolines -fPIC -march=x86-64 -mtune=generic -gdwarf-4 -fno-debug-types-section -fvar-tracking-assignments -g2 -DNDEBUG -DQT_NO_DEBUG -I/usr/include -std=c++14 -fno-exceptions -D_GNU_SOURCE -D__STDC_CONSTANT_MACROS -D__STDC_FORMAT_MACROS -D__STDC_LIMIT_MACROS -fno-rtti -Wall -Wextra -Wno-unused-parameter -Wno-comment -Wno-missing-field-initializers -Wno-non-virtual-dtor -Wno-pedantic -fvisibility-inlines-hidden -DLDC_POSIX -DIN_LLVM -DOPAQUE_VTBLS "-DLDC_INSTALL_PREFIX=R\"(/usr)\"" -DLDC_LLVM_VER=1500 "-DLDC_LIBDIR_SUFFIX=R\"(64)\"" -DLDC_HOST_LDMD=1 -DLDC_HOST_FE_VER=2097 "-DLDC_LLVM_LIBDIR=R\"(/usr/lib64)\"" -DNDEBUG -MD -MT CMakeFiles/LDCShared.dir/gen/inlineir.cpp.o -MF CMakeFiles/LDCShared.dir/gen/inlineir.cpp.o.d -o CMakeFiles/LDCShared.dir/gen/inlineir.cpp.o -c /tmp/B.6h_5p9b1/BUILD/ldc-1.29.0-src/gen/inlineir.cpp [ 12%] Building CXX object CMakeFiles/LDCShared.dir/gen/irstate.cpp.o /usr/bin/x86_64-pld-linux-g++ -DLDC_ENABLE_PLUGINS -DLDC_LLVM_SUPPORTED_TARGET_AArch64=1 -DLDC_LLVM_SUPPORTED_TARGET_AMDGPU=1 -DLDC_LLVM_SUPPORTED_TARGET_ARM=1 -DLDC_LLVM_SUPPORTED_TARGET_AVR=1 -DLDC_LLVM_SUPPORTED_TARGET_BPF=1 -DLDC_LLVM_SUPPORTED_TARGET_Hexagon=1 -DLDC_LLVM_SUPPORTED_TARGET_Lanai=1 -DLDC_LLVM_SUPPORTED_TARGET_MSP430=1 -DLDC_LLVM_SUPPORTED_TARGET_Mips=1 -DLDC_LLVM_SUPPORTED_TARGET_NVPTX=1 -DLDC_LLVM_SUPPORTED_TARGET_PowerPC=1 -DLDC_LLVM_SUPPORTED_TARGET_RISCV=1 -DLDC_LLVM_SUPPORTED_TARGET_SPIRV=1 -DLDC_LLVM_SUPPORTED_TARGET_Sparc=1 -DLDC_LLVM_SUPPORTED_TARGET_SystemZ=1 -DLDC_LLVM_SUPPORTED_TARGET_VE=1 -DLDC_LLVM_SUPPORTED_TARGET_WebAssembly=1 -DLDC_LLVM_SUPPORTED_TARGET_X86=1 -DLDC_LLVM_SUPPORTED_TARGET_XCore=1 -I/tmp/B.6h_5p9b1/BUILD/ldc-1.29.0-src/. -I/tmp/B.6h_5p9b1/BUILD/ldc-1.29.0-src/dmd -DDMDV2 -O2 -fwrapv -pipe -Wformat -Werror=format-security -gdwarf-4 -fno-debug-types-section -fvar-tracking-assignments -g2 -Wp,-D_FORTIFY_SOURCE=2 -fstack-protector-strong --param=ssp-buffer-size=4 -Werror=trampolines -fPIC -march=x86-64 -mtune=generic -gdwarf-4 -fno-debug-types-section -fvar-tracking-assignments -g2 -DNDEBUG -DQT_NO_DEBUG -I/usr/include -std=c++14 -fno-exceptions -D_GNU_SOURCE -D__STDC_CONSTANT_MACROS -D__STDC_FORMAT_MACROS -D__STDC_LIMIT_MACROS -fno-rtti -Wall -Wextra -Wno-unused-parameter -Wno-comment -Wno-missing-field-initializers -Wno-non-virtual-dtor -Wno-pedantic -fvisibility-inlines-hidden -DLDC_POSIX -DIN_LLVM -DOPAQUE_VTBLS "-DLDC_INSTALL_PREFIX=R\"(/usr)\"" -DLDC_LLVM_VER=1500 "-DLDC_LIBDIR_SUFFIX=R\"(64)\"" -DLDC_HOST_LDMD=1 -DLDC_HOST_FE_VER=2097 "-DLDC_LLVM_LIBDIR=R\"(/usr/lib64)\"" -DNDEBUG -MD -MT CMakeFiles/LDCShared.dir/gen/irstate.cpp.o -MF CMakeFiles/LDCShared.dir/gen/irstate.cpp.o.d -o CMakeFiles/LDCShared.dir/gen/irstate.cpp.o -c /tmp/B.6h_5p9b1/BUILD/ldc-1.29.0-src/gen/irstate.cpp [ 18%] Building CXX object CMakeFiles/LDCShared.dir/gen/ldctraits.cpp.o /usr/bin/x86_64-pld-linux-g++ -DLDC_ENABLE_PLUGINS -DLDC_LLVM_SUPPORTED_TARGET_AArch64=1 -DLDC_LLVM_SUPPORTED_TARGET_AMDGPU=1 -DLDC_LLVM_SUPPORTED_TARGET_ARM=1 -DLDC_LLVM_SUPPORTED_TARGET_AVR=1 -DLDC_LLVM_SUPPORTED_TARGET_BPF=1 -DLDC_LLVM_SUPPORTED_TARGET_Hexagon=1 -DLDC_LLVM_SUPPORTED_TARGET_Lanai=1 -DLDC_LLVM_SUPPORTED_TARGET_MSP430=1 -DLDC_LLVM_SUPPORTED_TARGET_Mips=1 -DLDC_LLVM_SUPPORTED_TARGET_NVPTX=1 -DLDC_LLVM_SUPPORTED_TARGET_PowerPC=1 -DLDC_LLVM_SUPPORTED_TARGET_RISCV=1 -DLDC_LLVM_SUPPORTED_TARGET_SPIRV=1 -DLDC_LLVM_SUPPORTED_TARGET_Sparc=1 -DLDC_LLVM_SUPPORTED_TARGET_SystemZ=1 -DLDC_LLVM_SUPPORTED_TARGET_VE=1 -DLDC_LLVM_SUPPORTED_TARGET_WebAssembly=1 -DLDC_LLVM_SUPPORTED_TARGET_X86=1 -DLDC_LLVM_SUPPORTED_TARGET_XCore=1 -I/tmp/B.6h_5p9b1/BUILD/ldc-1.29.0-src/. -I/tmp/B.6h_5p9b1/BUILD/ldc-1.29.0-src/dmd -DDMDV2 -O2 -fwrapv -pipe -Wformat -Werror=format-security -gdwarf-4 -fno-debug-types-section -fvar-tracking-assignments -g2 -Wp,-D_FORTIFY_SOURCE=2 -fstack-protector-strong --param=ssp-buffer-size=4 -Werror=trampolines -fPIC -march=x86-64 -mtune=generic -gdwarf-4 -fno-debug-types-section -fvar-tracking-assignments -g2 -DNDEBUG -DQT_NO_DEBUG -I/usr/include -std=c++14 -fno-exceptions -D_GNU_SOURCE -D__STDC_CONSTANT_MACROS -D__STDC_FORMAT_MACROS -D__STDC_LIMIT_MACROS -fno-rtti -Wall -Wextra -Wno-unused-parameter -Wno-comment -Wno-missing-field-initializers -Wno-non-virtual-dtor -Wno-pedantic -fvisibility-inlines-hidden -DLDC_POSIX -DIN_LLVM -DOPAQUE_VTBLS "-DLDC_INSTALL_PREFIX=R\"(/usr)\"" -DLDC_LLVM_VER=1500 "-DLDC_LIBDIR_SUFFIX=R\"(64)\"" -DLDC_HOST_LDMD=1 -DLDC_HOST_FE_VER=2097 "-DLDC_LLVM_LIBDIR=R\"(/usr/lib64)\"" -DNDEBUG -MD -MT CMakeFiles/LDCShared.dir/gen/ldctraits.cpp.o -MF CMakeFiles/LDCShared.dir/gen/ldctraits.cpp.o.d -o CMakeFiles/LDCShared.dir/gen/ldctraits.cpp.o -c /tmp/B.6h_5p9b1/BUILD/ldc-1.29.0-src/gen/ldctraits.cpp [ 18%] Building CXX object CMakeFiles/LDCShared.dir/gen/linkage.cpp.o /usr/bin/x86_64-pld-linux-g++ -DLDC_ENABLE_PLUGINS -DLDC_LLVM_SUPPORTED_TARGET_AArch64=1 -DLDC_LLVM_SUPPORTED_TARGET_AMDGPU=1 -DLDC_LLVM_SUPPORTED_TARGET_ARM=1 -DLDC_LLVM_SUPPORTED_TARGET_AVR=1 -DLDC_LLVM_SUPPORTED_TARGET_BPF=1 -DLDC_LLVM_SUPPORTED_TARGET_Hexagon=1 -DLDC_LLVM_SUPPORTED_TARGET_Lanai=1 -DLDC_LLVM_SUPPORTED_TARGET_MSP430=1 -DLDC_LLVM_SUPPORTED_TARGET_Mips=1 -DLDC_LLVM_SUPPORTED_TARGET_NVPTX=1 -DLDC_LLVM_SUPPORTED_TARGET_PowerPC=1 -DLDC_LLVM_SUPPORTED_TARGET_RISCV=1 -DLDC_LLVM_SUPPORTED_TARGET_SPIRV=1 -DLDC_LLVM_SUPPORTED_TARGET_Sparc=1 -DLDC_LLVM_SUPPORTED_TARGET_SystemZ=1 -DLDC_LLVM_SUPPORTED_TARGET_VE=1 -DLDC_LLVM_SUPPORTED_TARGET_WebAssembly=1 -DLDC_LLVM_SUPPORTED_TARGET_X86=1 -DLDC_LLVM_SUPPORTED_TARGET_XCore=1 -I/tmp/B.6h_5p9b1/BUILD/ldc-1.29.0-src/. -I/tmp/B.6h_5p9b1/BUILD/ldc-1.29.0-src/dmd -DDMDV2 -O2 -fwrapv -pipe -Wformat -Werror=format-security -gdwarf-4 -fno-debug-types-section -fvar-tracking-assignments -g2 -Wp,-D_FORTIFY_SOURCE=2 -fstack-protector-strong --param=ssp-buffer-size=4 -Werror=trampolines -fPIC -march=x86-64 -mtune=generic -gdwarf-4 -fno-debug-types-section -fvar-tracking-assignments -g2 -DNDEBUG -DQT_NO_DEBUG -I/usr/include -std=c++14 -fno-exceptions -D_GNU_SOURCE -D__STDC_CONSTANT_MACROS -D__STDC_FORMAT_MACROS -D__STDC_LIMIT_MACROS -fno-rtti -Wall -Wextra -Wno-unused-parameter -Wno-comment -Wno-missing-field-initializers -Wno-non-virtual-dtor -Wno-pedantic -fvisibility-inlines-hidden -DLDC_POSIX -DIN_LLVM -DOPAQUE_VTBLS "-DLDC_INSTALL_PREFIX=R\"(/usr)\"" -DLDC_LLVM_VER=1500 "-DLDC_LIBDIR_SUFFIX=R\"(64)\"" -DLDC_HOST_LDMD=1 -DLDC_HOST_FE_VER=2097 "-DLDC_LLVM_LIBDIR=R\"(/usr/lib64)\"" -DNDEBUG -MD -MT CMakeFiles/LDCShared.dir/gen/linkage.cpp.o -MF CMakeFiles/LDCShared.dir/gen/linkage.cpp.o.d -o CMakeFiles/LDCShared.dir/gen/linkage.cpp.o -c /tmp/B.6h_5p9b1/BUILD/ldc-1.29.0-src/gen/linkage.cpp [ 18%] Building CXX object CMakeFiles/LDCShared.dir/gen/llvmhelpers.cpp.o /usr/bin/x86_64-pld-linux-g++ -DLDC_ENABLE_PLUGINS -DLDC_LLVM_SUPPORTED_TARGET_AArch64=1 -DLDC_LLVM_SUPPORTED_TARGET_AMDGPU=1 -DLDC_LLVM_SUPPORTED_TARGET_ARM=1 -DLDC_LLVM_SUPPORTED_TARGET_AVR=1 -DLDC_LLVM_SUPPORTED_TARGET_BPF=1 -DLDC_LLVM_SUPPORTED_TARGET_Hexagon=1 -DLDC_LLVM_SUPPORTED_TARGET_Lanai=1 -DLDC_LLVM_SUPPORTED_TARGET_MSP430=1 -DLDC_LLVM_SUPPORTED_TARGET_Mips=1 -DLDC_LLVM_SUPPORTED_TARGET_NVPTX=1 -DLDC_LLVM_SUPPORTED_TARGET_PowerPC=1 -DLDC_LLVM_SUPPORTED_TARGET_RISCV=1 -DLDC_LLVM_SUPPORTED_TARGET_SPIRV=1 -DLDC_LLVM_SUPPORTED_TARGET_Sparc=1 -DLDC_LLVM_SUPPORTED_TARGET_SystemZ=1 -DLDC_LLVM_SUPPORTED_TARGET_VE=1 -DLDC_LLVM_SUPPORTED_TARGET_WebAssembly=1 -DLDC_LLVM_SUPPORTED_TARGET_X86=1 -DLDC_LLVM_SUPPORTED_TARGET_XCore=1 -I/tmp/B.6h_5p9b1/BUILD/ldc-1.29.0-src/. -I/tmp/B.6h_5p9b1/BUILD/ldc-1.29.0-src/dmd -DDMDV2 -O2 -fwrapv -pipe -Wformat -Werror=format-security -gdwarf-4 -fno-debug-types-section -fvar-tracking-assignments -g2 -Wp,-D_FORTIFY_SOURCE=2 -fstack-protector-strong --param=ssp-buffer-size=4 -Werror=trampolines -fPIC -march=x86-64 -mtune=generic -gdwarf-4 -fno-debug-types-section -fvar-tracking-assignments -g2 -DNDEBUG -DQT_NO_DEBUG -I/usr/include -std=c++14 -fno-exceptions -D_GNU_SOURCE -D__STDC_CONSTANT_MACROS -D__STDC_FORMAT_MACROS -D__STDC_LIMIT_MACROS -fno-rtti -Wall -Wextra -Wno-unused-parameter -Wno-comment -Wno-missing-field-initializers -Wno-non-virtual-dtor -Wno-pedantic -fvisibility-inlines-hidden -DLDC_POSIX -DIN_LLVM -DOPAQUE_VTBLS "-DLDC_INSTALL_PREFIX=R\"(/usr)\"" -DLDC_LLVM_VER=1500 "-DLDC_LIBDIR_SUFFIX=R\"(64)\"" -DLDC_HOST_LDMD=1 -DLDC_HOST_FE_VER=2097 "-DLDC_LLVM_LIBDIR=R\"(/usr/lib64)\"" -DNDEBUG -MD -MT CMakeFiles/LDCShared.dir/gen/llvmhelpers.cpp.o -MF CMakeFiles/LDCShared.dir/gen/llvmhelpers.cpp.o.d -o CMakeFiles/LDCShared.dir/gen/llvmhelpers.cpp.o -c /tmp/B.6h_5p9b1/BUILD/ldc-1.29.0-src/gen/llvmhelpers.cpp /tmp/B.6h_5p9b1/BUILD/ldc-1.29.0-src/gen/llvmhelpers.cpp: In function 'llvm::Value* DtoAllocaDump(DValue*, llvm::Type*, int, const char*)': /tmp/B.6h_5p9b1/BUILD/ldc-1.29.0-src/gen/llvmhelpers.cpp:240:73: warning: 'llvm::Type* llvm::Type::getPointerElementType() const' is deprecated: Deprecated without replacement, see https://llvm.org/docs/OpaquePointers.html for context and migration instructions [-Wdeprecated-declarations] 240 | std::min(getTypeAllocSize(lval->getType()->getPointerElementType()), | ~~~~~~~~~~~~~~~~~~~~~~~~~~~~~~~~~~~~~~^~ In file included from /tmp/B.6h_5p9b1/BUILD/ldc-1.29.0-src/./gen/llvm.h:20, from /tmp/B.6h_5p9b1/BUILD/ldc-1.29.0-src/./gen/llvmhelpers.h:21, from /tmp/B.6h_5p9b1/BUILD/ldc-1.29.0-src/gen/llvmhelpers.cpp:10: /usr/include/llvm/IR/Type.h:380:9: note: declared here 380 | Type *getPointerElementType() const { | ^~~~~~~~~~~~~~~~~~~~~ /tmp/B.6h_5p9b1/BUILD/ldc-1.29.0-src/gen/llvmhelpers.cpp: In function 'DValue* makeVarDValue(Type*, VarDeclaration*, llvm::Value*)': /tmp/B.6h_5p9b1/BUILD/ldc-1.29.0-src/gen/llvmhelpers.cpp:1962:68: warning: 'llvm::Type* llvm::Type::getPointerElementType() const' is deprecated: Deprecated without replacement, see https://llvm.org/docs/OpaquePointers.html for context and migration instructions [-Wdeprecated-declarations] 1962 | llvm::Type *pointeeType = val->getType()->getPointerElementType(); | ~~~~~~~~~~~~~~~~~~~~~~~~~~~~~~~~~~~~~^~ /usr/include/llvm/IR/Type.h:380:9: note: declared here 380 | Type *getPointerElementType() const { | ^~~~~~~~~~~~~~~~~~~~~ /tmp/B.6h_5p9b1/BUILD/ldc-1.29.0-src/gen/llvmhelpers.cpp:1964:55: warning: 'llvm::Type* llvm::Type::getPointerElementType() const' is deprecated: Deprecated without replacement, see https://llvm.org/docs/OpaquePointers.html for context and migration instructions [-Wdeprecated-declarations] 1964 | pointeeType = pointeeType->getPointerElementType(); | ~~~~~~~~~~~~~~~~~~~~~~~~~~~~~~~~~~^~ /usr/include/llvm/IR/Type.h:380:9: note: declared here 380 | Type *getPointerElementType() const { | ^~~~~~~~~~~~~~~~~~~~~ [ 18%] Building CXX object CMakeFiles/LDCShared.dir/gen/logger.cpp.o /usr/bin/x86_64-pld-linux-g++ -DLDC_ENABLE_PLUGINS -DLDC_LLVM_SUPPORTED_TARGET_AArch64=1 -DLDC_LLVM_SUPPORTED_TARGET_AMDGPU=1 -DLDC_LLVM_SUPPORTED_TARGET_ARM=1 -DLDC_LLVM_SUPPORTED_TARGET_AVR=1 -DLDC_LLVM_SUPPORTED_TARGET_BPF=1 -DLDC_LLVM_SUPPORTED_TARGET_Hexagon=1 -DLDC_LLVM_SUPPORTED_TARGET_Lanai=1 -DLDC_LLVM_SUPPORTED_TARGET_MSP430=1 -DLDC_LLVM_SUPPORTED_TARGET_Mips=1 -DLDC_LLVM_SUPPORTED_TARGET_NVPTX=1 -DLDC_LLVM_SUPPORTED_TARGET_PowerPC=1 -DLDC_LLVM_SUPPORTED_TARGET_RISCV=1 -DLDC_LLVM_SUPPORTED_TARGET_SPIRV=1 -DLDC_LLVM_SUPPORTED_TARGET_Sparc=1 -DLDC_LLVM_SUPPORTED_TARGET_SystemZ=1 -DLDC_LLVM_SUPPORTED_TARGET_VE=1 -DLDC_LLVM_SUPPORTED_TARGET_WebAssembly=1 -DLDC_LLVM_SUPPORTED_TARGET_X86=1 -DLDC_LLVM_SUPPORTED_TARGET_XCore=1 -I/tmp/B.6h_5p9b1/BUILD/ldc-1.29.0-src/. -I/tmp/B.6h_5p9b1/BUILD/ldc-1.29.0-src/dmd -DDMDV2 -O2 -fwrapv -pipe -Wformat -Werror=format-security -gdwarf-4 -fno-debug-types-section -fvar-tracking-assignments -g2 -Wp,-D_FORTIFY_SOURCE=2 -fstack-protector-strong --param=ssp-buffer-size=4 -Werror=trampolines -fPIC -march=x86-64 -mtune=generic -gdwarf-4 -fno-debug-types-section -fvar-tracking-assignments -g2 -DNDEBUG -DQT_NO_DEBUG -I/usr/include -std=c++14 -fno-exceptions -D_GNU_SOURCE -D__STDC_CONSTANT_MACROS -D__STDC_FORMAT_MACROS -D__STDC_LIMIT_MACROS -fno-rtti -Wall -Wextra -Wno-unused-parameter -Wno-comment -Wno-missing-field-initializers -Wno-non-virtual-dtor -Wno-pedantic -fvisibility-inlines-hidden -DLDC_POSIX -DIN_LLVM -DOPAQUE_VTBLS "-DLDC_INSTALL_PREFIX=R\"(/usr)\"" -DLDC_LLVM_VER=1500 "-DLDC_LIBDIR_SUFFIX=R\"(64)\"" -DLDC_HOST_LDMD=1 -DLDC_HOST_FE_VER=2097 "-DLDC_LLVM_LIBDIR=R\"(/usr/lib64)\"" -DNDEBUG -MD -MT CMakeFiles/LDCShared.dir/gen/logger.cpp.o -MF CMakeFiles/LDCShared.dir/gen/logger.cpp.o.d -o CMakeFiles/LDCShared.dir/gen/logger.cpp.o -c /tmp/B.6h_5p9b1/BUILD/ldc-1.29.0-src/gen/logger.cpp [ 18%] Building CXX object CMakeFiles/LDCShared.dir/gen/mangling.cpp.o /usr/bin/x86_64-pld-linux-g++ -DLDC_ENABLE_PLUGINS -DLDC_LLVM_SUPPORTED_TARGET_AArch64=1 -DLDC_LLVM_SUPPORTED_TARGET_AMDGPU=1 -DLDC_LLVM_SUPPORTED_TARGET_ARM=1 -DLDC_LLVM_SUPPORTED_TARGET_AVR=1 -DLDC_LLVM_SUPPORTED_TARGET_BPF=1 -DLDC_LLVM_SUPPORTED_TARGET_Hexagon=1 -DLDC_LLVM_SUPPORTED_TARGET_Lanai=1 -DLDC_LLVM_SUPPORTED_TARGET_MSP430=1 -DLDC_LLVM_SUPPORTED_TARGET_Mips=1 -DLDC_LLVM_SUPPORTED_TARGET_NVPTX=1 -DLDC_LLVM_SUPPORTED_TARGET_PowerPC=1 -DLDC_LLVM_SUPPORTED_TARGET_RISCV=1 -DLDC_LLVM_SUPPORTED_TARGET_SPIRV=1 -DLDC_LLVM_SUPPORTED_TARGET_Sparc=1 -DLDC_LLVM_SUPPORTED_TARGET_SystemZ=1 -DLDC_LLVM_SUPPORTED_TARGET_VE=1 -DLDC_LLVM_SUPPORTED_TARGET_WebAssembly=1 -DLDC_LLVM_SUPPORTED_TARGET_X86=1 -DLDC_LLVM_SUPPORTED_TARGET_XCore=1 -I/tmp/B.6h_5p9b1/BUILD/ldc-1.29.0-src/. -I/tmp/B.6h_5p9b1/BUILD/ldc-1.29.0-src/dmd -DDMDV2 -O2 -fwrapv -pipe -Wformat -Werror=format-security -gdwarf-4 -fno-debug-types-section -fvar-tracking-assignments -g2 -Wp,-D_FORTIFY_SOURCE=2 -fstack-protector-strong --param=ssp-buffer-size=4 -Werror=trampolines -fPIC -march=x86-64 -mtune=generic -gdwarf-4 -fno-debug-types-section -fvar-tracking-assignments -g2 -DNDEBUG -DQT_NO_DEBUG -I/usr/include -std=c++14 -fno-exceptions -D_GNU_SOURCE -D__STDC_CONSTANT_MACROS -D__STDC_FORMAT_MACROS -D__STDC_LIMIT_MACROS -fno-rtti -Wall -Wextra -Wno-unused-parameter -Wno-comment -Wno-missing-field-initializers -Wno-non-virtual-dtor -Wno-pedantic -fvisibility-inlines-hidden -DLDC_POSIX -DIN_LLVM -DOPAQUE_VTBLS "-DLDC_INSTALL_PREFIX=R\"(/usr)\"" -DLDC_LLVM_VER=1500 "-DLDC_LIBDIR_SUFFIX=R\"(64)\"" -DLDC_HOST_LDMD=1 -DLDC_HOST_FE_VER=2097 "-DLDC_LLVM_LIBDIR=R\"(/usr/lib64)\"" -DNDEBUG -MD -MT CMakeFiles/LDCShared.dir/gen/mangling.cpp.o -MF CMakeFiles/LDCShared.dir/gen/mangling.cpp.o.d -o CMakeFiles/LDCShared.dir/gen/mangling.cpp.o -c /tmp/B.6h_5p9b1/BUILD/ldc-1.29.0-src/gen/mangling.cpp [ 18%] Building CXX object CMakeFiles/LDCShared.dir/gen/moduleinfo.cpp.o /usr/bin/x86_64-pld-linux-g++ -DLDC_ENABLE_PLUGINS -DLDC_LLVM_SUPPORTED_TARGET_AArch64=1 -DLDC_LLVM_SUPPORTED_TARGET_AMDGPU=1 -DLDC_LLVM_SUPPORTED_TARGET_ARM=1 -DLDC_LLVM_SUPPORTED_TARGET_AVR=1 -DLDC_LLVM_SUPPORTED_TARGET_BPF=1 -DLDC_LLVM_SUPPORTED_TARGET_Hexagon=1 -DLDC_LLVM_SUPPORTED_TARGET_Lanai=1 -DLDC_LLVM_SUPPORTED_TARGET_MSP430=1 -DLDC_LLVM_SUPPORTED_TARGET_Mips=1 -DLDC_LLVM_SUPPORTED_TARGET_NVPTX=1 -DLDC_LLVM_SUPPORTED_TARGET_PowerPC=1 -DLDC_LLVM_SUPPORTED_TARGET_RISCV=1 -DLDC_LLVM_SUPPORTED_TARGET_SPIRV=1 -DLDC_LLVM_SUPPORTED_TARGET_Sparc=1 -DLDC_LLVM_SUPPORTED_TARGET_SystemZ=1 -DLDC_LLVM_SUPPORTED_TARGET_VE=1 -DLDC_LLVM_SUPPORTED_TARGET_WebAssembly=1 -DLDC_LLVM_SUPPORTED_TARGET_X86=1 -DLDC_LLVM_SUPPORTED_TARGET_XCore=1 -I/tmp/B.6h_5p9b1/BUILD/ldc-1.29.0-src/. -I/tmp/B.6h_5p9b1/BUILD/ldc-1.29.0-src/dmd -DDMDV2 -O2 -fwrapv -pipe -Wformat -Werror=format-security -gdwarf-4 -fno-debug-types-section -fvar-tracking-assignments -g2 -Wp,-D_FORTIFY_SOURCE=2 -fstack-protector-strong --param=ssp-buffer-size=4 -Werror=trampolines -fPIC -march=x86-64 -mtune=generic -gdwarf-4 -fno-debug-types-section -fvar-tracking-assignments -g2 -DNDEBUG -DQT_NO_DEBUG -I/usr/include -std=c++14 -fno-exceptions -D_GNU_SOURCE -D__STDC_CONSTANT_MACROS -D__STDC_FORMAT_MACROS -D__STDC_LIMIT_MACROS -fno-rtti -Wall -Wextra -Wno-unused-parameter -Wno-comment -Wno-missing-field-initializers -Wno-non-virtual-dtor -Wno-pedantic -fvisibility-inlines-hidden -DLDC_POSIX -DIN_LLVM -DOPAQUE_VTBLS "-DLDC_INSTALL_PREFIX=R\"(/usr)\"" -DLDC_LLVM_VER=1500 "-DLDC_LIBDIR_SUFFIX=R\"(64)\"" -DLDC_HOST_LDMD=1 -DLDC_HOST_FE_VER=2097 "-DLDC_LLVM_LIBDIR=R\"(/usr/lib64)\"" -DNDEBUG -MD -MT CMakeFiles/LDCShared.dir/gen/moduleinfo.cpp.o -MF CMakeFiles/LDCShared.dir/gen/moduleinfo.cpp.o.d -o CMakeFiles/LDCShared.dir/gen/moduleinfo.cpp.o -c /tmp/B.6h_5p9b1/BUILD/ldc-1.29.0-src/gen/moduleinfo.cpp [ 18%] Building CXX object CMakeFiles/LDCShared.dir/gen/modules.cpp.o /usr/bin/x86_64-pld-linux-g++ -DLDC_ENABLE_PLUGINS -DLDC_LLVM_SUPPORTED_TARGET_AArch64=1 -DLDC_LLVM_SUPPORTED_TARGET_AMDGPU=1 -DLDC_LLVM_SUPPORTED_TARGET_ARM=1 -DLDC_LLVM_SUPPORTED_TARGET_AVR=1 -DLDC_LLVM_SUPPORTED_TARGET_BPF=1 -DLDC_LLVM_SUPPORTED_TARGET_Hexagon=1 -DLDC_LLVM_SUPPORTED_TARGET_Lanai=1 -DLDC_LLVM_SUPPORTED_TARGET_MSP430=1 -DLDC_LLVM_SUPPORTED_TARGET_Mips=1 -DLDC_LLVM_SUPPORTED_TARGET_NVPTX=1 -DLDC_LLVM_SUPPORTED_TARGET_PowerPC=1 -DLDC_LLVM_SUPPORTED_TARGET_RISCV=1 -DLDC_LLVM_SUPPORTED_TARGET_SPIRV=1 -DLDC_LLVM_SUPPORTED_TARGET_Sparc=1 -DLDC_LLVM_SUPPORTED_TARGET_SystemZ=1 -DLDC_LLVM_SUPPORTED_TARGET_VE=1 -DLDC_LLVM_SUPPORTED_TARGET_WebAssembly=1 -DLDC_LLVM_SUPPORTED_TARGET_X86=1 -DLDC_LLVM_SUPPORTED_TARGET_XCore=1 -I/tmp/B.6h_5p9b1/BUILD/ldc-1.29.0-src/. -I/tmp/B.6h_5p9b1/BUILD/ldc-1.29.0-src/dmd -DDMDV2 -O2 -fwrapv -pipe -Wformat -Werror=format-security -gdwarf-4 -fno-debug-types-section -fvar-tracking-assignments -g2 -Wp,-D_FORTIFY_SOURCE=2 -fstack-protector-strong --param=ssp-buffer-size=4 -Werror=trampolines -fPIC -march=x86-64 -mtune=generic -gdwarf-4 -fno-debug-types-section -fvar-tracking-assignments -g2 -DNDEBUG -DQT_NO_DEBUG -I/usr/include -std=c++14 -fno-exceptions -D_GNU_SOURCE -D__STDC_CONSTANT_MACROS -D__STDC_FORMAT_MACROS -D__STDC_LIMIT_MACROS -fno-rtti -Wall -Wextra -Wno-unused-parameter -Wno-comment -Wno-missing-field-initializers -Wno-non-virtual-dtor -Wno-pedantic -fvisibility-inlines-hidden -DLDC_POSIX -DIN_LLVM -DOPAQUE_VTBLS "-DLDC_INSTALL_PREFIX=R\"(/usr)\"" -DLDC_LLVM_VER=1500 "-DLDC_LIBDIR_SUFFIX=R\"(64)\"" -DLDC_HOST_LDMD=1 -DLDC_HOST_FE_VER=2097 "-DLDC_LLVM_LIBDIR=R\"(/usr/lib64)\"" -DNDEBUG -MD -MT CMakeFiles/LDCShared.dir/gen/modules.cpp.o -MF CMakeFiles/LDCShared.dir/gen/modules.cpp.o.d -o CMakeFiles/LDCShared.dir/gen/modules.cpp.o -c /tmp/B.6h_5p9b1/BUILD/ldc-1.29.0-src/gen/modules.cpp [ 18%] Building CXX object CMakeFiles/LDCShared.dir/gen/ms-cxx-helper.cpp.o /usr/bin/x86_64-pld-linux-g++ -DLDC_ENABLE_PLUGINS -DLDC_LLVM_SUPPORTED_TARGET_AArch64=1 -DLDC_LLVM_SUPPORTED_TARGET_AMDGPU=1 -DLDC_LLVM_SUPPORTED_TARGET_ARM=1 -DLDC_LLVM_SUPPORTED_TARGET_AVR=1 -DLDC_LLVM_SUPPORTED_TARGET_BPF=1 -DLDC_LLVM_SUPPORTED_TARGET_Hexagon=1 -DLDC_LLVM_SUPPORTED_TARGET_Lanai=1 -DLDC_LLVM_SUPPORTED_TARGET_MSP430=1 -DLDC_LLVM_SUPPORTED_TARGET_Mips=1 -DLDC_LLVM_SUPPORTED_TARGET_NVPTX=1 -DLDC_LLVM_SUPPORTED_TARGET_PowerPC=1 -DLDC_LLVM_SUPPORTED_TARGET_RISCV=1 -DLDC_LLVM_SUPPORTED_TARGET_SPIRV=1 -DLDC_LLVM_SUPPORTED_TARGET_Sparc=1 -DLDC_LLVM_SUPPORTED_TARGET_SystemZ=1 -DLDC_LLVM_SUPPORTED_TARGET_VE=1 -DLDC_LLVM_SUPPORTED_TARGET_WebAssembly=1 -DLDC_LLVM_SUPPORTED_TARGET_X86=1 -DLDC_LLVM_SUPPORTED_TARGET_XCore=1 -I/tmp/B.6h_5p9b1/BUILD/ldc-1.29.0-src/. -I/tmp/B.6h_5p9b1/BUILD/ldc-1.29.0-src/dmd -DDMDV2 -O2 -fwrapv -pipe -Wformat -Werror=format-security -gdwarf-4 -fno-debug-types-section -fvar-tracking-assignments -g2 -Wp,-D_FORTIFY_SOURCE=2 -fstack-protector-strong --param=ssp-buffer-size=4 -Werror=trampolines -fPIC -march=x86-64 -mtune=generic -gdwarf-4 -fno-debug-types-section -fvar-tracking-assignments -g2 -DNDEBUG -DQT_NO_DEBUG -I/usr/include -std=c++14 -fno-exceptions -D_GNU_SOURCE -D__STDC_CONSTANT_MACROS -D__STDC_FORMAT_MACROS -D__STDC_LIMIT_MACROS -fno-rtti -Wall -Wextra -Wno-unused-parameter -Wno-comment -Wno-missing-field-initializers -Wno-non-virtual-dtor -Wno-pedantic -fvisibility-inlines-hidden -DLDC_POSIX -DIN_LLVM -DOPAQUE_VTBLS "-DLDC_INSTALL_PREFIX=R\"(/usr)\"" -DLDC_LLVM_VER=1500 "-DLDC_LIBDIR_SUFFIX=R\"(64)\"" -DLDC_HOST_LDMD=1 -DLDC_HOST_FE_VER=2097 "-DLDC_LLVM_LIBDIR=R\"(/usr/lib64)\"" -DNDEBUG -MD -MT CMakeFiles/LDCShared.dir/gen/ms-cxx-helper.cpp.o -MF CMakeFiles/LDCShared.dir/gen/ms-cxx-helper.cpp.o.d -o CMakeFiles/LDCShared.dir/gen/ms-cxx-helper.cpp.o -c /tmp/B.6h_5p9b1/BUILD/ldc-1.29.0-src/gen/ms-cxx-helper.cpp [ 18%] Building CXX object CMakeFiles/LDCShared.dir/gen/naked.cpp.o /usr/bin/x86_64-pld-linux-g++ -DLDC_ENABLE_PLUGINS -DLDC_LLVM_SUPPORTED_TARGET_AArch64=1 -DLDC_LLVM_SUPPORTED_TARGET_AMDGPU=1 -DLDC_LLVM_SUPPORTED_TARGET_ARM=1 -DLDC_LLVM_SUPPORTED_TARGET_AVR=1 -DLDC_LLVM_SUPPORTED_TARGET_BPF=1 -DLDC_LLVM_SUPPORTED_TARGET_Hexagon=1 -DLDC_LLVM_SUPPORTED_TARGET_Lanai=1 -DLDC_LLVM_SUPPORTED_TARGET_MSP430=1 -DLDC_LLVM_SUPPORTED_TARGET_Mips=1 -DLDC_LLVM_SUPPORTED_TARGET_NVPTX=1 -DLDC_LLVM_SUPPORTED_TARGET_PowerPC=1 -DLDC_LLVM_SUPPORTED_TARGET_RISCV=1 -DLDC_LLVM_SUPPORTED_TARGET_SPIRV=1 -DLDC_LLVM_SUPPORTED_TARGET_Sparc=1 -DLDC_LLVM_SUPPORTED_TARGET_SystemZ=1 -DLDC_LLVM_SUPPORTED_TARGET_VE=1 -DLDC_LLVM_SUPPORTED_TARGET_WebAssembly=1 -DLDC_LLVM_SUPPORTED_TARGET_X86=1 -DLDC_LLVM_SUPPORTED_TARGET_XCore=1 -I/tmp/B.6h_5p9b1/BUILD/ldc-1.29.0-src/. -I/tmp/B.6h_5p9b1/BUILD/ldc-1.29.0-src/dmd -DDMDV2 -O2 -fwrapv -pipe -Wformat -Werror=format-security -gdwarf-4 -fno-debug-types-section -fvar-tracking-assignments -g2 -Wp,-D_FORTIFY_SOURCE=2 -fstack-protector-strong --param=ssp-buffer-size=4 -Werror=trampolines -fPIC -march=x86-64 -mtune=generic -gdwarf-4 -fno-debug-types-section -fvar-tracking-assignments -g2 -DNDEBUG -DQT_NO_DEBUG -I/usr/include -std=c++14 -fno-exceptions -D_GNU_SOURCE -D__STDC_CONSTANT_MACROS -D__STDC_FORMAT_MACROS -D__STDC_LIMIT_MACROS -fno-rtti -Wall -Wextra -Wno-unused-parameter -Wno-comment -Wno-missing-field-initializers -Wno-non-virtual-dtor -Wno-pedantic -fvisibility-inlines-hidden -DLDC_POSIX -DIN_LLVM -DOPAQUE_VTBLS "-DLDC_INSTALL_PREFIX=R\"(/usr)\"" -DLDC_LLVM_VER=1500 "-DLDC_LIBDIR_SUFFIX=R\"(64)\"" -DLDC_HOST_LDMD=1 -DLDC_HOST_FE_VER=2097 "-DLDC_LLVM_LIBDIR=R\"(/usr/lib64)\"" -DNDEBUG -MD -MT CMakeFiles/LDCShared.dir/gen/naked.cpp.o -MF CMakeFiles/LDCShared.dir/gen/naked.cpp.o.d -o CMakeFiles/LDCShared.dir/gen/naked.cpp.o -c /tmp/B.6h_5p9b1/BUILD/ldc-1.29.0-src/gen/naked.cpp /tmp/B.6h_5p9b1/BUILD/ldc-1.29.0-src/gen/naked.cpp: In function 'llvm::CallInst* DtoInlineAsmExpr(const Loc&, llvm::StringRef, llvm::StringRef, llvm::ArrayRef<llvm::Value*>, llvm::Type*)': /tmp/B.6h_5p9b1/BUILD/ldc-1.29.0-src/gen/naked.cpp:474:25: error: 'Verify' is not a member of 'llvm::InlineAsm' 474 | if (!llvm::InlineAsm::Verify(FT, constraints)) { | ^~~~~~ gmake[2]: *** [CMakeFiles/LDCShared.dir/build.make:681: CMakeFiles/LDCShared.dir/gen/naked.cpp.o] Error 1 gmake[2]: Leaving directory '/tmp/B.6h_5p9b1/BUILD/ldc-1.29.0-src/build-bootstrap2/build' gmake[1]: *** [CMakeFiles/Makefile2:203: CMakeFiles/LDCShared.dir/all] Error 2 gmake[1]: Leaving directory '/tmp/B.6h_5p9b1/BUILD/ldc-1.29.0-src/build-bootstrap2/build' gmake: *** [Makefile:169: all] Error 2 error: Bad exit status from /tmp/B.6h_5p9b1/BUILD/tmp/rpm-tmp.NFov94 (%build) RPM build warnings: Could not canonicalize hostname: ymir RPM build errors: Bad exit status from /tmp/B.6h_5p9b1/BUILD/tmp/rpm-tmp.NFov94 (%build) ended at: Tue Oct 18 06:56:35 2022, done in 0:04:21.052048 error: No files produced. + chmod -R u+rwX /tmp/B.6h_5p9b1/BUILD + rm -rf /tmp/B.6h_5p9b1/tmp /tmp/B.6h_5p9b1/BUILD + rm -rf /tmp/B.6h_5p9b1 Begin-PLD-Builder-Info Build-Time: user:247.91s sys:23.53s real:270.03s (faults io:238 non-io:5140521) End-PLD-Builder-Info
[Back to list of logs] [View rpm -qa of builder]