FailedOk

th/SRPMS[OK]
th/x32[OK]
th/i686[OK]
th/x86_64[OK]

ac/SRPMS[OK]
ac/i386[OK]
ac/i586[OK]
ac/i686[OK]
ac/alpha[OK]
ac/amd64[OK]
ac/athlon[OK]
ac/ppc[OK]
ac/sparc[OK]
ac/sparc64[OK]

Advanced Search
main()
Powered by PLD Linux
(c) 2002-2021 PLD Team
$Revision: 1.37 $
Powered by PDP-11.
Your IP: 54.80.173.217

libebml ff377436-56be-413d-b078-aca545da256f

Status:Failed
Source URL:https://buildlogs.pld-linux.org/pld/th/x86_64/FAIL/libebml,ff377436-56be-413d-b078-aca545da256f.bz2
text/plain URL:View!
rpm -qa of builder:View!
Date:2021/11/21 01:00:19
Runtime:0:00:04.073964

Toc:

  • prep
  • Executing(%prep): /bin/sh -e /tmp/B.7w2vcu1z/BUILD/tmp/rpm-tmp.hyfJxm
  • build
  • Executing(%build): /bin/sh -e /tmp/B.7w2vcu1z/BUILD/tmp/rpm-tmp.nqP7eh
  • error 1
  • /tmp/B.7w2vcu1z/BUILD/libebml-1.4.2/src/EbmlString.cpp:147:41: error: 'numeric_limits' is not a member of 'std'
  • error 2
  • /tmp/B.7w2vcu1z/BUILD/libebml-1.4.2/src/EbmlString.cpp:147:67: error: expected primary-expression before '>' token
  • error 3
  • /tmp/B.7w2vcu1z/BUILD/libebml-1.4.2/src/EbmlString.cpp:147:70: error: '::max' has not been declared; did you mean 'std::max'?
  • error 4
  • /tmp/B.7w2vcu1z/BUILD/libebml-1.4.2/src/EbmlString.cpp:157:17: error: type '<type error>' argument given to 'delete', expected pointer
  • error 5
  • make[2]: *** [CMakeFiles/ebml.dir/build.make:242: CMakeFiles/ebml.dir/src/EbmlString.cpp.o] Error 1
  • error 6
  • /tmp/B.7w2vcu1z/BUILD/libebml-1.4.2/src/EbmlUnicodeString.cpp:312:41: error: 'numeric_limits' is not a member of 'std'
  • error 7
  • /tmp/B.7w2vcu1z/BUILD/libebml-1.4.2/src/EbmlUnicodeString.cpp:312:67: error: expected primary-expression before '>' token
  • error 8
  • /tmp/B.7w2vcu1z/BUILD/libebml-1.4.2/src/EbmlUnicodeString.cpp:312:70: error: '::max' has not been declared; did you mean 'std::max'?
  • error 9
  • /tmp/B.7w2vcu1z/BUILD/libebml-1.4.2/src/EbmlUnicodeString.cpp:323:17: error: type '<type error>' argument given to 'delete', expected pointer
  • error 10
  • make[2]: *** [CMakeFiles/ebml.dir/build.make:281: CMakeFiles/ebml.dir/src/EbmlUnicodeString.cpp.o] Error 1
  • error 11
  • make[1]: *** [CMakeFiles/Makefile2:99: CMakeFiles/ebml.dir/all] Error 2
  • error 12
  • error: Bad exit status from /tmp/B.7w2vcu1z/BUILD/tmp/rpm-tmp.nqP7eh (%build)
  • error 13
  • RPM build errors:
  • error 14
  • error: No files produced.

Content:

request from: baggins
checking if we should skip the build
started at: Sun Nov 21 01:00:13 2021
killing old processes on a builder
sending signal 9 to pid -1
cleaning up /tmp
fetching https://srcbuilder.pld-linux.org/th//srpms/ff377436-56be-413d-b078-aca545da256f/libebml-1.4.2-2.src.rpm
fetched 81562 bytes, 341.8 K/s
installing srpm: libebml-1.4.2-2.src.rpm
+ install -d /tmp/B.7w2vcu1z/BUILD /tmp/B.7w2vcu1z/RPMS
+ LC_ALL=en_US.UTF-8
+ rpm -qp --changelog libebml-1.4.2-2.src.rpm
* Sat Nov 20 2021 PLD Linux Team <feedback@pld-linux.org>
- For complete changelog see: http://git.pld-linux.org/?p=packages/libebml.git;a=log;h=master
* Sat Nov 20 2021 Jan Rękorajski <baggins@pld-linux.org> 648fce9
- rebuild with separate debuginfo build-ids * Tue Feb 23 2021 Jan Palus <atler@pld-linux.org> 0a11545
- BRs for tar.xz source * Tue Feb 23 2021 Jan Palus <atler@pld-linux.org> de57894
- up to 1.4.2 (fixes CVE-2021-3405) * Wed Jan 06 2021 Jan Palus <atler@pld-linux.org> f83e7ba
- up to 1.4.1 * Fri Sep 25 2020 Jakub Bogusz <qboosh@pld-linux.org> 386b452
- updated to 1.4.0 (new soname; some buffer overflow fix) * Tue Mar 17 2020 Jakub Bogusz <qboosh@pld-linux.org> bbcf704
- updated to 1.3.10 * Sat Jun 01 2019 Jakub Bogusz <qboosh@pld-linux.org> aa2cebf
- updated to 1.3.9 * Tue Feb 19 2019 Jakub Bogusz <qboosh@pld-linux.org> d76b557
- macros for cmake * Tue Feb 19 2019 Jakub Bogusz <qboosh@pld-linux.org> 0bc28d6
- updated to 1.3.6; build system has been changed to cmake * Tue Mar 13 2018 Marcin Krol <hawk@tld-linux.org> e57153e
- release 2 * Sat Aug 26 2017 Jan Palus <atler@pld-linux.org> 499e890
- up to 1.3.5 * Thu Aug 04 2016 Jakub Bogusz <qboosh@pld-linux.org> f080881
- updated to 1.3.4 * Mon Nov 09 2015 Jakub Bogusz <qboosh@pld-linux.org> 37635db
- updated to 1.3.3 * Fri Mar 13 2015 Jan Rękorajski <baggins@pld-linux.org> e7e79a1
- release 3 (by relup.sh) * Fri Mar 13 2015 Jan Rękorajski <baggins@pld-linux.org> c281239
- release 2 (by relup.sh) * Sat Jan 10 2015 Jakub Bogusz <qboosh@pld-linux.org> 899ab54
- updated to 1.3.1 - removed obsolete makefile patch (upstream switched to ac/am/lt based build system) * Fri Mar 22 2013 Jakub Bogusz <qboosh@pld-linux.org> 969a89f
- updated to 1.3.0 (note: new soname) - updated makefile patch * Mon Sep 26 2011 Jakub Bogusz <qboosh@pld-linux.org> e5a7c79
- updated to 1.2.2 * Thu Jun 30 2011 Jakub Bogusz <qboosh@pld-linux.org> d349043
- updated to 1.2.1 * Sat Feb 26 2011 Arkadiusz Miśkiewicz <arekm@maven.pl> 5809cf2
- rel 2; build/link using cxx + rpm -Uhv --nodeps --define '_topdir /tmp/B.7w2vcu1z' --define '_specdir %{_topdir}' --define '_sourcedir %{_specdir}' --define '_rpmdir %{_topdir}/RPMS' --define '_builddir %{_topdir}/BUILD' libebml-1.4.2-2.src.rpm Updating / installing... libebml-1.4.2-2 ######################################## + rm -f libebml-1.4.2-2.src.rpm + install -m 700 -d /tmp/B.7w2vcu1z/BUILD/tmp + TMPDIR=/tmp/B.7w2vcu1z/BUILD/tmp + exec nice -n 0 rpmbuild -bp --short-circuit --nodeps --define '_topdir /tmp/B.7w2vcu1z' --define '_specdir %{_topdir}' --define '_sourcedir %{_specdir}' --define '_rpmdir %{_topdir}/RPMS' --define '_builddir %{_topdir}/BUILD' --target x86_64-pld-linux --define 'prep exit 0' /tmp/B.7w2vcu1z/libebml.spec warning: Could not canonicalize hostname: ymir Building target platforms: x86_64-pld-linux Building for target x86_64-pld-linux checking BuildConflict-ing packages rpm: warning: Could not canonicalize hostname: ymir rpm: Building target platforms: x86_64-pld-linux rpm: Building for target x86_64-pld-linux no BuildConflicts found checking BR rpm: warning: Could not canonicalize hostname: ymir rpm: Building target platforms: x86_64-pld-linux rpm: Building for target x86_64-pld-linux no BR needed building RPM using: set -ex; : build-id: ff377436-56be-413d-b078-aca545da256f; TMPDIR=/tmp/B.7w2vcu1z/BUILD/tmp exec nice -n 0 rpmbuild -bb --define '_smp_mflags -j9' --define '_make_opts -Otarget' --define '_pld_builder 1' --define '_topdir /tmp/B.7w2vcu1z' --define '_specdir %{_topdir}' --define '_sourcedir %{_specdir}' --define '_rpmdir %{_topdir}/RPMS' --define '_builddir %{_topdir}/BUILD' --target x86_64-pld-linux /tmp/B.7w2vcu1z/libebml.spec + : build-id: ff377436-56be-413d-b078-aca545da256f + TMPDIR=/tmp/B.7w2vcu1z/BUILD/tmp + exec nice -n 0 rpmbuild -bb --define '_smp_mflags -j9' --define '_make_opts -Otarget' --define '_pld_builder 1' --define '_topdir /tmp/B.7w2vcu1z' --define '_specdir %{_topdir}' --define '_sourcedir %{_specdir}' --define '_rpmdir %{_topdir}/RPMS' --define '_builddir %{_topdir}/BUILD' --target x86_64-pld-linux /tmp/B.7w2vcu1z/libebml.spec warning: Could not canonicalize hostname: ymir Building target platforms: x86_64-pld-linux Building for target x86_64-pld-linux Executing(%prep): /bin/sh -e /tmp/B.7w2vcu1z/BUILD/tmp/rpm-tmp.hyfJxm + umask 022 + cd /tmp/B.7w2vcu1z/BUILD + cd /tmp/B.7w2vcu1z/BUILD + rm -rf libebml-1.4.2 + /usr/bin/xz -dc /tmp/B.7w2vcu1z/libebml-1.4.2.tar.xz + /bin/tar -xof - + STATUS=0 + '[' 0 -ne 0 ']' + cd libebml-1.4.2 + /bin/chmod -Rf a+rX,u+w,g-w,o-w . + RPM_EC=0 + jobs -p + exit 0 Executing(%build): /bin/sh -e /tmp/B.7w2vcu1z/BUILD/tmp/rpm-tmp.nqP7eh TMP=/home/users/builder/tmp HOME=/home/users/builder PATH=/home/users/builder/GNUstep/Tools:/bin:/usr/bin:/usr/local/bin:/home/users/builder/bin TMPDIR=/tmp/B.7w2vcu1z/BUILD/tmp + umask 022 + cd /tmp/B.7w2vcu1z/BUILD + cd libebml-1.4.2 + install -d build-static + cd build-static + CC=x86_64-pld-linux-gcc CXX=x86_64-pld-linux-g++ CPPFLAGS='' /usr/bin/cmake '-DCMAKE_VERBOSE_MAKEFILE:BOOL=ON' '-DCMAKE_BUILD_TYPE=PLD' '-DCMAKE_INSTALL_BINDIR:PATH=/usr/bin' '-DCMAKE_INSTALL_SBINDIR:PATH=/usr/sbin' '-DCMAKE_INSTALL_LIBEXECDIR:PATH=/usr/libexec' '-DCMAKE_INSTALL_SYSCONFDIR:PATH=/etc' '-DCMAKE_INSTALL_SHAREDSTATEDIRPATH:PATH=/var/lib' '-DCMAKE_INSTALL_LOCALSTATEDIRPATH:PATH=/var' '-DCMAKE_INSTALL_LIBDIR:PATH=/usr/lib64' '-DCMAKE_INSTALL_INCLUDEDIR:PATH=/usr/include' '-DCMAKE_INSTALL_OLDINCLUDEDIR:PATH=/usr/include' '-DCMAKE_INSTALL_DATAROOTDIR:PATH=/usr/share' '-DCMAKE_INSTALL_DATADIR:PATH=/usr/share' '-DCMAKE_INSTALL_INFODIR:PATH=/usr/share/info' '-DCMAKE_INSTALL_LOCALEDIR:PATH=/usr/share/locale' '-DCMAKE_INSTALL_MANDIR:PATH=/usr/share/man' '-DCMAKE_INSTALL_DOCDIR:PATH=/usr/share/doc' '-DCMAKE_INSTALL_PREFIX:PATH=/usr' '-DSYSCONF_INSTALL_DIR:PATH=/etc' '-DCMAKE_CXX_FLAGS_PLD=-O2 -fwrapv -pipe -Wformat -Werror=format-security -gdwarf-4 -fno-debug-types-section -fvar-tracking-assignments -g2 -Wp,-D_FORTIFY_SOURCE=2 -fstack-protector-strong --param=ssp-buffer-size=4 -Werror=trampolines -fPIC -march=x86-64 -mtune=generic -gdwarf-4 -fno-debug-types-section -fvar-tracking-assignments -g2 -DNDEBUG -DQT_NO_DEBUG' '-DCMAKE_C_FLAGS_PLD=-O2 -fwrapv -pipe -Wformat -Werror=format-security -gdwarf-4 -fno-debug-types-section -fvar-tracking-assignments -g2 -Wp,-D_FORTIFY_SOURCE=2 -fstack-protector-strong --param=ssp-buffer-size=4 -Werror=trampolines -fPIC -march=x86-64 -mtune=generic -gdwarf-4 -fno-debug-types-section -fvar-tracking-assignments -g2 -DNDEBUG -DQT_NO_DEBUG' '-DCMAKE_Fortran_FLAGS_PLD=-O2 -fwrapv -pipe -Wformat -Werror=format-security -gdwarf-4 -fno-debug-types-section -fvar-tracking-assignments -g2 -Wp,-D_FORTIFY_SOURCE=2 -fstack-protector-strong --param=ssp-buffer-size=4 -Werror=trampolines -fPIC -march=x86-64 -mtune=generic -gdwarf-4 -fno-debug-types-section -fvar-tracking-assignments -g2 -DNDEBUG -DQT_NO_DEBUG' '-DCMAKE_EXE_LINKER_FLAGS_PLD=-Wl,--as-needed -Wl,--no-copy-dt-needed-entries -Wl,-z,relro -Wl,-z,combreloc ' '-DCMAKE_SHARED_LINKER_FLAGS_PLD=-Wl,--as-needed -Wl,--no-copy-dt-needed-entries -Wl,-z,relro -Wl,-z,combreloc ' '-DCMAKE_MODULE_LINKER_FLAGS_PLD=-Wl,--as-needed -Wl,--no-copy-dt-needed-entries -Wl,-z,relro -Wl,-z,combreloc ' '-DLIB_SUFFIX=64' '-DBUILD_SHARED_LIBS:BOOL=ON' .. '-DBUILD_SHARED_LIBS:BOOL=OFF' '-DCMAKE_INSTALL_INCLUDEDIR=include' '-DCMAKE_INSTALL_LIBDIR=lib64' -- The C compiler identification is GNU 11.2.0 -- The CXX compiler identification is GNU 11.2.0 -- Check for working C compiler: /usr/bin/x86_64-pld-linux-gcc -- Check for working C compiler: /usr/bin/x86_64-pld-linux-gcc - works -- Detecting C compiler ABI info -- Detecting C compiler ABI info - done -- Detecting C compile features -- Detecting C compile features - done -- Check for working CXX compiler: /usr/bin/x86_64-pld-linux-g++ -- Check for working CXX compiler: /usr/bin/x86_64-pld-linux-g++ - works -- Detecting CXX compiler ABI info -- Detecting CXX compiler ABI info - done -- Detecting CXX compile features -- Detecting CXX compile features - done -- Performing Test COMPILER_HAS_HIDDEN_VISIBILITY -- Performing Test COMPILER_HAS_HIDDEN_VISIBILITY - Success -- Performing Test COMPILER_HAS_HIDDEN_INLINE_VISIBILITY -- Performing Test COMPILER_HAS_HIDDEN_INLINE_VISIBILITY - Success -- Performing Test COMPILER_HAS_DEPRECATED_ATTR -- Performing Test COMPILER_HAS_DEPRECATED_ATTR - Success -- Configuring done CMake Warning (dev) at CMakeLists.txt:75 (add_library): Policy CMP0063 is not set: Honor visibility properties for all target types. Run "cmake --help-policy CMP0063" for policy details. Use the cmake_policy command to set the policy and suppress this warning. Target "ebml" of type "STATIC_LIBRARY" has the following visibility properties set for CXX: CXX_VISIBILITY_PRESET VISIBILITY_INLINES_HIDDEN For compatibility CMake is not honoring them for this target. This warning is for project developers. Use -Wno-dev to suppress it. -- Generating done CMake Warning: Manually-specified variables were not used by the project: CMAKE_Fortran_FLAGS_PLD CMAKE_INSTALL_LOCALSTATEDIRPATH CMAKE_INSTALL_SHAREDSTATEDIRPATH LIB_SUFFIX SYSCONF_INSTALL_DIR -- Build files have been written to: /tmp/B.7w2vcu1z/BUILD/libebml-1.4.2/build-static + /usr/bin/make -Otarget -j9 /usr/bin/cmake -S/tmp/B.7w2vcu1z/BUILD/libebml-1.4.2 -B/tmp/B.7w2vcu1z/BUILD/libebml-1.4.2/build-static --check-build-system CMakeFiles/Makefile.cmake 0 /usr/bin/cmake -E cmake_progress_start /tmp/B.7w2vcu1z/BUILD/libebml-1.4.2/build-static/CMakeFiles /tmp/B.7w2vcu1z/BUILD/libebml-1.4.2/build-static/CMakeFiles/progress.marks /usr/bin/make -f CMakeFiles/Makefile2 all /usr/bin/make -f CMakeFiles/ebml.dir/build.make CMakeFiles/ebml.dir/depend make[2]: Entering directory '/tmp/B.7w2vcu1z/BUILD/libebml-1.4.2/build-static' cd /tmp/B.7w2vcu1z/BUILD/libebml-1.4.2/build-static && /usr/bin/cmake -E cmake_depends "Unix Makefiles" /tmp/B.7w2vcu1z/BUILD/libebml-1.4.2 /tmp/B.7w2vcu1z/BUILD/libebml-1.4.2 /tmp/B.7w2vcu1z/BUILD/libebml-1.4.2/build-static /tmp/B.7w2vcu1z/BUILD/libebml-1.4.2/build-static /tmp/B.7w2vcu1z/BUILD/libebml-1.4.2/build-static/CMakeFiles/ebml.dir/DependInfo.cmake --color= Scanning dependencies of target ebml make[2]: Leaving directory '/tmp/B.7w2vcu1z/BUILD/libebml-1.4.2/build-static' /usr/bin/make -f CMakeFiles/ebml.dir/build.make CMakeFiles/ebml.dir/build make[2]: Entering directory '/tmp/B.7w2vcu1z/BUILD/libebml-1.4.2/build-static' [ 4%] Building CXX object CMakeFiles/ebml.dir/src/Debug.cpp.o /usr/bin/x86_64-pld-linux-g++ -DEBML_STATIC_DEFINE -I/tmp/B.7w2vcu1z/BUILD/libebml-1.4.2/build-static -I/tmp/B.7w2vcu1z/BUILD/libebml-1.4.2 -O2 -fwrapv -pipe -Wformat -Werror=format-security -gdwarf-4 -fno-debug-types-section -fvar-tracking-assignments -g2 -Wp,-D_FORTIFY_SOURCE=2 -fstack-protector-strong --param=ssp-buffer-size=4 -Werror=trampolines -fPIC -march=x86-64 -mtune=generic -gdwarf-4 -fno-debug-types-section -fvar-tracking-assignments -g2 -DNDEBUG -DQT_NO_DEBUG -std=gnu++11 -o CMakeFiles/ebml.dir/src/Debug.cpp.o -c /tmp/B.7w2vcu1z/BUILD/libebml-1.4.2/src/Debug.cpp make[2]: Leaving directory '/tmp/B.7w2vcu1z/BUILD/libebml-1.4.2/build-static' make[2]: Entering directory '/tmp/B.7w2vcu1z/BUILD/libebml-1.4.2/build-static' [ 25%] Building CXX object CMakeFiles/ebml.dir/src/EbmlContexts.cpp.o /usr/bin/x86_64-pld-linux-g++ -DEBML_STATIC_DEFINE -I/tmp/B.7w2vcu1z/BUILD/libebml-1.4.2/build-static -I/tmp/B.7w2vcu1z/BUILD/libebml-1.4.2 -O2 -fwrapv -pipe -Wformat -Werror=format-security -gdwarf-4 -fno-debug-types-section -fvar-tracking-assignments -g2 -Wp,-D_FORTIFY_SOURCE=2 -fstack-protector-strong --param=ssp-buffer-size=4 -Werror=trampolines -fPIC -march=x86-64 -mtune=generic -gdwarf-4 -fno-debug-types-section -fvar-tracking-assignments -g2 -DNDEBUG -DQT_NO_DEBUG -std=gnu++11 -o CMakeFiles/ebml.dir/src/EbmlContexts.cpp.o -c /tmp/B.7w2vcu1z/BUILD/libebml-1.4.2/src/EbmlContexts.cpp make[2]: Leaving directory '/tmp/B.7w2vcu1z/BUILD/libebml-1.4.2/build-static' make[2]: Entering directory '/tmp/B.7w2vcu1z/BUILD/libebml-1.4.2/build-static' [ 12%] Building CXX object CMakeFiles/ebml.dir/src/EbmlDummy.cpp.o /usr/bin/x86_64-pld-linux-g++ -DEBML_STATIC_DEFINE -I/tmp/B.7w2vcu1z/BUILD/libebml-1.4.2/build-static -I/tmp/B.7w2vcu1z/BUILD/libebml-1.4.2 -O2 -fwrapv -pipe -Wformat -Werror=format-security -gdwarf-4 -fno-debug-types-section -fvar-tracking-assignments -g2 -Wp,-D_FORTIFY_SOURCE=2 -fstack-protector-strong --param=ssp-buffer-size=4 -Werror=trampolines -fPIC -march=x86-64 -mtune=generic -gdwarf-4 -fno-debug-types-section -fvar-tracking-assignments -g2 -DNDEBUG -DQT_NO_DEBUG -std=gnu++11 -o CMakeFiles/ebml.dir/src/EbmlDummy.cpp.o -c /tmp/B.7w2vcu1z/BUILD/libebml-1.4.2/src/EbmlDummy.cpp make[2]: Leaving directory '/tmp/B.7w2vcu1z/BUILD/libebml-1.4.2/build-static' make[2]: Entering directory '/tmp/B.7w2vcu1z/BUILD/libebml-1.4.2/build-static' [ 25%] Building CXX object CMakeFiles/ebml.dir/src/EbmlDate.cpp.o /usr/bin/x86_64-pld-linux-g++ -DEBML_STATIC_DEFINE -I/tmp/B.7w2vcu1z/BUILD/libebml-1.4.2/build-static -I/tmp/B.7w2vcu1z/BUILD/libebml-1.4.2 -O2 -fwrapv -pipe -Wformat -Werror=format-security -gdwarf-4 -fno-debug-types-section -fvar-tracking-assignments -g2 -Wp,-D_FORTIFY_SOURCE=2 -fstack-protector-strong --param=ssp-buffer-size=4 -Werror=trampolines -fPIC -march=x86-64 -mtune=generic -gdwarf-4 -fno-debug-types-section -fvar-tracking-assignments -g2 -DNDEBUG -DQT_NO_DEBUG -std=gnu++11 -o CMakeFiles/ebml.dir/src/EbmlDate.cpp.o -c /tmp/B.7w2vcu1z/BUILD/libebml-1.4.2/src/EbmlDate.cpp make[2]: Leaving directory '/tmp/B.7w2vcu1z/BUILD/libebml-1.4.2/build-static' make[2]: Entering directory '/tmp/B.7w2vcu1z/BUILD/libebml-1.4.2/build-static' [ 33%] Building CXX object CMakeFiles/ebml.dir/src/EbmlFloat.cpp.o /usr/bin/x86_64-pld-linux-g++ -DEBML_STATIC_DEFINE -I/tmp/B.7w2vcu1z/BUILD/libebml-1.4.2/build-static -I/tmp/B.7w2vcu1z/BUILD/libebml-1.4.2 -O2 -fwrapv -pipe -Wformat -Werror=format-security -gdwarf-4 -fno-debug-types-section -fvar-tracking-assignments -g2 -Wp,-D_FORTIFY_SOURCE=2 -fstack-protector-strong --param=ssp-buffer-size=4 -Werror=trampolines -fPIC -march=x86-64 -mtune=generic -gdwarf-4 -fno-debug-types-section -fvar-tracking-assignments -g2 -DNDEBUG -DQT_NO_DEBUG -std=gnu++11 -o CMakeFiles/ebml.dir/src/EbmlFloat.cpp.o -c /tmp/B.7w2vcu1z/BUILD/libebml-1.4.2/src/EbmlFloat.cpp make[2]: Leaving directory '/tmp/B.7w2vcu1z/BUILD/libebml-1.4.2/build-static' make[2]: Entering directory '/tmp/B.7w2vcu1z/BUILD/libebml-1.4.2/build-static' [ 12%] Building CXX object CMakeFiles/ebml.dir/src/EbmlBinary.cpp.o /usr/bin/x86_64-pld-linux-g++ -DEBML_STATIC_DEFINE -I/tmp/B.7w2vcu1z/BUILD/libebml-1.4.2/build-static -I/tmp/B.7w2vcu1z/BUILD/libebml-1.4.2 -O2 -fwrapv -pipe -Wformat -Werror=format-security -gdwarf-4 -fno-debug-types-section -fvar-tracking-assignments -g2 -Wp,-D_FORTIFY_SOURCE=2 -fstack-protector-strong --param=ssp-buffer-size=4 -Werror=trampolines -fPIC -march=x86-64 -mtune=generic -gdwarf-4 -fno-debug-types-section -fvar-tracking-assignments -g2 -DNDEBUG -DQT_NO_DEBUG -std=gnu++11 -o CMakeFiles/ebml.dir/src/EbmlBinary.cpp.o -c /tmp/B.7w2vcu1z/BUILD/libebml-1.4.2/src/EbmlBinary.cpp make[2]: Leaving directory '/tmp/B.7w2vcu1z/BUILD/libebml-1.4.2/build-static' make[2]: Entering directory '/tmp/B.7w2vcu1z/BUILD/libebml-1.4.2/build-static' [ 50%] Building CXX object CMakeFiles/ebml.dir/src/EbmlStream.cpp.o /usr/bin/x86_64-pld-linux-g++ -DEBML_STATIC_DEFINE -I/tmp/B.7w2vcu1z/BUILD/libebml-1.4.2/build-static -I/tmp/B.7w2vcu1z/BUILD/libebml-1.4.2 -O2 -fwrapv -pipe -Wformat -Werror=format-security -gdwarf-4 -fno-debug-types-section -fvar-tracking-assignments -g2 -Wp,-D_FORTIFY_SOURCE=2 -fstack-protector-strong --param=ssp-buffer-size=4 -Werror=trampolines -fPIC -march=x86-64 -mtune=generic -gdwarf-4 -fno-debug-types-section -fvar-tracking-assignments -g2 -DNDEBUG -DQT_NO_DEBUG -std=gnu++11 -o CMakeFiles/ebml.dir/src/EbmlStream.cpp.o -c /tmp/B.7w2vcu1z/BUILD/libebml-1.4.2/src/EbmlStream.cpp make[2]: Leaving directory '/tmp/B.7w2vcu1z/BUILD/libebml-1.4.2/build-static' make[2]: Entering directory '/tmp/B.7w2vcu1z/BUILD/libebml-1.4.2/build-static' [ 37%] Building CXX object CMakeFiles/ebml.dir/src/EbmlHead.cpp.o /usr/bin/x86_64-pld-linux-g++ -DEBML_STATIC_DEFINE -I/tmp/B.7w2vcu1z/BUILD/libebml-1.4.2/build-static -I/tmp/B.7w2vcu1z/BUILD/libebml-1.4.2 -O2 -fwrapv -pipe -Wformat -Werror=format-security -gdwarf-4 -fno-debug-types-section -fvar-tracking-assignments -g2 -Wp,-D_FORTIFY_SOURCE=2 -fstack-protector-strong --param=ssp-buffer-size=4 -Werror=trampolines -fPIC -march=x86-64 -mtune=generic -gdwarf-4 -fno-debug-types-section -fvar-tracking-assignments -g2 -DNDEBUG -DQT_NO_DEBUG -std=gnu++11 -o CMakeFiles/ebml.dir/src/EbmlHead.cpp.o -c /tmp/B.7w2vcu1z/BUILD/libebml-1.4.2/src/EbmlHead.cpp make[2]: Leaving directory '/tmp/B.7w2vcu1z/BUILD/libebml-1.4.2/build-static' make[2]: Entering directory '/tmp/B.7w2vcu1z/BUILD/libebml-1.4.2/build-static' [ 45%] Building CXX object CMakeFiles/ebml.dir/src/EbmlSInteger.cpp.o /usr/bin/x86_64-pld-linux-g++ -DEBML_STATIC_DEFINE -I/tmp/B.7w2vcu1z/BUILD/libebml-1.4.2/build-static -I/tmp/B.7w2vcu1z/BUILD/libebml-1.4.2 -O2 -fwrapv -pipe -Wformat -Werror=format-security -gdwarf-4 -fno-debug-types-section -fvar-tracking-assignments -g2 -Wp,-D_FORTIFY_SOURCE=2 -fstack-protector-strong --param=ssp-buffer-size=4 -Werror=trampolines -fPIC -march=x86-64 -mtune=generic -gdwarf-4 -fno-debug-types-section -fvar-tracking-assignments -g2 -DNDEBUG -DQT_NO_DEBUG -std=gnu++11 -o CMakeFiles/ebml.dir/src/EbmlSInteger.cpp.o -c /tmp/B.7w2vcu1z/BUILD/libebml-1.4.2/src/EbmlSInteger.cpp make[2]: Leaving directory '/tmp/B.7w2vcu1z/BUILD/libebml-1.4.2/build-static' make[2]: Entering directory '/tmp/B.7w2vcu1z/BUILD/libebml-1.4.2/build-static' [ 54%] Building CXX object CMakeFiles/ebml.dir/src/EbmlString.cpp.o /usr/bin/x86_64-pld-linux-g++ -DEBML_STATIC_DEFINE -I/tmp/B.7w2vcu1z/BUILD/libebml-1.4.2/build-static -I/tmp/B.7w2vcu1z/BUILD/libebml-1.4.2 -O2 -fwrapv -pipe -Wformat -Werror=format-security -gdwarf-4 -fno-debug-types-section -fvar-tracking-assignments -g2 -Wp,-D_FORTIFY_SOURCE=2 -fstack-protector-strong --param=ssp-buffer-size=4 -Werror=trampolines -fPIC -march=x86-64 -mtune=generic -gdwarf-4 -fno-debug-types-section -fvar-tracking-assignments -g2 -DNDEBUG -DQT_NO_DEBUG -std=gnu++11 -o CMakeFiles/ebml.dir/src/EbmlString.cpp.o -c /tmp/B.7w2vcu1z/BUILD/libebml-1.4.2/src/EbmlString.cpp /tmp/B.7w2vcu1z/BUILD/libebml-1.4.2/src/EbmlString.cpp: In member function 'virtual filepos_t libebml::EbmlString::ReadData(libebml::IOCallback&, libebml::ScopeMode)': /tmp/B.7w2vcu1z/BUILD/libebml-1.4.2/src/EbmlString.cpp:147:41: error: 'numeric_limits' is not a member of 'std' 147 | auto Buffer = (GetSize() + 1 < std::numeric_limits<std::size_t>::max()) ? new (std::nothrow) char[GetSize() + 1] : nullptr; | ^~~~~~~~~~~~~~ /tmp/B.7w2vcu1z/BUILD/libebml-1.4.2/src/EbmlString.cpp:147:67: error: expected primary-expression before '>' token 147 | auto Buffer = (GetSize() + 1 < std::numeric_limits<std::size_t>::max()) ? new (std::nothrow) char[GetSize() + 1] : nullptr; | ^ /tmp/B.7w2vcu1z/BUILD/libebml-1.4.2/src/EbmlString.cpp:147:70: error: '::max' has not been declared; did you mean 'std::max'? 147 | auto Buffer = (GetSize() + 1 < std::numeric_limits<std::size_t>::max()) ? new (std::nothrow) char[GetSize() + 1] : nullptr; | ^~~ | std::max In file included from /usr/include/c++/11.2.0/algorithm:62, from /tmp/B.7w2vcu1z/BUILD/libebml-1.4.2/ebml/EbmlEndian.h:41, from /tmp/B.7w2vcu1z/BUILD/libebml-1.4.2/ebml/EbmlTypes.h:38, from /tmp/B.7w2vcu1z/BUILD/libebml-1.4.2/ebml/EbmlString.h:41, from /tmp/B.7w2vcu1z/BUILD/libebml-1.4.2/src/EbmlString.cpp:38: /usr/include/c++/11.2.0/bits/stl_algo.h:3467:5: note: 'std::max' declared here 3467 | max(initializer_list<_Tp> __l, _Compare __comp) | ^~~ /tmp/B.7w2vcu1z/BUILD/libebml-1.4.2/src/EbmlString.cpp:157:17: error: type '<type error>' argument given to 'delete', expected pointer 157 | delete [] Buffer; | ^~~~~~ make[2]: *** [CMakeFiles/ebml.dir/build.make:242: CMakeFiles/ebml.dir/src/EbmlString.cpp.o] Error 1 make[2]: Leaving directory '/tmp/B.7w2vcu1z/BUILD/libebml-1.4.2/build-static' make[2]: *** Waiting for unfinished jobs.... make[2]: Entering directory '/tmp/B.7w2vcu1z/BUILD/libebml-1.4.2/build-static' [ 29%] Building CXX object CMakeFiles/ebml.dir/src/EbmlCrc32.cpp.o /usr/bin/x86_64-pld-linux-g++ -DEBML_STATIC_DEFINE -I/tmp/B.7w2vcu1z/BUILD/libebml-1.4.2/build-static -I/tmp/B.7w2vcu1z/BUILD/libebml-1.4.2 -O2 -fwrapv -pipe -Wformat -Werror=format-security -gdwarf-4 -fno-debug-types-section -fvar-tracking-assignments -g2 -Wp,-D_FORTIFY_SOURCE=2 -fstack-protector-strong --param=ssp-buffer-size=4 -Werror=trampolines -fPIC -march=x86-64 -mtune=generic -gdwarf-4 -fno-debug-types-section -fvar-tracking-assignments -g2 -DNDEBUG -DQT_NO_DEBUG -std=gnu++11 -o CMakeFiles/ebml.dir/src/EbmlCrc32.cpp.o -c /tmp/B.7w2vcu1z/BUILD/libebml-1.4.2/src/EbmlCrc32.cpp make[2]: Leaving directory '/tmp/B.7w2vcu1z/BUILD/libebml-1.4.2/build-static' make[2]: Entering directory '/tmp/B.7w2vcu1z/BUILD/libebml-1.4.2/build-static' [ 62%] Building CXX object CMakeFiles/ebml.dir/src/EbmlUInteger.cpp.o /usr/bin/x86_64-pld-linux-g++ -DEBML_STATIC_DEFINE -I/tmp/B.7w2vcu1z/BUILD/libebml-1.4.2/build-static -I/tmp/B.7w2vcu1z/BUILD/libebml-1.4.2 -O2 -fwrapv -pipe -Wformat -Werror=format-security -gdwarf-4 -fno-debug-types-section -fvar-tracking-assignments -g2 -Wp,-D_FORTIFY_SOURCE=2 -fstack-protector-strong --param=ssp-buffer-size=4 -Werror=trampolines -fPIC -march=x86-64 -mtune=generic -gdwarf-4 -fno-debug-types-section -fvar-tracking-assignments -g2 -DNDEBUG -DQT_NO_DEBUG -std=gnu++11 -o CMakeFiles/ebml.dir/src/EbmlUInteger.cpp.o -c /tmp/B.7w2vcu1z/BUILD/libebml-1.4.2/src/EbmlUInteger.cpp make[2]: Leaving directory '/tmp/B.7w2vcu1z/BUILD/libebml-1.4.2/build-static' make[2]: Entering directory '/tmp/B.7w2vcu1z/BUILD/libebml-1.4.2/build-static' [ 70%] Building CXX object CMakeFiles/ebml.dir/src/EbmlVersion.cpp.o /usr/bin/x86_64-pld-linux-g++ -DEBML_STATIC_DEFINE -I/tmp/B.7w2vcu1z/BUILD/libebml-1.4.2/build-static -I/tmp/B.7w2vcu1z/BUILD/libebml-1.4.2 -O2 -fwrapv -pipe -Wformat -Werror=format-security -gdwarf-4 -fno-debug-types-section -fvar-tracking-assignments -g2 -Wp,-D_FORTIFY_SOURCE=2 -fstack-protector-strong --param=ssp-buffer-size=4 -Werror=trampolines -fPIC -march=x86-64 -mtune=generic -gdwarf-4 -fno-debug-types-section -fvar-tracking-assignments -g2 -DNDEBUG -DQT_NO_DEBUG -std=gnu++11 -o CMakeFiles/ebml.dir/src/EbmlVersion.cpp.o -c /tmp/B.7w2vcu1z/BUILD/libebml-1.4.2/src/EbmlVersion.cpp make[2]: Leaving directory '/tmp/B.7w2vcu1z/BUILD/libebml-1.4.2/build-static' make[2]: Entering directory '/tmp/B.7w2vcu1z/BUILD/libebml-1.4.2/build-static' [ 75%] Building CXX object CMakeFiles/ebml.dir/src/EbmlVoid.cpp.o /usr/bin/x86_64-pld-linux-g++ -DEBML_STATIC_DEFINE -I/tmp/B.7w2vcu1z/BUILD/libebml-1.4.2/build-static -I/tmp/B.7w2vcu1z/BUILD/libebml-1.4.2 -O2 -fwrapv -pipe -Wformat -Werror=format-security -gdwarf-4 -fno-debug-types-section -fvar-tracking-assignments -g2 -Wp,-D_FORTIFY_SOURCE=2 -fstack-protector-strong --param=ssp-buffer-size=4 -Werror=trampolines -fPIC -march=x86-64 -mtune=generic -gdwarf-4 -fno-debug-types-section -fvar-tracking-assignments -g2 -DNDEBUG -DQT_NO_DEBUG -std=gnu++11 -o CMakeFiles/ebml.dir/src/EbmlVoid.cpp.o -c /tmp/B.7w2vcu1z/BUILD/libebml-1.4.2/src/EbmlVoid.cpp make[2]: Leaving directory '/tmp/B.7w2vcu1z/BUILD/libebml-1.4.2/build-static' make[2]: Entering directory '/tmp/B.7w2vcu1z/BUILD/libebml-1.4.2/build-static' [ 16%] Building CXX object CMakeFiles/ebml.dir/src/EbmlElement.cpp.o /usr/bin/x86_64-pld-linux-g++ -DEBML_STATIC_DEFINE -I/tmp/B.7w2vcu1z/BUILD/libebml-1.4.2/build-static -I/tmp/B.7w2vcu1z/BUILD/libebml-1.4.2 -O2 -fwrapv -pipe -Wformat -Werror=format-security -gdwarf-4 -fno-debug-types-section -fvar-tracking-assignments -g2 -Wp,-D_FORTIFY_SOURCE=2 -fstack-protector-strong --param=ssp-buffer-size=4 -Werror=trampolines -fPIC -march=x86-64 -mtune=generic -gdwarf-4 -fno-debug-types-section -fvar-tracking-assignments -g2 -DNDEBUG -DQT_NO_DEBUG -std=gnu++11 -o CMakeFiles/ebml.dir/src/EbmlElement.cpp.o -c /tmp/B.7w2vcu1z/BUILD/libebml-1.4.2/src/EbmlElement.cpp make[2]: Leaving directory '/tmp/B.7w2vcu1z/BUILD/libebml-1.4.2/build-static' make[2]: Entering directory '/tmp/B.7w2vcu1z/BUILD/libebml-1.4.2/build-static' [ 66%] Building CXX object CMakeFiles/ebml.dir/src/EbmlUnicodeString.cpp.o /usr/bin/x86_64-pld-linux-g++ -DEBML_STATIC_DEFINE -I/tmp/B.7w2vcu1z/BUILD/libebml-1.4.2/build-static -I/tmp/B.7w2vcu1z/BUILD/libebml-1.4.2 -O2 -fwrapv -pipe -Wformat -Werror=format-security -gdwarf-4 -fno-debug-types-section -fvar-tracking-assignments -g2 -Wp,-D_FORTIFY_SOURCE=2 -fstack-protector-strong --param=ssp-buffer-size=4 -Werror=trampolines -fPIC -march=x86-64 -mtune=generic -gdwarf-4 -fno-debug-types-section -fvar-tracking-assignments -g2 -DNDEBUG -DQT_NO_DEBUG -std=gnu++11 -o CMakeFiles/ebml.dir/src/EbmlUnicodeString.cpp.o -c /tmp/B.7w2vcu1z/BUILD/libebml-1.4.2/src/EbmlUnicodeString.cpp /tmp/B.7w2vcu1z/BUILD/libebml-1.4.2/src/EbmlUnicodeString.cpp: In member function 'virtual filepos_t libebml::EbmlUnicodeString::ReadData(libebml::IOCallback&, libebml::ScopeMode)': /tmp/B.7w2vcu1z/BUILD/libebml-1.4.2/src/EbmlUnicodeString.cpp:312:41: error: 'numeric_limits' is not a member of 'std' 312 | auto Buffer = (GetSize() + 1 < std::numeric_limits<std::size_t>::max()) ? new (std::nothrow) char[GetSize()+1] : nullptr; | ^~~~~~~~~~~~~~ /tmp/B.7w2vcu1z/BUILD/libebml-1.4.2/src/EbmlUnicodeString.cpp:312:67: error: expected primary-expression before '>' token 312 | auto Buffer = (GetSize() + 1 < std::numeric_limits<std::size_t>::max()) ? new (std::nothrow) char[GetSize()+1] : nullptr; | ^ /tmp/B.7w2vcu1z/BUILD/libebml-1.4.2/src/EbmlUnicodeString.cpp:312:70: error: '::max' has not been declared; did you mean 'std::max'? 312 | auto Buffer = (GetSize() + 1 < std::numeric_limits<std::size_t>::max()) ? new (std::nothrow) char[GetSize()+1] : nullptr; | ^~~ | std::max In file included from /usr/include/c++/11.2.0/algorithm:62, from /tmp/B.7w2vcu1z/BUILD/libebml-1.4.2/ebml/EbmlEndian.h:41, from /tmp/B.7w2vcu1z/BUILD/libebml-1.4.2/ebml/EbmlTypes.h:38, from /tmp/B.7w2vcu1z/BUILD/libebml-1.4.2/ebml/EbmlUnicodeString.h:43, from /tmp/B.7w2vcu1z/BUILD/libebml-1.4.2/src/EbmlUnicodeString.cpp:40: /usr/include/c++/11.2.0/bits/stl_algo.h:3467:5: note: 'std::max' declared here 3467 | max(initializer_list<_Tp> __l, _Compare __comp) | ^~~ /tmp/B.7w2vcu1z/BUILD/libebml-1.4.2/src/EbmlUnicodeString.cpp:323:17: error: type '<type error>' argument given to 'delete', expected pointer 323 | delete [] Buffer; | ^~~~~~ make[2]: *** [CMakeFiles/ebml.dir/build.make:281: CMakeFiles/ebml.dir/src/EbmlUnicodeString.cpp.o] Error 1 make[2]: Leaving directory '/tmp/B.7w2vcu1z/BUILD/libebml-1.4.2/build-static' make[2]: Entering directory '/tmp/B.7w2vcu1z/BUILD/libebml-1.4.2/build-static' [ 58%] Building CXX object CMakeFiles/ebml.dir/src/EbmlSubHead.cpp.o /usr/bin/x86_64-pld-linux-g++ -DEBML_STATIC_DEFINE -I/tmp/B.7w2vcu1z/BUILD/libebml-1.4.2/build-static -I/tmp/B.7w2vcu1z/BUILD/libebml-1.4.2 -O2 -fwrapv -pipe -Wformat -Werror=format-security -gdwarf-4 -fno-debug-types-section -fvar-tracking-assignments -g2 -Wp,-D_FORTIFY_SOURCE=2 -fstack-protector-strong --param=ssp-buffer-size=4 -Werror=trampolines -fPIC -march=x86-64 -mtune=generic -gdwarf-4 -fno-debug-types-section -fvar-tracking-assignments -g2 -DNDEBUG -DQT_NO_DEBUG -std=gnu++11 -o CMakeFiles/ebml.dir/src/EbmlSubHead.cpp.o -c /tmp/B.7w2vcu1z/BUILD/libebml-1.4.2/src/EbmlSubHead.cpp make[2]: Leaving directory '/tmp/B.7w2vcu1z/BUILD/libebml-1.4.2/build-static' make[2]: Entering directory '/tmp/B.7w2vcu1z/BUILD/libebml-1.4.2/build-static' [ 41%] Building CXX object CMakeFiles/ebml.dir/src/EbmlMaster.cpp.o /usr/bin/x86_64-pld-linux-g++ -DEBML_STATIC_DEFINE -I/tmp/B.7w2vcu1z/BUILD/libebml-1.4.2/build-static -I/tmp/B.7w2vcu1z/BUILD/libebml-1.4.2 -O2 -fwrapv -pipe -Wformat -Werror=format-security -gdwarf-4 -fno-debug-types-section -fvar-tracking-assignments -g2 -Wp,-D_FORTIFY_SOURCE=2 -fstack-protector-strong --param=ssp-buffer-size=4 -Werror=trampolines -fPIC -march=x86-64 -mtune=generic -gdwarf-4 -fno-debug-types-section -fvar-tracking-assignments -g2 -DNDEBUG -DQT_NO_DEBUG -std=gnu++11 -o CMakeFiles/ebml.dir/src/EbmlMaster.cpp.o -c /tmp/B.7w2vcu1z/BUILD/libebml-1.4.2/src/EbmlMaster.cpp make[2]: Leaving directory '/tmp/B.7w2vcu1z/BUILD/libebml-1.4.2/build-static' make[1]: *** [CMakeFiles/Makefile2:99: CMakeFiles/ebml.dir/all] Error 2 make: *** [Makefile:153: all] Error 2 error: Bad exit status from /tmp/B.7w2vcu1z/BUILD/tmp/rpm-tmp.nqP7eh (%build) RPM build errors: Could not canonicalize hostname: ymir Bad exit status from /tmp/B.7w2vcu1z/BUILD/tmp/rpm-tmp.nqP7eh (%build) ended at: Sun Nov 21 01:00:18 2021, done in 0:00:04.073964 error: No files produced. + chmod -R u+rwX /tmp/B.7w2vcu1z/BUILD + rm -rf /tmp/B.7w2vcu1z/tmp /tmp/B.7w2vcu1z/BUILD + rm -rf /tmp/B.7w2vcu1z Begin-PLD-Builder-Info Build-Time: user:9.51s sys:2.14s real:5.79s (faults io:56 non-io:404289) End-PLD-Builder-Info
[Back to list of logs] [View rpm -qa of builder]