FailedOk

th/SRPMS[OK]
th/x32[OK]
th/i686[OK]
th/x86_64[OK]

ac/SRPMS[OK]
ac/i386[OK]
ac/i586[OK]
ac/i686[OK]
ac/alpha[OK]
ac/amd64[OK]
ac/athlon[OK]
ac/ppc[OK]
ac/sparc[OK]
ac/sparc64[OK]

Advanced Search
main()
Powered by PLD Linux
(c) 2002-2021 PLD Team
$Revision: 1.37 $
Powered by Przewodniczacego Lepper-a.
Your IP: 44.192.254.246

libseccomp 4b1c8feb-c60c-4d1a-a68a-365715b2817d

Status:Failed
Source URL:https://buildlogs.pld-linux.org/pld/th/x86_64/FAIL/libseccomp,4b1c8feb-c60c-4d1a-a68a-365715b2817d.bz2
text/plain URL:View!
full text:View!
rpm -qa of builder:View!
Date:2021/09/05 18:39:02
Runtime:0:05:11.375153

Toc:

  • error 1
  • FAIL: regression
  • error 2
  • make[2]: *** [Makefile:1406: check-TESTS] Error 1
  • error 3
  • make[1]: *** [Makefile:1533: check-am] Error 2
  • error 4
  • error: Bad exit status from /tmp/B._p4eq6m8/BUILD/tmp/rpm-tmp.4t47AK (%build)
  • error 5
  • RPM build errors:
  • error 6
  • error: No files produced.

Content:

 test arch:  x86_64
Test 53-sim-binary_tree%%036-00001 result:   SUCCESS
 test arch:  ppc64le
Test 53-sim-binary_tree%%036-00001 result:   SUCCESS
 test arch:  aarch64
Test 53-sim-binary_tree%%036-00001 result:   SUCCESS
 test arch:  x86_64
Test 53-sim-binary_tree%%037-00001 result:   SUCCESS
 test arch:  ppc64le
Test 53-sim-binary_tree%%037-00001 result:   SUCCESS
 test arch:  aarch64
Test 53-sim-binary_tree%%037-00001 result:   SUCCESS
 test arch:  x86_64
Test 53-sim-binary_tree%%038-00001 result:   SUCCESS
 test arch:  ppc64le
Test 53-sim-binary_tree%%038-00001 result:   SUCCESS
 test arch:  aarch64
Test 53-sim-binary_tree%%038-00001 result:   SUCCESS
 test arch:  x86_64
Test 53-sim-binary_tree%%039-00001 result:   SUCCESS
 test arch:  ppc64le
Test 53-sim-binary_tree%%039-00001 result:   SUCCESS
 test arch:  aarch64
Test 53-sim-binary_tree%%039-00001 result:   SUCCESS
 test arch:  x86_64
Test 53-sim-binary_tree%%040-00001 result:   SUCCESS
 test arch:  ppc64le
Test 53-sim-binary_tree%%040-00001 result:   SUCCESS
 test arch:  aarch64
Test 53-sim-binary_tree%%040-00001 result:   SUCCESS
 test arch:  x86_64
Test 53-sim-binary_tree%%041-00001 result:   SUCCESS
 test arch:  ppc64le
Test 53-sim-binary_tree%%041-00001 result:   SUCCESS
 test arch:  aarch64
Test 53-sim-binary_tree%%041-00001 result:   SUCCESS
 test arch:  x86_64
Test 53-sim-binary_tree%%042-00001 result:   SUCCESS
 test arch:  ppc64le
Test 53-sim-binary_tree%%042-00001 result:   SUCCESS
 test arch:  aarch64
Test 53-sim-binary_tree%%042-00001 result:   SUCCESS
 test arch:  x86_64
Test 53-sim-binary_tree%%043-00001 result:   SUCCESS
 test arch:  ppc64le
Test 53-sim-binary_tree%%043-00001 result:   SUCCESS
Test 53-sim-binary_tree%%044-00001 result:   SUCCESS
 test arch:  x86_64
Test 53-sim-binary_tree%%045-00001 result:   SUCCESS
 test arch:  ppc64le
Test 53-sim-binary_tree%%045-00001 result:   SUCCESS
Test 53-sim-binary_tree%%046-00001 result:   SUCCESS
 test arch:  x86_64
Test 53-sim-binary_tree%%047-00001 result:   SUCCESS
 test arch:  ppc64le
Test 53-sim-binary_tree%%047-00001 result:   SUCCESS
 test arch:  aarch64
Test 53-sim-binary_tree%%047-00001 result:   SUCCESS
 test arch:  x86_64
Test 53-sim-binary_tree%%048-00001 result:   SUCCESS
 test arch:  ppc64le
Test 53-sim-binary_tree%%048-00001 result:   SUCCESS
 test arch:  aarch64
Test 53-sim-binary_tree%%048-00001 result:   SUCCESS
 test arch:  x86_64
Test 53-sim-binary_tree%%049-00001 result:   SUCCESS
 test arch:  ppc64le
Test 53-sim-binary_tree%%049-00001 result:   SUCCESS
Test 53-sim-binary_tree%%050-00001 result:   SUCCESS
 test mode:  c
 test type:  bpf-valgrind
Test 53-sim-binary_tree%%051-00001 result:   FAILURE 53-sim-binary_tree rc=1
 batch name: 54-live-binary_tree
 test mode:  c
 test type:  live
Test 54-live-binary_tree%%001-00001 result:   SKIPPED (must specify live tests)
 batch name: 55-basic-pfc_binary_tree
 test mode:  c
 test type:  basic
Test 55-basic-pfc_binary_tree%%001-00001 result:   SUCCESS
 batch name: 56-basic-iterate_syscalls
 test mode:  c
 test type:  basic
Test 56-basic-iterate_syscalls%%001-00001 result:   SUCCESS
 batch name: 57-basic-rawsysrc
 test mode:  c
 test type:  basic
Test 57-basic-rawsysrc%%001-00001 result:   SUCCESS
 batch name: 58-live-tsync_notify
 test mode:  c
 test type:  live
Test 58-live-tsync_notify%%001-00001 result:   SKIPPED (must specify live tests)
Regression Test Summary
 tests run: 8261
 tests skipped: 46
 tests passed: 8225
 tests failed: 36
 tests errored: 0
============================================================
FAIL: regression
==================
1 of 1 test failed
==================
make[2]: *** [Makefile:1406: check-TESTS] Error 1
make[1]: *** [Makefile:1533: check-am] Error 2
make: *** [Makefile:522: check-recursive] Error 1
error: Bad exit status from /tmp/B._p4eq6m8/BUILD/tmp/rpm-tmp.4t47AK (%build)


RPM build errors:
    Could not canonicalize hostname: ymir
    Bad exit status from /tmp/B._p4eq6m8/BUILD/tmp/rpm-tmp.4t47AK (%build)
ended at: Sun Sep  5 18:39:02 2021, done in 0:05:11.375153
error: No files produced.
+ chmod -R u+rwX /tmp/B._p4eq6m8/BUILD
+ rm -rf /tmp/B._p4eq6m8/tmp /tmp/B._p4eq6m8/BUILD
+ rm -rf /tmp/B._p4eq6m8
Begin-PLD-Builder-Info
Build-Time: user:266.51s sys:146.71s real:314.92s (faults io:357 non-io:49436877)

End-PLD-Builder-Info
[Back to list of logs] [View rpm -qa of builder]