FailedOk

th/SRPMS[OK]
th/x32[OK]
th/i686[OK]
th/x86_64[OK]

ac/SRPMS[OK]
ac/i386[OK]
ac/i586[OK]
ac/i686[OK]
ac/alpha[OK]
ac/amd64[OK]
ac/athlon[OK]
ac/ppc[OK]
ac/sparc[OK]
ac/sparc64[OK]

Advanced Search
main()
Powered by PLD Linux
(c) 2002-2021 PLD Team
$Revision: 1.37 $
Powered by Leppe'.
Your IP: 3.238.95.208

lin_tape 45fd43f6-b1cf-4077-a63f-f111f3785a25

Status:Failed
Source URL:https://buildlogs.pld-linux.org/pld/th/x86_64/FAIL/lin_tape,45fd43f6-b1cf-4077-a63f-f111f3785a25.bz2
text/plain URL:View!
full text:View!
rpm -qa of builder:View!
Date:2021/09/07 09:17:39
Runtime:0:00:20.003783

Toc:

  • error 1
  • /tmp/B.eabk8ly6/BUILD/lin_tape-3.0.56/lin_tape_scsi_tape.c:4668:29: error: implicit declaration of function 'status_byte'; did you mean 'get_status_byte'? [-Werror=implicit-function-declaration]
  • error 2
  • /tmp/B.eabk8ly6/BUILD/lin_tape-3.0.56/lin_tape_scsi_tape.c:4669:30: error: implicit declaration of function 'msg_byte'; did you mean 'host_byte'? [-Werror=implicit-function-declaration]
  • error 3
  • /tmp/B.eabk8ly6/BUILD/lin_tape-3.0.56/lin_tape_scsi_tape.c:4671:29: error: implicit declaration of function 'driver_byte' [-Werror=implicit-function-declaration]
  • error 4
  • /tmp/B.eabk8ly6/BUILD/lin_tape-3.0.56/lin_tape_scsi_tape.c:8879:43: error: 'DRIVER_SENSE' undeclared (first use in this function)
  • error 5
  • /tmp/B.eabk8ly6/BUILD/lin_tape-3.0.56/lin_tape_scsi_tape.c:9019:50: error: 'DRIVER_SENSE' undeclared (first use in this function)
  • error 6
  • make[1]: *** [scripts/Makefile.build:272: /tmp/B.eabk8ly6/BUILD/lin_tape-3.0.56/lin_tape_scsi_tape.o] Error 1
  • error 7
  • /tmp/B.eabk8ly6/BUILD/lin_tape-3.0.56/lin_tape_ioctl_changer.c:2280:13: error: implicit declaration of function 'driver_byte' [-Werror=implicit-function-declaration]
  • error 8
  • /tmp/B.eabk8ly6/BUILD/lin_tape-3.0.56/lin_tape_ioctl_changer.c:2280:36: error: 'DRIVER_SENSE' undeclared (first use in this function)
  • error 9
  • /tmp/B.eabk8ly6/BUILD/lin_tape-3.0.56/lin_tape_ioctl_changer.c:2291:25: error: implicit declaration of function 'msg_byte'; did you mean 'host_byte'? [-Werror=implicit-function-declaration]
  • error 10
  • /tmp/B.eabk8ly6/BUILD/lin_tape-3.0.56/lin_tape_ioctl_changer.c:2291:44: error: implicit declaration of function 'status_byte'; did you mean 'get_status_byte'? [-Werror=implicit-function-declaration]
  • error 11
  • /tmp/B.eabk8ly6/BUILD/lin_tape-3.0.56/lin_tape_ioctl_changer.c:2296:44: error: 'DRIVER_TIMEOUT' undeclared (first use in this function); did you mean 'DID_TIME_OUT'?
  • error 12
  • /tmp/B.eabk8ly6/BUILD/lin_tape-3.0.56/lin_tape_ioctl_changer.c:2297:36: error: 'DRIVER_ERROR' undeclared (first use in this function); did you mean 'DID_ERROR'?
  • error 13
  • /tmp/B.eabk8ly6/BUILD/lin_tape-3.0.56/lin_tape_ioctl_changer.c:2513:33: error: 'DRIVER_ERROR' undeclared (first use in this function); did you mean 'DID_ERROR'?
  • error 14
  • /tmp/B.eabk8ly6/BUILD/lin_tape-3.0.56/lin_tape_ioctl_changer.c:2744:35: error: 'DRIVER_SENSE' undeclared (first use in this function)
  • error 15
  • /tmp/B.eabk8ly6/BUILD/lin_tape-3.0.56/lin_tape_ioctl_changer.c:2755:43: error: 'RESERVATION_CONFLICT' undeclared (first use in this function); did you mean 'SAM_STAT_RESERVATION_CONFLICT'?
  • error 16
  • /tmp/B.eabk8ly6/BUILD/lin_tape-3.0.56/lin_tape_ioctl_changer.c:2762:51: error: 'DRIVER_TIMEOUT' undeclared (first use in this function); did you mean 'DID_TIME_OUT'?
  • error 17
  • /tmp/B.eabk8ly6/BUILD/lin_tape-3.0.56/lin_tape_ioctl_changer.c:2763:39: error: 'DRIVER_ERROR' undeclared (first use in this function); did you mean 'DID_ERROR'?
  • error 18
  • /tmp/B.eabk8ly6/BUILD/lin_tape-3.0.56/lin_tape_ioctl_changer.c:2794:35: error: 'DRIVER_SENSE' undeclared (first use in this function)
  • error 19
  • /tmp/B.eabk8ly6/BUILD/lin_tape-3.0.56/lin_tape_ioctl_changer.c:3282:25: error: 'DRIVER_SENSE' undeclared (first use in this function)
  • error 20
  • /tmp/B.eabk8ly6/BUILD/lin_tape-3.0.56/lin_tape_ioctl_changer.c:3305:36: error: 'RESERVATION_CONFLICT' undeclared (first use in this function); did you mean 'SAM_STAT_RESERVATION_CONFLICT'?
  • error 21
  • make[1]: *** [scripts/Makefile.build:271: /tmp/B.eabk8ly6/BUILD/lin_tape-3.0.56/lin_tape_ioctl_changer.o] Error 1
  • error 22
  • /tmp/B.eabk8ly6/BUILD/lin_tape-3.0.56/lin_tape_ioctl_tape.c:6065:29: error: implicit declaration of function 'status_byte'; did you mean 'get_status_byte'? [-Werror=implicit-function-declaration]
  • error 23
  • /tmp/B.eabk8ly6/BUILD/lin_tape-3.0.56/lin_tape_ioctl_tape.c:6066:72: error: 'BUSY' undeclared (first use in this function); did you mean 'EBUSY'?
  • error 24
  • /tmp/B.eabk8ly6/BUILD/lin_tape-3.0.56/lin_tape_ioctl_tape.c:6452:56: error: 'REQ_OP_SCSI_OUT' undeclared (first use in this function); did you mean 'REQ_OP_DRV_OUT'?
  • error 25
  • /tmp/B.eabk8ly6/BUILD/lin_tape-3.0.56/lin_tape_ioctl_tape.c:6452:74: error: 'REQ_OP_SCSI_IN' undeclared (first use in this function); did you mean 'REQ_OP_DRV_IN'?
  • error 26
  • /tmp/B.eabk8ly6/BUILD/lin_tape-3.0.56/lin_tape_ioctl_tape.c:6460:32: error: 'DRIVER_ERROR' undeclared (first use in this function); did you mean 'DID_ERROR'?
  • error 27
  • /tmp/B.eabk8ly6/BUILD/lin_tape-3.0.56/lin_tape_ioctl_tape.c:6736:37: error: implicit declaration of function 'driver_byte' [-Werror=implicit-function-declaration]
  • error 28
  • /tmp/B.eabk8ly6/BUILD/lin_tape-3.0.56/lin_tape_ioctl_tape.c:6737:44: error: implicit declaration of function 'msg_byte'; did you mean 'host_byte'? [-Werror=implicit-function-declaration]
  • error 29
  • /tmp/B.eabk8ly6/BUILD/lin_tape-3.0.56/lin_tape_ioctl_tape.c:6741:44: error: 'DRIVER_SENSE' undeclared (first use in this function)
  • error 30
  • /tmp/B.eabk8ly6/BUILD/lin_tape-3.0.56/lin_tape_ioctl_tape.c:6743:45: error: 'CHECK_CONDITION' undeclared (first use in this function)
  • error 31
  • /tmp/B.eabk8ly6/BUILD/lin_tape-3.0.56/lin_tape_ioctl_tape.c:6802:43: error: 'DRIVER_SENSE' undeclared (first use in this function)
  • error 32
  • /tmp/B.eabk8ly6/BUILD/lin_tape-3.0.56/lin_tape_ioctl_tape.c:6977:43: error: 'RESERVATION_CONFLICT' undeclared (first use in this function); did you mean 'SAM_STAT_RESERVATION_CONFLICT'?
  • error 33
  • /tmp/B.eabk8ly6/BUILD/lin_tape-3.0.56/lin_tape_ioctl_tape.c:6993:43: error: 'DRIVER_TIMEOUT' undeclared (first use in this function); did you mean 'DID_TIME_OUT'?
  • error 34
  • /tmp/B.eabk8ly6/BUILD/lin_tape-3.0.56/lin_tape_ioctl_tape.c:6995:43: error: 'DRIVER_ERROR' undeclared (first use in this function); did you mean 'DID_ERROR'?
  • error 35
  • /tmp/B.eabk8ly6/BUILD/lin_tape-3.0.56/lin_tape_ioctl_tape.c:9882:32: error: 'DRIVER_SENSE' undeclared (first use in this function)
  • error 36
  • /tmp/B.eabk8ly6/BUILD/lin_tape-3.0.56/lin_tape_ioctl_tape.c:9895:36: error: 'RESERVATION_CONFLICT' undeclared (first use in this function); did you mean 'SAM_STAT_RESERVATION_CONFLICT'?
  • error 37
  • make[1]: *** [scripts/Makefile.build:271: /tmp/B.eabk8ly6/BUILD/lin_tape-3.0.56/lin_tape_ioctl_tape.o] Error 1
  • error 38
  • /tmp/B.eabk8ly6/BUILD/lin_tape-3.0.56/upper.c:128:32: error: 'DRIVER_ERROR' undeclared (first use in this function); did you mean 'DID_ERROR'?
  • error 39
  • /tmp/B.eabk8ly6/BUILD/lin_tape-3.0.56/upper.c:317:27: error: implicit declaration of function 'msg_byte'; did you mean 'host_byte'? [-Werror=implicit-function-declaration]
  • error 40
  • make[1]: *** [scripts/Makefile.build:271: /tmp/B.eabk8ly6/BUILD/lin_tape-3.0.56/upper.o] Error 1
  • error 41
  • /tmp/B.eabk8ly6/BUILD/lin_tape-3.0.56/lower.c:96:25: error: implicit declaration of function 'driver_byte' [-Werror=implicit-function-declaration]
  • error 42
  • /tmp/B.eabk8ly6/BUILD/lin_tape-3.0.56/lower.c:97:30: error: 'DRIVER_ERROR' undeclared (first use in this function); did you mean 'DID_ERROR'?
  • error 43
  • /tmp/B.eabk8ly6/BUILD/lin_tape-3.0.56/lower.c:126:30: error: 'DRIVER_TIMEOUT' undeclared (first use in this function); did you mean 'DID_TIME_OUT'?
  • error 44
  • /tmp/B.eabk8ly6/BUILD/lin_tape-3.0.56/lower.c:439:24: error: 'DRIVER_ERROR' undeclared (first use in this function); did you mean 'DID_ERROR'?
  • error 45
  • make[1]: *** [scripts/Makefile.build:271: /tmp/B.eabk8ly6/BUILD/lin_tape-3.0.56/lower.o] Error 1
  • error 46
  • error: Bad exit status from /tmp/B.eabk8ly6/BUILD/tmp/rpm-tmp.3Qw1lU (%build)
  • error 47
  • RPM build errors:
  • error 48
  • error: No files produced.

Content:

+ </tmp/B.eabk8ly6/clean-ifdefs.patch 
+ /usr/bin/patch -s -p1 '--fuzz=0'
+ echo 'Patch #2 (kernel-5.8.patch):'
Patch #2 (kernel-5.8.patch):
+ </tmp/B.eabk8ly6/kernel-5.8.patch 
+ /usr/bin/patch -s -p1 '--fuzz=0'
+ echo 'Patch #3 (kernel-5.10.patch):'
Patch #3 (kernel-5.10.patch):
+ </tmp/B.eabk8ly6/kernel-5.10.patch 
+ /usr/bin/patch -s -p1 '--fuzz=0'
+ echo 'Patch #4 (kernel-5.12.patch):'
Patch #4 (kernel-5.12.patch):
+ </tmp/B.eabk8ly6/kernel-5.12.patch 
+ /usr/bin/patch -s -p1 '--fuzz=0'
+ install -p /tmp/B.eabk8ly6/lin_tape.fixlist .
+ RPM_EC=0 
+ jobs -p
+ exit 0
Executing(%build): /bin/sh -e /tmp/B.eabk8ly6/BUILD/tmp/rpm-tmp.3Qw1lU
TMP=/home/users/builder/tmp
HOME=/home/users/builder
PATH=/home/users/builder/GNUstep/Tools:/bin:/usr/bin:/usr/local/bin:/home/users/builder/bin
TMPDIR=/tmp/B.eabk8ly6/BUILD/tmp
+ umask 022
+ cd /tmp/B.eabk8ly6/BUILD
+ cd lin_tape-3.0.56
+ compile
+ typeset 'L=<' PATCH_SH
+ set -e -x
+ '[' -r /usr/src/linux-4.14/.config ']'
+ rm -rf o
+ install -d o/include/linux o/include/generated o/arch/x86/include o/arch/powerpc/lib
+ ln -sf /usr/src/linux-4.14/.config o/.config
+ ln -sf /usr/src/linux-4.14/Module.symvers o/Module.symvers
+ '[' -f /usr/src/linux-4.14/include/generated/autoconf.h ']'
+ ln -sf /usr/src/linux-4.14/include/generated/autoconf.h o/include/generated/autoconf.h
+ ln -s ../generated/autoconf.h o/include/linux/autoconf.h
+ '[' -d /usr/src/linux-4.14/arch/x86/include/generated ']'
+ ln -s /usr/src/linux-4.14/arch/x86/include/generated o/arch/x86/include
+ set +x
+ install -d o/include/config
+ touch o/include/config/MARKER
+ ln -sf /usr/src/linux-4.14/include/config/auto.conf o/include/config/auto.conf
+ ln -sf /usr/src/linux-4.14/scripts o/scripts
+ /usr/bin/make -Otarget -j9 -C /usr/src/linux-4.14 clean 'RCS_FIND_IGNORE=-name '\''*.[ks]o'\'' -o' 'M=/tmp/B.eabk8ly6/BUILD/lin_tape-3.0.56' 'HOSTCC=x86_64-pld-linux-gcc' 'SYSSRC=/usr/src/linux-4.14' 'SYSOUT=/tmp/B.eabk8ly6/BUILD/lin_tape-3.0.56/o' 'ARCH=x86_64'
+ CC=x86_64-pld-linux-gcc 
+ /usr/bin/make -Otarget -j9 -C /usr/src/linux-4.14 modules 'M=/tmp/B.eabk8ly6/BUILD/lin_tape-3.0.56' 'CONSTIFY_PLUGIN=' 'HOSTCC=x86_64-pld-linux-gcc' 'SYSSRC=/usr/src/linux-4.14' 'SYSOUT=/tmp/B.eabk8ly6/BUILD/lin_tape-3.0.56/o' 'ARCH=x86_64'
  CC [M]  /tmp/B.eabk8ly6/BUILD/lin_tape-3.0.56/join.o
  CC [M]  /tmp/B.eabk8ly6/BUILD/lin_tape-3.0.56/lin_tape_scsi_trace.o
  CC [M]  /tmp/B.eabk8ly6/BUILD/lin_tape-3.0.56/fo_util.o
  CC [M]  /tmp/B.eabk8ly6/BUILD/lin_tape-3.0.56/lin_tape_extra_ioctl.o
  CC [M]  /tmp/B.eabk8ly6/BUILD/lin_tape-3.0.56/resolve_ibm_hp.o
  CC [M]  /tmp/B.eabk8ly6/BUILD/lin_tape-3.0.56/lower.o
  CC [M]  /tmp/B.eabk8ly6/BUILD/lin_tape-3.0.56/lin_tape_ioctl_changer.o
  CC [M]  /tmp/B.eabk8ly6/BUILD/lin_tape-3.0.56/upper.o
  CC [M]  /tmp/B.eabk8ly6/BUILD/lin_tape-3.0.56/trace.o
  CC [M]  /tmp/B.eabk8ly6/BUILD/lin_tape-3.0.56/intercept.o
  LD [M]  /tmp/B.eabk8ly6/BUILD/lin_tape-3.0.56/pfo.o
  CC [M]  /tmp/B.eabk8ly6/BUILD/lin_tape-3.0.56/lin_tape_scsi_config.o
  CC [M]  /tmp/B.eabk8ly6/BUILD/lin_tape-3.0.56/lin_tape_scsi_tape.o
  CC [M]  /tmp/B.eabk8ly6/BUILD/lin_tape-3.0.56/lin_tape_ioctl_tape.o
  LD [M]  /tmp/B.eabk8ly6/BUILD/lin_tape-3.0.56/lin_tape.o
make: Entering directory '/usr/src/linux-4.14-4.14.246'
  Building modules, stage 2.
make: Leaving directory '/usr/src/linux-4.14-4.14.246'
  MODPOST 2 modules
  CC      /tmp/B.eabk8ly6/BUILD/lin_tape-3.0.56/lin_tape.mod.o
  CC      /tmp/B.eabk8ly6/BUILD/lin_tape-3.0.56/pfo.mod.o
  LD [M]  /tmp/B.eabk8ly6/BUILD/lin_tape-3.0.56/lin_tape.ko
  LD [M]  /tmp/B.eabk8ly6/BUILD/lin_tape-3.0.56/pfo.ko
+ CC=x86_64-pld-linux-gcc 
+ INSTALLROOT=installed 
+ '[' -n installed ']'
+ set +x
+ '[' -r /usr/src/linux/.config ']'
+ rm -rf o
+ install -d o/include/linux o/include/generated o/arch/x86/include o/arch/powerpc/lib
+ ln -sf /usr/src/linux/.config o/.config
+ ln -sf /usr/src/linux/Module.symvers o/Module.symvers
+ '[' -f /usr/src/linux/include/generated/autoconf.h ']'
+ ln -sf /usr/src/linux/include/generated/autoconf.h o/include/generated/autoconf.h
+ ln -s ../generated/autoconf.h o/include/linux/autoconf.h
+ '[' -d /usr/src/linux/arch/x86/include/generated ']'
+ ln -s /usr/src/linux/arch/x86/include/generated o/arch/x86/include
+ set +x
+ install -d o/include/config
+ touch o/include/config/MARKER
+ ln -sf /usr/src/linux/include/config/auto.conf o/include/config/auto.conf
+ ln -sf /usr/src/linux/scripts o/scripts
+ /usr/bin/make -Otarget -j9 -C /usr/src/linux clean 'RCS_FIND_IGNORE=-name '\''*.[ks]o'\'' -o' 'M=/tmp/B.eabk8ly6/BUILD/lin_tape-3.0.56' 'HOSTCC=x86_64-pld-linux-gcc' 'SYSSRC=/usr/src/linux' 'SYSOUT=/tmp/B.eabk8ly6/BUILD/lin_tape-3.0.56/o' 'ARCH=x86_64'
make: Entering directory '/usr/src/linux-5.14.1'
  CLEAN   /tmp/B.eabk8ly6/BUILD/lin_tape-3.0.56/Module.symvers
make: Leaving directory '/usr/src/linux-5.14.1'
+ CC=x86_64-pld-linux-gcc 
+ /usr/bin/make -Otarget -j9 -C /usr/src/linux modules 'M=/tmp/B.eabk8ly6/BUILD/lin_tape-3.0.56' 'CONSTIFY_PLUGIN=' 'HOSTCC=x86_64-pld-linux-gcc' 'SYSSRC=/usr/src/linux' 'SYSOUT=/tmp/B.eabk8ly6/BUILD/lin_tape-3.0.56/o' 'ARCH=x86_64'
  CC [M]  /tmp/B.eabk8ly6/BUILD/lin_tape-3.0.56/fo_util.o
  CC [M]  /tmp/B.eabk8ly6/BUILD/lin_tape-3.0.56/join.o
  CC [M]  /tmp/B.eabk8ly6/BUILD/lin_tape-3.0.56/lin_tape_scsi_tape.o
/tmp/B.eabk8ly6/BUILD/lin_tape-3.0.56/lin_tape_scsi_tape.c: In function 'lin_tape_tscsi_pass_through':
/tmp/B.eabk8ly6/BUILD/lin_tape-3.0.56/lin_tape_scsi_tape.c:4668:29: error: implicit declaration of function 'status_byte'; did you mean 'get_status_byte'? [-Werror=implicit-function-declaration]
 4668 |         buf->TargetStatus = status_byte(result);
      |                             ^~~~~~~~~~~
      |                             get_status_byte
/tmp/B.eabk8ly6/BUILD/lin_tape-3.0.56/lin_tape_scsi_tape.c:4669:30: error: implicit declaration of function 'msg_byte'; did you mean 'host_byte'? [-Werror=implicit-function-declaration]
 4669 |         buf->MessageStatus = msg_byte(result);
      |                              ^~~~~~~~
      |                              host_byte
/tmp/B.eabk8ly6/BUILD/lin_tape-3.0.56/lin_tape_scsi_tape.c:4671:29: error: implicit declaration of function 'driver_byte' [-Werror=implicit-function-declaration]
 4671 |         buf->DriverStatus = driver_byte(result);
      |                             ^~~~~~~~~~~
/tmp/B.eabk8ly6/BUILD/lin_tape-3.0.56/lin_tape_scsi_tape.c: In function 'lin_tape_send_cmd_drive':
/tmp/B.eabk8ly6/BUILD/lin_tape-3.0.56/lin_tape_scsi_tape.c:8879:43: error: 'DRIVER_SENSE' undeclared (first use in this function)
 8879 |                 if((driver_byte(result) & DRIVER_SENSE) && sense_buffer) {
      |                                           ^~~~~~~~~~~~
/tmp/B.eabk8ly6/BUILD/lin_tape-3.0.56/lin_tape_scsi_tape.c:8879:43: note: each undeclared identifier is reported only once for each function it appears in
/tmp/B.eabk8ly6/BUILD/lin_tape-3.0.56/lin_tape_scsi_tape.c: In function 'lin_tape_send_cmd_changer':
/tmp/B.eabk8ly6/BUILD/lin_tape-3.0.56/lin_tape_scsi_tape.c:9019:50: error: 'DRIVER_SENSE' undeclared (first use in this function)
 9019 |                         memcpy(dev_command->sense, sense_buffer,
      |                                                  ^~~~~~~~~~~~
cc1: some warnings being treated as errors
make[1]: *** [scripts/Makefile.build:272: /tmp/B.eabk8ly6/BUILD/lin_tape-3.0.56/lin_tape_scsi_tape.o] Error 1
make[1]: *** Waiting for unfinished jobs....
  CC [M]  /tmp/B.eabk8ly6/BUILD/lin_tape-3.0.56/lin_tape_scsi_trace.o
  CC [M]  /tmp/B.eabk8ly6/BUILD/lin_tape-3.0.56/lin_tape_ioctl_changer.o
/tmp/B.eabk8ly6/BUILD/lin_tape-3.0.56/lin_tape_ioctl_changer.c: In function 'changer_pass_thru_send_cmd':
/tmp/B.eabk8ly6/BUILD/lin_tape-3.0.56/lin_tape_ioctl_changer.c:2280:13: error: implicit declaration of function 'driver_byte' [-Werror=implicit-function-declaration]
 2280 |         if((driver_byte(*result) & DRIVER_SENSE) && sense_buffer) {
      |             ^~~~~~~~~~~
/tmp/B.eabk8ly6/BUILD/lin_tape-3.0.56/lin_tape_ioctl_changer.c:2280:36: error: 'DRIVER_SENSE' undeclared (first use in this function)
 2280 |         if((driver_byte(*result) & DRIVER_SENSE) && sense_buffer) {
      |                                    ^~~~~~~~~~~~
/tmp/B.eabk8ly6/BUILD/lin_tape-3.0.56/lin_tape_ioctl_changer.c:2280:36: note: each undeclared identifier is reported only once for each function it appears in
/tmp/B.eabk8ly6/BUILD/lin_tape-3.0.56/lin_tape_ioctl_changer.c:2291:25: error: implicit declaration of function 'msg_byte'; did you mean 'host_byte'? [-Werror=implicit-function-declaration]
 2291 |                         msg_byte(*result), status_byte(*result));
      |                         ^~~~~~~~
      |                         host_byte
/tmp/B.eabk8ly6/BUILD/lin_tape-3.0.56/lin_tape_ioctl_changer.c:2291:44: error: implicit declaration of function 'status_byte'; did you mean 'get_status_byte'? [-Werror=implicit-function-declaration]
 2291 |                         msg_byte(*result), status_byte(*result));
      |                                            ^~~~~~~~~~~
      |                                            get_status_byte
/tmp/B.eabk8ly6/BUILD/lin_tape-3.0.56/lin_tape_ioctl_changer.c:2296:44: error: 'DRIVER_TIMEOUT' undeclared (first use in this function); did you mean 'DID_TIME_OUT'?
 2296 |                 || driver_byte(*result) == DRIVER_TIMEOUT
      |                                            ^~~~~~~~~~~~~~
      |                                            DID_TIME_OUT
/tmp/B.eabk8ly6/BUILD/lin_tape-3.0.56/lin_tape_ioctl_changer.c:2297:36: error: 'DRIVER_ERROR' undeclared (first use in this function); did you mean 'DID_ERROR'?
 2297 |         || driver_byte(*result) == DRIVER_ERROR)){
      |                                    ^~~~~~~~~~~~
      |                                    DID_ERROR
/tmp/B.eabk8ly6/BUILD/lin_tape-3.0.56/lin_tape_ioctl_changer.c: In function 'changer_pass_thru_handle_sense':
/tmp/B.eabk8ly6/BUILD/lin_tape-3.0.56/lin_tape_ioctl_changer.c:2513:33: error: 'DRIVER_ERROR' undeclared (first use in this function); did you mean 'DID_ERROR'?
 2513 |         driver_byte(*result) == DRIVER_ERROR )
      |                                 ^~~~~~~~~~~~
      |                                 DID_ERROR
/tmp/B.eabk8ly6/BUILD/lin_tape-3.0.56/lin_tape_ioctl_changer.c: In function 'changer_check_result':
/tmp/B.eabk8ly6/BUILD/lin_tape-3.0.56/lin_tape_ioctl_changer.c:2744:35: error: 'DRIVER_SENSE' undeclared (first use in this function)
 2744 |         if((driver_byte(result) & DRIVER_SENSE)
      |                                   ^~~~~~~~~~~~
/tmp/B.eabk8ly6/BUILD/lin_tape-3.0.56/lin_tape_ioctl_changer.c:2755:43: error: 'RESERVATION_CONFLICT' undeclared (first use in this function); did you mean 'SAM_STAT_RESERVATION_CONFLICT'?
 2755 |                 if(status_byte(result) == RESERVATION_CONFLICT ||
      |                                           ^~~~~~~~~~~~~~~~~~~~
      |                                           SAM_STAT_RESERVATION_CONFLICT
/tmp/B.eabk8ly6/BUILD/lin_tape-3.0.56/lin_tape_ioctl_changer.c:2762:51: error: 'DRIVER_TIMEOUT' undeclared (first use in this function); did you mean 'DID_TIME_OUT'?
 2762 |                         || driver_byte(result) == DRIVER_TIMEOUT
      |                                                   ^~~~~~~~~~~~~~
      |                                                   DID_TIME_OUT
/tmp/B.eabk8ly6/BUILD/lin_tape-3.0.56/lin_tape_ioctl_changer.c:2763:39: error: 'DRIVER_ERROR' undeclared (first use in this function); did you mean 'DID_ERROR'?
 2763 |             || driver_byte(result) == DRIVER_ERROR));
      |                                       ^~~~~~~~~~~~
      |                                       DID_ERROR
/tmp/B.eabk8ly6/BUILD/lin_tape-3.0.56/lin_tape_ioctl_changer.c: In function 'changer_log_cdb_and_status':
/tmp/B.eabk8ly6/BUILD/lin_tape-3.0.56/lin_tape_ioctl_changer.c:2794:35: error: 'DRIVER_SENSE' undeclared (first use in this function)
 2794 |         if((driver_byte(result) & DRIVER_SENSE) && sense_buffer) {
      |                                   ^~~~~~~~~~~~
/tmp/B.eabk8ly6/BUILD/lin_tape-3.0.56/lin_tape_ioctl_changer.c: In function 'changer_exe_scsi_cmd':
/tmp/B.eabk8ly6/BUILD/lin_tape-3.0.56/lin_tape_ioctl_changer.c:3282:25: error: 'DRIVER_SENSE' undeclared (first use in this function)
 3282 |                         DRIVER_SENSE) && sense_buffer) {
      |                         ^~~~~~~~~~~~
/tmp/B.eabk8ly6/BUILD/lin_tape-3.0.56/lin_tape_ioctl_changer.c:3305:36: error: 'RESERVATION_CONFLICT' undeclared (first use in this function); did you mean 'SAM_STAT_RESERVATION_CONFLICT'?
 3305 |                 status_byte(rc) != RESERVATION_CONFLICT)
      |                                    ^~~~~~~~~~~~~~~~~~~~
      |                                    SAM_STAT_RESERVATION_CONFLICT
cc1: some warnings being treated as errors
make[1]: *** [scripts/Makefile.build:271: /tmp/B.eabk8ly6/BUILD/lin_tape-3.0.56/lin_tape_ioctl_changer.o] Error 1
  CC [M]  /tmp/B.eabk8ly6/BUILD/lin_tape-3.0.56/lin_tape_ioctl_tape.o
/tmp/B.eabk8ly6/BUILD/lin_tape-3.0.56/lin_tape_ioctl_tape.c: In function 'tape_send_scsi_io':
/tmp/B.eabk8ly6/BUILD/lin_tape-3.0.56/lin_tape_ioctl_tape.c:6065:29: error: implicit declaration of function 'status_byte'; did you mean 'get_status_byte'? [-Werror=implicit-function-declaration]
 6065 |                         if( status_byte(status_code) == SAM_STAT_BUSY
      |                             ^~~~~~~~~~~
      |                             get_status_byte
/tmp/B.eabk8ly6/BUILD/lin_tape-3.0.56/lin_tape_ioctl_tape.c:6066:72: error: 'BUSY' undeclared (first use in this function); did you mean 'EBUSY'?
 6066 |                                         || status_byte(status_code) == BUSY){
      |                                                                        ^~~~
      |                                                                        EBUSY
/tmp/B.eabk8ly6/BUILD/lin_tape-3.0.56/lin_tape_ioctl_tape.c:6066:72: note: each undeclared identifier is reported only once for each function it appears in
/tmp/B.eabk8ly6/BUILD/lin_tape-3.0.56/lin_tape_ioctl_tape.c: In function 'lin_tape_blk_rq':
/tmp/B.eabk8ly6/BUILD/lin_tape-3.0.56/lin_tape_ioctl_tape.c:6452:56: error: 'REQ_OP_SCSI_OUT' undeclared (first use in this function); did you mean 'REQ_OP_DRV_OUT'?
 6452 |         req = blk_get_request(sdev->request_queue, rw? REQ_OP_SCSI_OUT : REQ_OP_SCSI_IN, GFP_KERNEL);
      |                                                        ^~~~~~~~~~~~~~~
      |                                                        REQ_OP_DRV_OUT
/tmp/B.eabk8ly6/BUILD/lin_tape-3.0.56/lin_tape_ioctl_tape.c:6452:74: error: 'REQ_OP_SCSI_IN' undeclared (first use in this function); did you mean 'REQ_OP_DRV_IN'?
 6452 |         req = blk_get_request(sdev->request_queue, rw? REQ_OP_SCSI_OUT : REQ_OP_SCSI_IN, GFP_KERNEL);
      |                                                                          ^~~~~~~~~~~~~~
      |                                                                          REQ_OP_DRV_IN
/tmp/B.eabk8ly6/BUILD/lin_tape-3.0.56/lin_tape_ioctl_tape.c:6460:32: error: 'DRIVER_ERROR' undeclared (first use in this function); did you mean 'DID_ERROR'?
 6460 |                 status_code =  DRIVER_ERROR << 24;
      |                                ^~~~~~~~~~~~
      |                                DID_ERROR
/tmp/B.eabk8ly6/BUILD/lin_tape-3.0.56/lin_tape_ioctl_tape.c: In function 'tape_check_result':
/tmp/B.eabk8ly6/BUILD/lin_tape-3.0.56/lin_tape_ioctl_tape.c:6736:37: error: implicit declaration of function 'driver_byte' [-Werror=implicit-function-declaration]
 6736 |                         drv->devid, driver_byte(result),
      |                                     ^~~~~~~~~~~
/tmp/B.eabk8ly6/BUILD/lin_tape-3.0.56/lin_tape_ioctl_tape.c:6737:44: error: implicit declaration of function 'msg_byte'; did you mean 'host_byte'? [-Werror=implicit-function-declaration]
 6737 |                         host_byte(result), msg_byte(result),
      |                                            ^~~~~~~~
      |                                            host_byte
/tmp/B.eabk8ly6/BUILD/lin_tape-3.0.56/lin_tape_ioctl_tape.c:6741:44: error: 'DRIVER_SENSE' undeclared (first use in this function)
 6741 |                     (driver_byte(result) & DRIVER_SENSE
      |                                            ^~~~~~~~~~~~
/tmp/B.eabk8ly6/BUILD/lin_tape-3.0.56/lin_tape_ioctl_tape.c:6743:45: error: 'CHECK_CONDITION' undeclared (first use in this function)
 6743 |                      status_byte(result) == CHECK_CONDITION))
      |                                             ^~~~~~~~~~~~~~~
/tmp/B.eabk8ly6/BUILD/lin_tape-3.0.56/lin_tape_ioctl_tape.c: In function 'tape_check_log_cdb_and_status':
/tmp/B.eabk8ly6/BUILD/lin_tape-3.0.56/lin_tape_ioctl_tape.c:6802:43: error: 'DRIVER_SENSE' undeclared (first use in this function)
 6802 |                 if((driver_byte(result) & DRIVER_SENSE) && sense_buffer) {
      |                                           ^~~~~~~~~~~~
/tmp/B.eabk8ly6/BUILD/lin_tape-3.0.56/lin_tape_ioctl_tape.c: In function 'tape_check_handle_nonsense':
/tmp/B.eabk8ly6/BUILD/lin_tape-3.0.56/lin_tape_ioctl_tape.c:6977:43: error: 'RESERVATION_CONFLICT' undeclared (first use in this function); did you mean 'SAM_STAT_RESERVATION_CONFLICT'?
 6977 |                 || status_byte(result) == RESERVATION_CONFLICT) {
      |                                           ^~~~~~~~~~~~~~~~~~~~
      |                                           SAM_STAT_RESERVATION_CONFLICT
/tmp/B.eabk8ly6/BUILD/lin_tape-3.0.56/lin_tape_ioctl_tape.c:6993:43: error: 'DRIVER_TIMEOUT' undeclared (first use in this function); did you mean 'DID_TIME_OUT'?
 6993 |                 if(driver_byte(result) == DRIVER_TIMEOUT)
      |                                           ^~~~~~~~~~~~~~
      |                                           DID_TIME_OUT
/tmp/B.eabk8ly6/BUILD/lin_tape-3.0.56/lin_tape_ioctl_tape.c:6995:43: error: 'DRIVER_ERROR' undeclared (first use in this function); did you mean 'DID_ERROR'?
 6995 |                 if(driver_byte(result) == DRIVER_ERROR)
      |                                           ^~~~~~~~~~~~
      |                                           DID_ERROR
/tmp/B.eabk8ly6/BUILD/lin_tape-3.0.56/lin_tape_ioctl_tape.c: In function 'tape_exe_scsi_cmd':
/tmp/B.eabk8ly6/BUILD/lin_tape-3.0.56/lin_tape_ioctl_tape.c:9882:32: error: 'DRIVER_SENSE' undeclared (first use in this function)
 9882 |         if(!(driver_byte(rc) & DRIVER_SENSE) || !sense_data) goto CHECK_RC;
      |                                ^~~~~~~~~~~~
/tmp/B.eabk8ly6/BUILD/lin_tape-3.0.56/lin_tape_ioctl_tape.c:9895:36: error: 'RESERVATION_CONFLICT' undeclared (first use in this function); did you mean 'SAM_STAT_RESERVATION_CONFLICT'?
 9895 |                 status_byte(rc) != RESERVATION_CONFLICT &&
      |                                    ^~~~~~~~~~~~~~~~~~~~
      |                                    SAM_STAT_RESERVATION_CONFLICT
cc1: some warnings being treated as errors
make[1]: *** [scripts/Makefile.build:271: /tmp/B.eabk8ly6/BUILD/lin_tape-3.0.56/lin_tape_ioctl_tape.o] Error 1
  CC [M]  /tmp/B.eabk8ly6/BUILD/lin_tape-3.0.56/upper.o
/tmp/B.eabk8ly6/BUILD/lin_tape-3.0.56/upper.c: In function 'pfo_scsi_execute_req':
/tmp/B.eabk8ly6/BUILD/lin_tape-3.0.56/upper.c:128:32: error: 'DRIVER_ERROR' undeclared (first use in this function); did you mean 'DID_ERROR'?
  128 |                         return DRIVER_ERROR << 24;
      |                                ^~~~~~~~~~~~
      |                                DID_ERROR
/tmp/B.eabk8ly6/BUILD/lin_tape-3.0.56/upper.c:128:32: note: each undeclared identifier is reported only once for each function it appears in
/tmp/B.eabk8ly6/BUILD/lin_tape-3.0.56/upper.c: In function 'pfo_blk_complete_sghdr_rq':
/tmp/B.eabk8ly6/BUILD/lin_tape-3.0.56/upper.c:317:27: error: implicit declaration of function 'msg_byte'; did you mean 'host_byte'? [-Werror=implicit-function-declaration]
  317 |         hdr->msg_status = msg_byte(pfo_cmd->errors);
      |                           ^~~~~~~~
      |                           host_byte
cc1: some warnings being treated as errors
make[1]: *** [scripts/Makefile.build:271: /tmp/B.eabk8ly6/BUILD/lin_tape-3.0.56/upper.o] Error 1
  CC [M]  /tmp/B.eabk8ly6/BUILD/lin_tape-3.0.56/lower.o
/tmp/B.eabk8ly6/BUILD/lin_tape-3.0.56/lower.c: In function 'translate_error':
/tmp/B.eabk8ly6/BUILD/lin_tape-3.0.56/lower.c:96:25: error: implicit declaration of function 'driver_byte' [-Werror=implicit-function-declaration]
   96 |         driver_status = driver_byte(pfo_cmd->errors);
      |                         ^~~~~~~~~~~
/tmp/B.eabk8ly6/BUILD/lin_tape-3.0.56/lower.c:97:30: error: 'DRIVER_ERROR' undeclared (first use in this function); did you mean 'DID_ERROR'?
   97 |         if (driver_status == DRIVER_ERROR) {
      |                              ^~~~~~~~~~~~
      |                              DID_ERROR
/tmp/B.eabk8ly6/BUILD/lin_tape-3.0.56/lower.c:97:30: note: each undeclared identifier is reported only once for each function it appears in
/tmp/B.eabk8ly6/BUILD/lin_tape-3.0.56/lower.c:126:30: error: 'DRIVER_TIMEOUT' undeclared (first use in this function); did you mean 'DID_TIME_OUT'?
  126 |             driver_status == DRIVER_TIMEOUT) {
      |                              ^~~~~~~~~~~~~~
      |                              DID_TIME_OUT
/tmp/B.eabk8ly6/BUILD/lin_tape-3.0.56/lower.c: In function 'lower_scsi_execute':
/tmp/B.eabk8ly6/BUILD/lin_tape-3.0.56/lower.c:439:24: error: 'DRIVER_ERROR' undeclared (first use in this function); did you mean 'DID_ERROR'?
  439 |                 return DRIVER_ERROR << 24;
      |                        ^~~~~~~~~~~~
      |                        DID_ERROR
cc1: some warnings being treated as errors
make[1]: *** [scripts/Makefile.build:271: /tmp/B.eabk8ly6/BUILD/lin_tape-3.0.56/lower.o] Error 1
  CC [M]  /tmp/B.eabk8ly6/BUILD/lin_tape-3.0.56/resolve_ibm_hp.o
  CC [M]  /tmp/B.eabk8ly6/BUILD/lin_tape-3.0.56/lin_tape_extra_ioctl.o
  CC [M]  /tmp/B.eabk8ly6/BUILD/lin_tape-3.0.56/lin_tape_scsi_config.o
make: *** [Makefile:1851: /tmp/B.eabk8ly6/BUILD/lin_tape-3.0.56] Error 2
error: Bad exit status from /tmp/B.eabk8ly6/BUILD/tmp/rpm-tmp.3Qw1lU (%build)


RPM build errors:
    Could not canonicalize hostname: ymir
    Bad exit status from /tmp/B.eabk8ly6/BUILD/tmp/rpm-tmp.3Qw1lU (%build)
ended at: Tue Sep  7 09:17:39 2021, done in 0:00:20.003783
error: No files produced.
+ chmod -R u+rwX /tmp/B.eabk8ly6/BUILD
+ rm -rf /tmp/B.eabk8ly6/tmp /tmp/B.eabk8ly6/BUILD
+ rm -rf /tmp/B.eabk8ly6
Begin-PLD-Builder-Info
Build-Time: user:52.01s sys:13.85s real:38.00s (faults io:4 non-io:2121906)

End-PLD-Builder-Info
[Back to list of logs] [View rpm -qa of builder]