FailedOk

th/SRPMS[OK]
th/x32[OK]
th/i686[OK]
th/x86_64[OK]

ac/SRPMS[OK]
ac/i386[OK]
ac/i586[OK]
ac/i686[OK]
ac/alpha[OK]
ac/amd64[OK]
ac/athlon[OK]
ac/ppc[OK]
ac/sparc[OK]
ac/sparc64[OK]

Advanced Search
main()
Powered by PLD Linux
(c) 2002-2021 PLD Team
$Revision: 1.37 $
Powered by ed.
Your IP: 18.206.238.77

lin_tape c8de2c0c-8cad-4ce7-b645-4258ddcc9439

Status:Failed
Source URL:https://buildlogs.pld-linux.org/pld/th/x86_64/FAIL/lin_tape,c8de2c0c-8cad-4ce7-b645-4258ddcc9439.bz2
text/plain URL:View!
rpm -qa of builder:View!
Date:2021/05/03 03:29:31
Runtime:0:00:52.597978

Toc:

  • prep
  • Executing(%prep): /bin/sh -e /tmp/B.jrLUje/BUILD/tmp/rpm-tmp.vr3d5V
  • build
  • Executing(%build): /bin/sh -e /tmp/B.jrLUje/BUILD/tmp/rpm-tmp.mVdtEl
  • error 1
  • /tmp/B.jrLUje/BUILD/lin_tape-3.0.52/lin_tape_scsi_config.h:64:6: error: expected declaration specifiers or '...' before string constant
  • error 2
  • make[1]: *** [scripts/Makefile.build:271: /tmp/B.jrLUje/BUILD/lin_tape-3.0.52/lin_tape_scsi_config.o] Error 1
  • error 3
  • /tmp/B.jrLUje/BUILD/lin_tape-3.0.52/lin_tape_ioctl_tape.c:6564:20: error: passing argument 1 of 'blk_execute_rq' from incompatible pointer type [-Werror=incompatible-pointer-types]
  • error 4
  • /tmp/B.jrLUje/BUILD/lin_tape-3.0.52/lin_tape_ioctl_tape.c:6564:2: error: too many arguments to function 'blk_execute_rq'
  • error 5
  • make[1]: *** [scripts/Makefile.build:271: /tmp/B.jrLUje/BUILD/lin_tape-3.0.52/lin_tape_ioctl_tape.o] Error 1
  • error 6
  • /tmp/B.jrLUje/BUILD/lin_tape-3.0.52/lower.c:544:19: error: passing argument 1 of 'blk_execute_rq' from incompatible pointer type [-Werror=incompatible-pointer-types]
  • error 7
  • /tmp/B.jrLUje/BUILD/lin_tape-3.0.52/lower.c:544:2: error: too many arguments to function 'blk_execute_rq'
  • error 8
  • make[1]: *** [scripts/Makefile.build:271: /tmp/B.jrLUje/BUILD/lin_tape-3.0.52/lower.o] Error 1
  • error 9
  • error: Bad exit status from /tmp/B.jrLUje/BUILD/tmp/rpm-tmp.mVdtEl (%build)
  • error 10
  • RPM build errors:
  • error 11
  • error: No files produced.

Content:

request from: baggins
checking if we should skip the build
started at: Mon May  3 03:28:21 2021
killing old processes on a builder
sending signal 9 to pid -1
cleaning up /tmp
fetching https://srcbuilder.pld-linux.org/th//srpms/c8de2c0c-8cad-4ce7-b645-4258ddcc9439/lin_tape-3.0.52-3%405.12.1_1.src.rpm
fetched 517462 bytes, 1231.3 K/s
installing srpm: lin_tape-3.0.52-3@5.12.1_1.src.rpm
+ install -d /tmp/B.jrLUje/BUILD /tmp/B.jrLUje/RPMS
+ LC_ALL=en_US.UTF-8
+ rpm -qp --changelog lin_tape-3.0.52-3@5.12.1_1.src.rpm
* Sun May 02 2021 PLD Linux Team <feedback@pld-linux.org>
- For complete changelog see: http://git.pld-linux.org/?p=packages/lin_tape.git;a=log;h=master
* Wed Feb 24 2021 Jan Rękorajski <baggins@pld-linux.org> 4d796df
- rediff patches - rel 3 * Sun Aug 16 2020 Jan Rękorajski <baggins@pld-linux.org> c180270
- fix building with kernel 5.8 - rel 2 * Sat Apr 04 2020 Jan Rękorajski <baggins@pld-linux.org> dc1a7dc
- up to 3.0.52 * Tue Mar 12 2019 Jan Rękorajski <baggins@pld-linux.org> 85a65b2
- rel 3 * Sun Mar 10 2019 Jan Rękorajski <baggins@pld-linux.org> 94351d4
- fix building with kernel 5.0 * Fri Dec 28 2018 Jan Rękorajski <baggins@pld-linux.org> 2095776
- fix building with kernel 4.4.169 - rel 2 * Sat Oct 27 2018 Jan Rękorajski <baggins@pld-linux.org> b4b4174
- build fix for kernel 4.19 * Sat Oct 27 2018 Jan Rękorajski <baggins@pld-linux.org> 6510709
- up to 3.0.33 * Mon Jun 18 2018 Jan Rękorajski <baggins@pld-linux.org> 90256aa
- fix building with kernel 4.17 - rel 2 * Sun Apr 08 2018 Jan Rękorajski <baggins@pld-linux.org> fda6bd2
- up to 3.0.23 - updated patches - added fix for building with kernels 4.15+ * Sat Nov 18 2017 Jan Rękorajski <baggins@pld-linux.org> ba88ce5
- fix building with kernbel 4.14 - rel 3 * Fri Nov 17 2017 Jan Rękorajski <baggins@pld-linux.org> 0710576
- first part of kernel 4.14 fixes * Sat Sep 16 2017 Jan Rękorajski <baggins@pld-linux.org> e63c79d
- fix building with kernel 4.13 - rel 2 * Tue Aug 01 2017 Jan Rękorajski <baggins@pld-linux.org> 9752ce8
- updated to 3.0.20 * Wed May 10 2017 Jan Rękorajski <baggins@pld-linux.org> 1edbffc
- updated fixlist * Wed May 10 2017 Jan Rękorajski <baggins@pld-linux.org> 997e051
- fully fixed building with kernel 4.11 * Tue May 09 2017 Jan Rękorajski <baggins@pld-linux.org> 300a759
- started update to 3.0.18 * Sat Mar 25 2017 Jan Rękorajski <baggins@pld-linux.org> 5a00831
- fix building with linux 4.10 - rel 3 * Sat Jan 21 2017 Jan Rękorajski <baggins@pld-linux.org> 6f6082f
- fix building with linux 4.9 - rel 2 * Sun Jun 19 2016 Jan Rękorajski <baggins@pld-linux.org> e595de8
- drop fancy innecessary options + rpm -Uhv --nodeps --define '_topdir /tmp/B.jrLUje' --define '_specdir %{_topdir}' --define '_sourcedir %{_specdir}' --define '_rpmdir %{_topdir}/RPMS' --define '_builddir %{_topdir}/BUILD' --without userspace --define 'build_kernels 5.4,4.9,4.19,4.14,5.10,head' lin_tape-3.0.52-3@5.12.1_1.src.rpm Updating / installing... lin_tape-3.0.52-3@5.12.1_1 ######################################## + rm -f lin_tape-3.0.52-3@5.12.1_1.src.rpm + install -m 700 -d /tmp/B.jrLUje/BUILD/tmp + TMPDIR=/tmp/B.jrLUje/BUILD/tmp + exec nice -n 0 rpmbuild -bp --short-circuit --nodeps --define '_topdir /tmp/B.jrLUje' --define '_specdir %{_topdir}' --define '_sourcedir %{_specdir}' --define '_rpmdir %{_topdir}/RPMS' --define '_builddir %{_topdir}/BUILD' --without userspace --target x86_64-pld-linux --define 'build_kernels 5.4,4.9,4.19,4.14,5.10,head' --define 'prep exit 0' /tmp/B.jrLUje/lin_tape.spec warning: Could not canonicalize hostname: ymir Building target platforms: x86_64-pld-linux Building for target x86_64-pld-linux checking BuildConflict-ing packages no BuildConflicts found checking BR rpm: warning: Could not canonicalize hostname: ymir rpm: Building target platforms: x86_64-pld-linux rpm: Building for target x86_64-pld-linux no BR needed building RPM using: set -ex; : build-id: c8de2c0c-8cad-4ce7-b645-4258ddcc9439; TMPDIR=/tmp/B.jrLUje/BUILD/tmp exec nice -n 0 rpmbuild -bb --define '_smp_mflags -j9' --define '_make_opts -Otarget' --define '_pld_builder 1' --define '_topdir /tmp/B.jrLUje' --define '_specdir %{_topdir}' --define '_sourcedir %{_specdir}' --define '_rpmdir %{_topdir}/RPMS' --define '_builddir %{_topdir}/BUILD' --without userspace --target x86_64-pld-linux --define 'build_kernels 5.4,4.9,4.19,4.14,5.10,head' /tmp/B.jrLUje/lin_tape.spec + : build-id: c8de2c0c-8cad-4ce7-b645-4258ddcc9439 + TMPDIR=/tmp/B.jrLUje/BUILD/tmp + exec nice -n 0 rpmbuild -bb --define '_smp_mflags -j9' --define '_make_opts -Otarget' --define '_pld_builder 1' --define '_topdir /tmp/B.jrLUje' --define '_specdir %{_topdir}' --define '_sourcedir %{_specdir}' --define '_rpmdir %{_topdir}/RPMS' --define '_builddir %{_topdir}/BUILD' --without userspace --target x86_64-pld-linux --define 'build_kernels 5.4,4.9,4.19,4.14,5.10,head' /tmp/B.jrLUje/lin_tape.spec warning: Could not canonicalize hostname: ymir Building target platforms: x86_64-pld-linux Building for target x86_64-pld-linux Executing(%prep): /bin/sh -e /tmp/B.jrLUje/BUILD/tmp/rpm-tmp.vr3d5V + umask 022 + cd /tmp/B.jrLUje/BUILD + cd /tmp/B.jrLUje/BUILD + rm -rf lin_tape-3.0.52 + /bin/gzip -dc /tmp/B.jrLUje/lin_tape-3.0.52.tgz + /bin/tar -xof - + STATUS=0 + '[' 0 -ne 0 ']' + cd lin_tape-3.0.52 + /bin/chmod -Rf a+rX,u+w,g-w,o-w . + /bin/sed -i -e 's,\r$,,' Makefile + echo 'Patch #0 (use-module-dir.patch):' Patch #0 (use-module-dir.patch): + </tmp/B.jrLUje/use-module-dir.patch + /usr/bin/patch -s -p1 '--fuzz=0' + echo 'Patch #1 (clean-ifdefs.patch):' Patch #1 (clean-ifdefs.patch): + </tmp/B.jrLUje/clean-ifdefs.patch + /usr/bin/patch -s -p1 '--fuzz=0' + echo 'Patch #2 (kernel-5.0.patch):' Patch #2 (kernel-5.0.patch): + </tmp/B.jrLUje/kernel-5.0.patch + /usr/bin/patch -s -p1 '--fuzz=0' + echo 'Patch #3 (kernel-5.6.patch):' Patch #3 (kernel-5.6.patch): + </tmp/B.jrLUje/kernel-5.6.patch + /usr/bin/patch -s -p1 '--fuzz=0' + echo 'Patch #4 (kernel-5.8.patch):' Patch #4 (kernel-5.8.patch): + </tmp/B.jrLUje/kernel-5.8.patch + /usr/bin/patch -s -p1 '--fuzz=0' + install -p /tmp/B.jrLUje/lin_tape.fixlist . + RPM_EC=0 + jobs -p + exit 0 Executing(%build): /bin/sh -e /tmp/B.jrLUje/BUILD/tmp/rpm-tmp.mVdtEl TMP=/home/users/builder/tmp HOME=/home/users/builder PATH=/home/users/builder/GNUstep/Tools:/bin:/usr/bin:/usr/local/bin:/home/users/builder/bin TMPDIR=/tmp/B.jrLUje/BUILD/tmp + umask 022 + cd /tmp/B.jrLUje/BUILD + cd lin_tape-3.0.52 + compile + typeset 'L=<' PATCH_SH + set -e -x + '[' -r /usr/src/linux-5.4/.config ']' + rm -rf o + install -d o/include/linux o/include/generated o/arch/x86/include o/arch/powerpc/lib + ln -sf /usr/src/linux-5.4/.config o/.config + ln -sf /usr/src/linux-5.4/Module.symvers o/Module.symvers + '[' -f /usr/src/linux-5.4/include/generated/autoconf.h ']' + ln -sf /usr/src/linux-5.4/include/generated/autoconf.h o/include/generated/autoconf.h + ln -s ../generated/autoconf.h o/include/linux/autoconf.h + '[' -d /usr/src/linux-5.4/arch/x86/include/generated ']' + ln -s /usr/src/linux-5.4/arch/x86/include/generated o/arch/x86/include + set +x + install -d o/include/config + touch o/include/config/MARKER + ln -sf /usr/src/linux-5.4/include/config/auto.conf o/include/config/auto.conf + ln -sf /usr/src/linux-5.4/scripts o/scripts + /usr/bin/make -Otarget -j9 -C /usr/src/linux-5.4 clean 'RCS_FIND_IGNORE=-name '\''*.[ks]o'\'' -o' 'M=/tmp/B.jrLUje/BUILD/lin_tape-3.0.52' 'HOSTCC=x86_64-pld-linux-gcc' 'SYSSRC=/usr/src/linux-5.4' 'SYSOUT=/tmp/B.jrLUje/BUILD/lin_tape-3.0.52/o' 'ARCH=x86_64' + CC=x86_64-pld-linux-gcc + /usr/bin/make -Otarget -j9 -C /usr/src/linux-5.4 modules 'M=/tmp/B.jrLUje/BUILD/lin_tape-3.0.52' 'CONSTIFY_PLUGIN=' 'HOSTCC=x86_64-pld-linux-gcc' 'SYSSRC=/usr/src/linux-5.4' 'SYSOUT=/tmp/B.jrLUje/BUILD/lin_tape-3.0.52/o' 'ARCH=x86_64' CC [M] /tmp/B.jrLUje/BUILD/lin_tape-3.0.52/fo_util.o /tmp/B.jrLUje/BUILD/lin_tape-3.0.52/fo_util.c: In function 'debug': /tmp/B.jrLUje/BUILD/lin_tape-3.0.52/fo_util.c:132:2: warning: ISO C90 forbids array 'tmp' whose size cannot be evaluated [-Wvla] 132 | char tmp[DEBUG_LINE_SIZE]; | ^~~~ CC [M] /tmp/B.jrLUje/BUILD/lin_tape-3.0.52/lin_tape_scsi_trace.o CC [M] /tmp/B.jrLUje/BUILD/lin_tape-3.0.52/join.o CC [M] /tmp/B.jrLUje/BUILD/lin_tape-3.0.52/lin_tape_extra_ioctl.o /tmp/B.jrLUje/BUILD/lin_tape-3.0.52/lin_tape_extra_ioctl.c: In function 'set_media_type': /tmp/B.jrLUje/BUILD/lin_tape-3.0.52/lin_tape_extra_ioctl.c:1904:10: warning: this statement may fall through [-Wimplicit-fallthrough=] 1904 | *worm = 1; | ~~~~~~^~~ /tmp/B.jrLUje/BUILD/lin_tape-3.0.52/lin_tape_extra_ioctl.c:1905:3: note: here 1905 | case '3': /* fall-through for 'T' and '3' */ | ^~~~ /tmp/B.jrLUje/BUILD/lin_tape-3.0.52/lin_tape_extra_ioctl.c:1910:10: warning: this statement may fall through [-Wimplicit-fallthrough=] 1910 | *worm = 1; | ~~~~~~^~~ /tmp/B.jrLUje/BUILD/lin_tape-3.0.52/lin_tape_extra_ioctl.c:1911:3: note: here 1911 | case '4': /* fall-through for 'U' and '4' */ | ^~~~ /tmp/B.jrLUje/BUILD/lin_tape-3.0.52/lin_tape_extra_ioctl.c:1916:10: warning: this statement may fall through [-Wimplicit-fallthrough=] 1916 | *worm = 1; | ~~~~~~^~~ /tmp/B.jrLUje/BUILD/lin_tape-3.0.52/lin_tape_extra_ioctl.c:1917:3: note: here 1917 | case '5': /* fall-through for 'V' and '5' */ | ^~~~ /tmp/B.jrLUje/BUILD/lin_tape-3.0.52/lin_tape_extra_ioctl.c:1922:10: warning: this statement may fall through [-Wimplicit-fallthrough=] 1922 | *worm = 1; | ~~~~~~^~~ /tmp/B.jrLUje/BUILD/lin_tape-3.0.52/lin_tape_extra_ioctl.c:1923:3: note: here 1923 | case '6': /* fall-through for 'W' and '6' */ | ^~~~ /tmp/B.jrLUje/BUILD/lin_tape-3.0.52/lin_tape_extra_ioctl.c:1928:10: warning: this statement may fall through [-Wimplicit-fallthrough=] 1928 | *worm = 1; | ~~~~~~^~~ /tmp/B.jrLUje/BUILD/lin_tape-3.0.52/lin_tape_extra_ioctl.c:1929:3: note: here 1929 | case '7': /* fall-through for 'X' and '7' */ | ^~~~ /tmp/B.jrLUje/BUILD/lin_tape-3.0.52/lin_tape_extra_ioctl.c:1934:10: warning: this statement may fall through [-Wimplicit-fallthrough=] 1934 | *worm = 1; | ~~~~~~^~~ /tmp/B.jrLUje/BUILD/lin_tape-3.0.52/lin_tape_extra_ioctl.c:1935:3: note: here 1935 | case '8': /* fall-through for 'Y' and '8' */ | ^~~~ CC [M] /tmp/B.jrLUje/BUILD/lin_tape-3.0.52/resolve_ibm_hp.o CC [M] /tmp/B.jrLUje/BUILD/lin_tape-3.0.52/lower.o CC [M] /tmp/B.jrLUje/BUILD/lin_tape-3.0.52/lin_tape_ioctl_changer.o CC [M] /tmp/B.jrLUje/BUILD/lin_tape-3.0.52/trace.o CC [M] /tmp/B.jrLUje/BUILD/lin_tape-3.0.52/upper.o /tmp/B.jrLUje/BUILD/lin_tape-3.0.52/upper.c: In function 'pfo_internal_command': /tmp/B.jrLUje/BUILD/lin_tape-3.0.52/upper.c:164:7: warning: this statement may fall through [-Wimplicit-fallthrough=] 164 | if (sdev->removable) | ^ /tmp/B.jrLUje/BUILD/lin_tape-3.0.52/upper.c:166:3: note: here 166 | case UNIT_ATTENTION: | ^~~~ /tmp/B.jrLUje/BUILD/lin_tape-3.0.52/upper.c:167:7: warning: this statement may fall through [-Wimplicit-fallthrough=] 167 | if (sdev->removable) { | ^ /tmp/B.jrLUje/BUILD/lin_tape-3.0.52/upper.c:172:3: note: here 172 | default: /* Fall through for non-removable media */ | ^~~~~~~ CC [M] /tmp/B.jrLUje/BUILD/lin_tape-3.0.52/intercept.o LD [M] /tmp/B.jrLUje/BUILD/lin_tape-3.0.52/pfo.o CC [M] /tmp/B.jrLUje/BUILD/lin_tape-3.0.52/lin_tape_scsi_config.o CC [M] /tmp/B.jrLUje/BUILD/lin_tape-3.0.52/lin_tape_scsi_tape.o CC [M] /tmp/B.jrLUje/BUILD/lin_tape-3.0.52/lin_tape_ioctl_tape.o /tmp/B.jrLUje/BUILD/lin_tape-3.0.52/lin_tape_ioctl_tape.c: In function 'tape_set_tod': /tmp/B.jrLUje/BUILD/lin_tape-3.0.52/lin_tape_ioctl_tape.c:2841:2: warning: ISO C90 forbids mixed declarations and code [-Wdeclaration-after-statement] 2841 | struct timespec64 __now__; | ^~~~~~ /tmp/B.jrLUje/BUILD/lin_tape-3.0.52/lin_tape_ioctl_tape.c: In function 'erp_tod': /tmp/B.jrLUje/BUILD/lin_tape-3.0.52/lin_tape_ioctl_tape.c:8978:2: warning: ISO C90 forbids mixed declarations and code [-Wdeclaration-after-statement] 8978 | struct timespec64 __now__; | ^~~~~~ LD [M] /tmp/B.jrLUje/BUILD/lin_tape-3.0.52/lin_tape.o Building modules, stage 2. MODPOST 2 modules CC [M] /tmp/B.jrLUje/BUILD/lin_tape-3.0.52/lin_tape.mod.o CC [M] /tmp/B.jrLUje/BUILD/lin_tape-3.0.52/pfo.mod.o LD [M] /tmp/B.jrLUje/BUILD/lin_tape-3.0.52/lin_tape.ko LD [M] /tmp/B.jrLUje/BUILD/lin_tape-3.0.52/pfo.ko + CC=x86_64-pld-linux-gcc + INSTALLROOT=installed + '[' -n installed ']' + set +x + '[' -r /usr/src/linux-4.9/.config ']' + rm -rf o + install -d o/include/linux o/include/generated o/arch/x86/include o/arch/powerpc/lib + ln -sf /usr/src/linux-4.9/.config o/.config + ln -sf /usr/src/linux-4.9/Module.symvers o/Module.symvers + '[' -f /usr/src/linux-4.9/include/generated/autoconf.h ']' + ln -sf /usr/src/linux-4.9/include/generated/autoconf.h o/include/generated/autoconf.h + ln -s ../generated/autoconf.h o/include/linux/autoconf.h + '[' -d /usr/src/linux-4.9/arch/x86/include/generated ']' + ln -s /usr/src/linux-4.9/arch/x86/include/generated o/arch/x86/include + set +x + install -d o/include/config + touch o/include/config/MARKER + ln -sf /usr/src/linux-4.9/include/config/auto.conf o/include/config/auto.conf + ln -sf /usr/src/linux-4.9/scripts o/scripts + /usr/bin/make -Otarget -j9 -C /usr/src/linux-4.9 clean 'RCS_FIND_IGNORE=-name '\''*.[ks]o'\'' -o' 'M=/tmp/B.jrLUje/BUILD/lin_tape-3.0.52' 'HOSTCC=x86_64-pld-linux-gcc' 'SYSSRC=/usr/src/linux-4.9' 'SYSOUT=/tmp/B.jrLUje/BUILD/lin_tape-3.0.52/o' 'ARCH=x86_64' make: Entering directory '/usr/src/linux-4.9-4.9.268' CLEAN /tmp/B.jrLUje/BUILD/lin_tape-3.0.52/Module.symvers make: Leaving directory '/usr/src/linux-4.9-4.9.268' + CC=x86_64-pld-linux-gcc + /usr/bin/make -Otarget -j9 -C /usr/src/linux-4.9 modules 'M=/tmp/B.jrLUje/BUILD/lin_tape-3.0.52' 'CONSTIFY_PLUGIN=' 'HOSTCC=x86_64-pld-linux-gcc' 'SYSSRC=/usr/src/linux-4.9' 'SYSOUT=/tmp/B.jrLUje/BUILD/lin_tape-3.0.52/o' 'ARCH=x86_64' CC [M] /tmp/B.jrLUje/BUILD/lin_tape-3.0.52/fo_util.o CC [M] /tmp/B.jrLUje/BUILD/lin_tape-3.0.52/lin_tape_scsi_trace.o CC [M] /tmp/B.jrLUje/BUILD/lin_tape-3.0.52/join.o CC [M] /tmp/B.jrLUje/BUILD/lin_tape-3.0.52/resolve_ibm_hp.o CC [M] /tmp/B.jrLUje/BUILD/lin_tape-3.0.52/lin_tape_extra_ioctl.o CC [M] /tmp/B.jrLUje/BUILD/lin_tape-3.0.52/upper.o CC [M] /tmp/B.jrLUje/BUILD/lin_tape-3.0.52/lower.o CC [M] /tmp/B.jrLUje/BUILD/lin_tape-3.0.52/trace.o CC [M] /tmp/B.jrLUje/BUILD/lin_tape-3.0.52/intercept.o LD [M] /tmp/B.jrLUje/BUILD/lin_tape-3.0.52/pfo.o CC [M] /tmp/B.jrLUje/BUILD/lin_tape-3.0.52/lin_tape_ioctl_changer.o CC [M] /tmp/B.jrLUje/BUILD/lin_tape-3.0.52/lin_tape_scsi_config.o CC [M] /tmp/B.jrLUje/BUILD/lin_tape-3.0.52/lin_tape_scsi_tape.o CC [M] /tmp/B.jrLUje/BUILD/lin_tape-3.0.52/lin_tape_ioctl_tape.o LD [M] /tmp/B.jrLUje/BUILD/lin_tape-3.0.52/lin_tape.o make: Entering directory '/usr/src/linux-4.9-4.9.268' Building modules, stage 2. make: Leaving directory '/usr/src/linux-4.9-4.9.268' MODPOST 2 modules CC /tmp/B.jrLUje/BUILD/lin_tape-3.0.52/lin_tape.mod.o CC /tmp/B.jrLUje/BUILD/lin_tape-3.0.52/pfo.mod.o LD [M] /tmp/B.jrLUje/BUILD/lin_tape-3.0.52/lin_tape.ko LD [M] /tmp/B.jrLUje/BUILD/lin_tape-3.0.52/pfo.ko + CC=x86_64-pld-linux-gcc + '[' -r /usr/src/linux-4.19/.config ']' + rm -rf o + install -d o/include/linux o/include/generated o/arch/x86/include o/arch/powerpc/lib + ln -sf /usr/src/linux-4.19/.config o/.config + ln -sf /usr/src/linux-4.19/Module.symvers o/Module.symvers + '[' -f /usr/src/linux-4.19/include/generated/autoconf.h ']' + ln -sf /usr/src/linux-4.19/include/generated/autoconf.h o/include/generated/autoconf.h + ln -s ../generated/autoconf.h o/include/linux/autoconf.h + '[' -d /usr/src/linux-4.19/arch/x86/include/generated ']' + ln -s /usr/src/linux-4.19/arch/x86/include/generated o/arch/x86/include + set +x + install -d o/include/config + touch o/include/config/MARKER + ln -sf /usr/src/linux-4.19/include/config/auto.conf o/include/config/auto.conf + ln -sf /usr/src/linux-4.19/scripts o/scripts + /usr/bin/make -Otarget -j9 -C /usr/src/linux-4.19 clean 'RCS_FIND_IGNORE=-name '\''*.[ks]o'\'' -o' 'M=/tmp/B.jrLUje/BUILD/lin_tape-3.0.52' 'HOSTCC=x86_64-pld-linux-gcc' 'SYSSRC=/usr/src/linux-4.19' 'SYSOUT=/tmp/B.jrLUje/BUILD/lin_tape-3.0.52/o' 'ARCH=x86_64' make: Entering directory '/usr/src/linux-4.19-4.19.189' CLEAN /tmp/B.jrLUje/BUILD/lin_tape-3.0.52/.tmp_versions CLEAN /tmp/B.jrLUje/BUILD/lin_tape-3.0.52/Module.symvers make: Leaving directory '/usr/src/linux-4.19-4.19.189' + CC=x86_64-pld-linux-gcc + /usr/bin/make -Otarget -j9 -C /usr/src/linux-4.19 modules 'M=/tmp/B.jrLUje/BUILD/lin_tape-3.0.52' 'CONSTIFY_PLUGIN=' 'HOSTCC=x86_64-pld-linux-gcc' 'SYSSRC=/usr/src/linux-4.19' 'SYSOUT=/tmp/B.jrLUje/BUILD/lin_tape-3.0.52/o' 'ARCH=x86_64' CC [M] /tmp/B.jrLUje/BUILD/lin_tape-3.0.52/fo_util.o CC [M] /tmp/B.jrLUje/BUILD/lin_tape-3.0.52/lin_tape_scsi_trace.o CC [M] /tmp/B.jrLUje/BUILD/lin_tape-3.0.52/join.o CC [M] /tmp/B.jrLUje/BUILD/lin_tape-3.0.52/resolve_ibm_hp.o CC [M] /tmp/B.jrLUje/BUILD/lin_tape-3.0.52/lin_tape_extra_ioctl.o CC [M] /tmp/B.jrLUje/BUILD/lin_tape-3.0.52/lower.o CC [M] /tmp/B.jrLUje/BUILD/lin_tape-3.0.52/trace.o CC [M] /tmp/B.jrLUje/BUILD/lin_tape-3.0.52/upper.o CC [M] /tmp/B.jrLUje/BUILD/lin_tape-3.0.52/lin_tape_ioctl_changer.o CC [M] /tmp/B.jrLUje/BUILD/lin_tape-3.0.52/intercept.o LD [M] /tmp/B.jrLUje/BUILD/lin_tape-3.0.52/pfo.o CC [M] /tmp/B.jrLUje/BUILD/lin_tape-3.0.52/lin_tape_scsi_config.o CC [M] /tmp/B.jrLUje/BUILD/lin_tape-3.0.52/lin_tape_scsi_tape.o CC [M] /tmp/B.jrLUje/BUILD/lin_tape-3.0.52/lin_tape_ioctl_tape.o LD [M] /tmp/B.jrLUje/BUILD/lin_tape-3.0.52/lin_tape.o make: Entering directory '/usr/src/linux-4.19-4.19.189' Building modules, stage 2. make: Leaving directory '/usr/src/linux-4.19-4.19.189' MODPOST 2 modules CC /tmp/B.jrLUje/BUILD/lin_tape-3.0.52/pfo.mod.o CC /tmp/B.jrLUje/BUILD/lin_tape-3.0.52/lin_tape.mod.o LD [M] /tmp/B.jrLUje/BUILD/lin_tape-3.0.52/lin_tape.ko LD [M] /tmp/B.jrLUje/BUILD/lin_tape-3.0.52/pfo.ko + CC=x86_64-pld-linux-gcc + '[' -r /usr/src/linux-4.14/.config ']' + rm -rf o + install -d o/include/linux o/include/generated o/arch/x86/include o/arch/powerpc/lib + ln -sf /usr/src/linux-4.14/.config o/.config + ln -sf /usr/src/linux-4.14/Module.symvers o/Module.symvers + '[' -f /usr/src/linux-4.14/include/generated/autoconf.h ']' + ln -sf /usr/src/linux-4.14/include/generated/autoconf.h o/include/generated/autoconf.h + ln -s ../generated/autoconf.h o/include/linux/autoconf.h + '[' -d /usr/src/linux-4.14/arch/x86/include/generated ']' + ln -s /usr/src/linux-4.14/arch/x86/include/generated o/arch/x86/include + set +x + install -d o/include/config + touch o/include/config/MARKER + ln -sf /usr/src/linux-4.14/include/config/auto.conf o/include/config/auto.conf + ln -sf /usr/src/linux-4.14/scripts o/scripts + /usr/bin/make -Otarget -j9 -C /usr/src/linux-4.14 clean 'RCS_FIND_IGNORE=-name '\''*.[ks]o'\'' -o' 'M=/tmp/B.jrLUje/BUILD/lin_tape-3.0.52' 'HOSTCC=x86_64-pld-linux-gcc' 'SYSSRC=/usr/src/linux-4.14' 'SYSOUT=/tmp/B.jrLUje/BUILD/lin_tape-3.0.52/o' 'ARCH=x86_64' make: Entering directory '/usr/src/linux-4.14-4.14.232' CLEAN /tmp/B.jrLUje/BUILD/lin_tape-3.0.52/.tmp_versions CLEAN /tmp/B.jrLUje/BUILD/lin_tape-3.0.52/Module.symvers make: Leaving directory '/usr/src/linux-4.14-4.14.232' + CC=x86_64-pld-linux-gcc + /usr/bin/make -Otarget -j9 -C /usr/src/linux-4.14 modules 'M=/tmp/B.jrLUje/BUILD/lin_tape-3.0.52' 'CONSTIFY_PLUGIN=' 'HOSTCC=x86_64-pld-linux-gcc' 'SYSSRC=/usr/src/linux-4.14' 'SYSOUT=/tmp/B.jrLUje/BUILD/lin_tape-3.0.52/o' 'ARCH=x86_64' CC [M] /tmp/B.jrLUje/BUILD/lin_tape-3.0.52/lin_tape_scsi_trace.o CC [M] /tmp/B.jrLUje/BUILD/lin_tape-3.0.52/join.o CC [M] /tmp/B.jrLUje/BUILD/lin_tape-3.0.52/fo_util.o CC [M] /tmp/B.jrLUje/BUILD/lin_tape-3.0.52/lin_tape_extra_ioctl.o CC [M] /tmp/B.jrLUje/BUILD/lin_tape-3.0.52/resolve_ibm_hp.o CC [M] /tmp/B.jrLUje/BUILD/lin_tape-3.0.52/lower.o CC [M] /tmp/B.jrLUje/BUILD/lin_tape-3.0.52/upper.o CC [M] /tmp/B.jrLUje/BUILD/lin_tape-3.0.52/lin_tape_ioctl_changer.o CC [M] /tmp/B.jrLUje/BUILD/lin_tape-3.0.52/trace.o CC [M] /tmp/B.jrLUje/BUILD/lin_tape-3.0.52/intercept.o LD [M] /tmp/B.jrLUje/BUILD/lin_tape-3.0.52/pfo.o CC [M] /tmp/B.jrLUje/BUILD/lin_tape-3.0.52/lin_tape_scsi_config.o CC [M] /tmp/B.jrLUje/BUILD/lin_tape-3.0.52/lin_tape_scsi_tape.o CC [M] /tmp/B.jrLUje/BUILD/lin_tape-3.0.52/lin_tape_ioctl_tape.o LD [M] /tmp/B.jrLUje/BUILD/lin_tape-3.0.52/lin_tape.o make: Entering directory '/usr/src/linux-4.14-4.14.232' Building modules, stage 2. make: Leaving directory '/usr/src/linux-4.14-4.14.232' MODPOST 2 modules CC /tmp/B.jrLUje/BUILD/lin_tape-3.0.52/lin_tape.mod.o CC /tmp/B.jrLUje/BUILD/lin_tape-3.0.52/pfo.mod.o LD [M] /tmp/B.jrLUje/BUILD/lin_tape-3.0.52/lin_tape.ko LD [M] /tmp/B.jrLUje/BUILD/lin_tape-3.0.52/pfo.ko + CC=x86_64-pld-linux-gcc + '[' -r /usr/src/linux-5.10/.config ']' + rm -rf o + install -d o/include/linux o/include/generated o/arch/x86/include o/arch/powerpc/lib + ln -sf /usr/src/linux-5.10/.config o/.config + ln -sf /usr/src/linux-5.10/Module.symvers o/Module.symvers + '[' -f /usr/src/linux-5.10/include/generated/autoconf.h ']' + ln -sf /usr/src/linux-5.10/include/generated/autoconf.h o/include/generated/autoconf.h + ln -s ../generated/autoconf.h o/include/linux/autoconf.h + '[' -d /usr/src/linux-5.10/arch/x86/include/generated ']' + ln -s /usr/src/linux-5.10/arch/x86/include/generated o/arch/x86/include + set +x + install -d o/include/config + touch o/include/config/MARKER + ln -sf /usr/src/linux-5.10/include/config/auto.conf o/include/config/auto.conf + ln -sf /usr/src/linux-5.10/scripts o/scripts + /usr/bin/make -Otarget -j9 -C /usr/src/linux-5.10 clean 'RCS_FIND_IGNORE=-name '\''*.[ks]o'\'' -o' 'M=/tmp/B.jrLUje/BUILD/lin_tape-3.0.52' 'HOSTCC=x86_64-pld-linux-gcc' 'SYSSRC=/usr/src/linux-5.10' 'SYSOUT=/tmp/B.jrLUje/BUILD/lin_tape-3.0.52/o' 'ARCH=x86_64' make: Entering directory '/usr/src/linux-5.10-5.10.34' CLEAN /tmp/B.jrLUje/BUILD/lin_tape-3.0.52/Module.symvers make: Leaving directory '/usr/src/linux-5.10-5.10.34' + CC=x86_64-pld-linux-gcc + /usr/bin/make -Otarget -j9 -C /usr/src/linux-5.10 modules 'M=/tmp/B.jrLUje/BUILD/lin_tape-3.0.52' 'CONSTIFY_PLUGIN=' 'HOSTCC=x86_64-pld-linux-gcc' 'SYSSRC=/usr/src/linux-5.10' 'SYSOUT=/tmp/B.jrLUje/BUILD/lin_tape-3.0.52/o' 'ARCH=x86_64' CC [M] /tmp/B.jrLUje/BUILD/lin_tape-3.0.52/fo_util.o /tmp/B.jrLUje/BUILD/lin_tape-3.0.52/fo_util.c: In function 'debug': /tmp/B.jrLUje/BUILD/lin_tape-3.0.52/fo_util.c:132:2: warning: ISO C90 forbids array 'tmp' whose size cannot be evaluated [-Wvla] 132 | char tmp[DEBUG_LINE_SIZE]; | ^~~~ CC [M] /tmp/B.jrLUje/BUILD/lin_tape-3.0.52/join.o CC [M] /tmp/B.jrLUje/BUILD/lin_tape-3.0.52/lin_tape_scsi_trace.o CC [M] /tmp/B.jrLUje/BUILD/lin_tape-3.0.52/resolve_ibm_hp.o CC [M] /tmp/B.jrLUje/BUILD/lin_tape-3.0.52/lin_tape_extra_ioctl.o /tmp/B.jrLUje/BUILD/lin_tape-3.0.52/lin_tape_extra_ioctl.c: In function 'set_media_type': /tmp/B.jrLUje/BUILD/lin_tape-3.0.52/lin_tape_extra_ioctl.c:1904:10: warning: this statement may fall through [-Wimplicit-fallthrough=] 1904 | *worm = 1; | ~~~~~~^~~ /tmp/B.jrLUje/BUILD/lin_tape-3.0.52/lin_tape_extra_ioctl.c:1905:3: note: here 1905 | case '3': /* fall-through for 'T' and '3' */ | ^~~~ /tmp/B.jrLUje/BUILD/lin_tape-3.0.52/lin_tape_extra_ioctl.c:1910:10: warning: this statement may fall through [-Wimplicit-fallthrough=] 1910 | *worm = 1; | ~~~~~~^~~ /tmp/B.jrLUje/BUILD/lin_tape-3.0.52/lin_tape_extra_ioctl.c:1911:3: note: here 1911 | case '4': /* fall-through for 'U' and '4' */ | ^~~~ /tmp/B.jrLUje/BUILD/lin_tape-3.0.52/lin_tape_extra_ioctl.c:1916:10: warning: this statement may fall through [-Wimplicit-fallthrough=] 1916 | *worm = 1; | ~~~~~~^~~ /tmp/B.jrLUje/BUILD/lin_tape-3.0.52/lin_tape_extra_ioctl.c:1917:3: note: here 1917 | case '5': /* fall-through for 'V' and '5' */ | ^~~~ /tmp/B.jrLUje/BUILD/lin_tape-3.0.52/lin_tape_extra_ioctl.c:1922:10: warning: this statement may fall through [-Wimplicit-fallthrough=] 1922 | *worm = 1; | ~~~~~~^~~ /tmp/B.jrLUje/BUILD/lin_tape-3.0.52/lin_tape_extra_ioctl.c:1923:3: note: here 1923 | case '6': /* fall-through for 'W' and '6' */ | ^~~~ /tmp/B.jrLUje/BUILD/lin_tape-3.0.52/lin_tape_extra_ioctl.c:1928:10: warning: this statement may fall through [-Wimplicit-fallthrough=] 1928 | *worm = 1; | ~~~~~~^~~ /tmp/B.jrLUje/BUILD/lin_tape-3.0.52/lin_tape_extra_ioctl.c:1929:3: note: here 1929 | case '7': /* fall-through for 'X' and '7' */ | ^~~~ /tmp/B.jrLUje/BUILD/lin_tape-3.0.52/lin_tape_extra_ioctl.c:1934:10: warning: this statement may fall through [-Wimplicit-fallthrough=] 1934 | *worm = 1; | ~~~~~~^~~ /tmp/B.jrLUje/BUILD/lin_tape-3.0.52/lin_tape_extra_ioctl.c:1935:3: note: here 1935 | case '8': /* fall-through for 'Y' and '8' */ | ^~~~ CC [M] /tmp/B.jrLUje/BUILD/lin_tape-3.0.52/lower.o CC [M] /tmp/B.jrLUje/BUILD/lin_tape-3.0.52/lin_tape_ioctl_changer.o CC [M] /tmp/B.jrLUje/BUILD/lin_tape-3.0.52/trace.o CC [M] /tmp/B.jrLUje/BUILD/lin_tape-3.0.52/upper.o /tmp/B.jrLUje/BUILD/lin_tape-3.0.52/upper.c: In function 'pfo_internal_command': /tmp/B.jrLUje/BUILD/lin_tape-3.0.52/upper.c:164:7: warning: this statement may fall through [-Wimplicit-fallthrough=] 164 | if (sdev->removable) | ^ /tmp/B.jrLUje/BUILD/lin_tape-3.0.52/upper.c:166:3: note: here 166 | case UNIT_ATTENTION: | ^~~~ /tmp/B.jrLUje/BUILD/lin_tape-3.0.52/upper.c:167:7: warning: this statement may fall through [-Wimplicit-fallthrough=] 167 | if (sdev->removable) { | ^ /tmp/B.jrLUje/BUILD/lin_tape-3.0.52/upper.c:172:3: note: here 172 | default: /* Fall through for non-removable media */ | ^~~~~~~ CC [M] /tmp/B.jrLUje/BUILD/lin_tape-3.0.52/intercept.o LD [M] /tmp/B.jrLUje/BUILD/lin_tape-3.0.52/pfo.o CC [M] /tmp/B.jrLUje/BUILD/lin_tape-3.0.52/lin_tape_scsi_config.o CC [M] /tmp/B.jrLUje/BUILD/lin_tape-3.0.52/lin_tape_ioctl_tape.o /tmp/B.jrLUje/BUILD/lin_tape-3.0.52/lin_tape_ioctl_tape.c: In function 'tape_set_tod': /tmp/B.jrLUje/BUILD/lin_tape-3.0.52/lin_tape_ioctl_tape.c:2841:2: warning: ISO C90 forbids mixed declarations and code [-Wdeclaration-after-statement] 2841 | struct timespec64 __now__; | ^~~~~~ /tmp/B.jrLUje/BUILD/lin_tape-3.0.52/lin_tape_ioctl_tape.c: In function 'erp_tod': /tmp/B.jrLUje/BUILD/lin_tape-3.0.52/lin_tape_ioctl_tape.c:8978:2: warning: ISO C90 forbids mixed declarations and code [-Wdeclaration-after-statement] 8978 | struct timespec64 __now__; | ^~~~~~ CC [M] /tmp/B.jrLUje/BUILD/lin_tape-3.0.52/lin_tape_scsi_tape.o LD [M] /tmp/B.jrLUje/BUILD/lin_tape-3.0.52/lin_tape.o MODPOST /tmp/B.jrLUje/BUILD/lin_tape-3.0.52/Module.symvers CC [M] /tmp/B.jrLUje/BUILD/lin_tape-3.0.52/lin_tape.mod.o CC [M] /tmp/B.jrLUje/BUILD/lin_tape-3.0.52/pfo.mod.o LD [M] /tmp/B.jrLUje/BUILD/lin_tape-3.0.52/lin_tape.ko LD [M] /tmp/B.jrLUje/BUILD/lin_tape-3.0.52/pfo.ko + CC=x86_64-pld-linux-gcc + '[' -r /usr/src/linux/.config ']' + rm -rf o + install -d o/include/linux o/include/generated o/arch/x86/include o/arch/powerpc/lib + ln -sf /usr/src/linux/.config o/.config + ln -sf /usr/src/linux/Module.symvers o/Module.symvers + '[' -f /usr/src/linux/include/generated/autoconf.h ']' + ln -sf /usr/src/linux/include/generated/autoconf.h o/include/generated/autoconf.h + ln -s ../generated/autoconf.h o/include/linux/autoconf.h + '[' -d /usr/src/linux/arch/x86/include/generated ']' + ln -s /usr/src/linux/arch/x86/include/generated o/arch/x86/include + set +x + install -d o/include/config + touch o/include/config/MARKER + ln -sf /usr/src/linux/include/config/auto.conf o/include/config/auto.conf + ln -sf /usr/src/linux/scripts o/scripts + /usr/bin/make -Otarget -j9 -C /usr/src/linux clean 'RCS_FIND_IGNORE=-name '\''*.[ks]o'\'' -o' 'M=/tmp/B.jrLUje/BUILD/lin_tape-3.0.52' 'HOSTCC=x86_64-pld-linux-gcc' 'SYSSRC=/usr/src/linux' 'SYSOUT=/tmp/B.jrLUje/BUILD/lin_tape-3.0.52/o' 'ARCH=x86_64' make: Entering directory '/usr/src/linux-5.12.1' CLEAN /tmp/B.jrLUje/BUILD/lin_tape-3.0.52/Module.symvers make: Leaving directory '/usr/src/linux-5.12.1' + CC=x86_64-pld-linux-gcc + /usr/bin/make -Otarget -j9 -C /usr/src/linux modules 'M=/tmp/B.jrLUje/BUILD/lin_tape-3.0.52' 'CONSTIFY_PLUGIN=' 'HOSTCC=x86_64-pld-linux-gcc' 'SYSSRC=/usr/src/linux' 'SYSOUT=/tmp/B.jrLUje/BUILD/lin_tape-3.0.52/o' 'ARCH=x86_64' CC [M] /tmp/B.jrLUje/BUILD/lin_tape-3.0.52/fo_util.o /tmp/B.jrLUje/BUILD/lin_tape-3.0.52/fo_util.c: In function 'debug': /tmp/B.jrLUje/BUILD/lin_tape-3.0.52/fo_util.c:132:2: warning: ISO C90 forbids array 'tmp' whose size cannot be evaluated [-Wvla] 132 | char tmp[DEBUG_LINE_SIZE]; | ^~~~ CC [M] /tmp/B.jrLUje/BUILD/lin_tape-3.0.52/lin_tape_scsi_trace.o CC [M] /tmp/B.jrLUje/BUILD/lin_tape-3.0.52/join.o CC [M] /tmp/B.jrLUje/BUILD/lin_tape-3.0.52/lin_tape_scsi_config.o In file included from /tmp/B.jrLUje/BUILD/lin_tape-3.0.52/lin_tape_scsi_config.c:24: /tmp/B.jrLUje/BUILD/lin_tape-3.0.52/lin_tape_scsi_config.h:64:6: error: expected declaration specifiers or '...' before string constant 64 | ("IBM Tape Drives and Libraries"); | ^~~~~~~~~~~~~~~~~~~~~~~~~~~~~~~ make[1]: *** [scripts/Makefile.build:271: /tmp/B.jrLUje/BUILD/lin_tape-3.0.52/lin_tape_scsi_config.o] Error 1 make[1]: *** Waiting for unfinished jobs.... CC [M] /tmp/B.jrLUje/BUILD/lin_tape-3.0.52/lin_tape_ioctl_tape.o /tmp/B.jrLUje/BUILD/lin_tape-3.0.52/lin_tape_ioctl_tape.c: In function 'tape_set_tod': /tmp/B.jrLUje/BUILD/lin_tape-3.0.52/lin_tape_ioctl_tape.c:2841:2: warning: ISO C90 forbids mixed declarations and code [-Wdeclaration-after-statement] 2841 | struct timespec64 __now__; | ^~~~~~ /tmp/B.jrLUje/BUILD/lin_tape-3.0.52/lin_tape_ioctl_tape.c: In function 'lin_tape_blk_rq': /tmp/B.jrLUje/BUILD/lin_tape-3.0.52/lin_tape_ioctl_tape.c:6564:20: error: passing argument 1 of 'blk_execute_rq' from incompatible pointer type [-Werror=incompatible-pointer-types] 6564 | blk_execute_rq(req->q, NULL, req, 1); | ~~~^~~ | | | struct request_queue * In file included from /tmp/B.jrLUje/BUILD/lin_tape-3.0.52/lin_tape_scsi_ioctl.h:26, from /tmp/B.jrLUje/BUILD/lin_tape-3.0.52/lin_tape_ioctl_tape.c:22: ./include/linux/blkdev.h:947:28: note: expected 'struct gendisk *' but argument is of type 'struct request_queue *' 947 | extern void blk_execute_rq(struct gendisk *, struct request *, int); | ^~~~~~~~~~~~~~~~ /tmp/B.jrLUje/BUILD/lin_tape-3.0.52/lin_tape_ioctl_tape.c:6564:31: warning: passing argument 3 of 'blk_execute_rq' makes integer from pointer without a cast [-Wint-conversion] 6564 | blk_execute_rq(req->q, NULL, req, 1); | ^~~ | | | struct request * In file included from /tmp/B.jrLUje/BUILD/lin_tape-3.0.52/lin_tape_scsi_ioctl.h:26, from /tmp/B.jrLUje/BUILD/lin_tape-3.0.52/lin_tape_ioctl_tape.c:22: ./include/linux/blkdev.h:947:64: note: expected 'int' but argument is of type 'struct request *' 947 | extern void blk_execute_rq(struct gendisk *, struct request *, int); | ^~~ /tmp/B.jrLUje/BUILD/lin_tape-3.0.52/lin_tape_ioctl_tape.c:6564:2: error: too many arguments to function 'blk_execute_rq' 6564 | blk_execute_rq(req->q, NULL, req, 1); | ^~~~~~~~~~~~~~ In file included from /tmp/B.jrLUje/BUILD/lin_tape-3.0.52/lin_tape_scsi_ioctl.h:26, from /tmp/B.jrLUje/BUILD/lin_tape-3.0.52/lin_tape_ioctl_tape.c:22: ./include/linux/blkdev.h:947:13: note: declared here 947 | extern void blk_execute_rq(struct gendisk *, struct request *, int); | ^~~~~~~~~~~~~~ /tmp/B.jrLUje/BUILD/lin_tape-3.0.52/lin_tape_ioctl_tape.c: In function 'erp_tod': /tmp/B.jrLUje/BUILD/lin_tape-3.0.52/lin_tape_ioctl_tape.c:8978:2: warning: ISO C90 forbids mixed declarations and code [-Wdeclaration-after-statement] 8978 | struct timespec64 __now__; | ^~~~~~ cc1: some warnings being treated as errors make[1]: *** [scripts/Makefile.build:271: /tmp/B.jrLUje/BUILD/lin_tape-3.0.52/lin_tape_ioctl_tape.o] Error 1 CC [M] /tmp/B.jrLUje/BUILD/lin_tape-3.0.52/lower.o /tmp/B.jrLUje/BUILD/lin_tape-3.0.52/lower.c: In function 'lower_scsi_execute': /tmp/B.jrLUje/BUILD/lin_tape-3.0.52/lower.c:544:19: error: passing argument 1 of 'blk_execute_rq' from incompatible pointer type [-Werror=incompatible-pointer-types] 544 | blk_execute_rq(rq->q, NULL, rq, 1); | ~~^~~ | | | struct request_queue * In file included from ./include/scsi/scsi_device.h:8, from /tmp/B.jrLUje/BUILD/lin_tape-3.0.52/lower.c:38: ./include/linux/blkdev.h:947:28: note: expected 'struct gendisk *' but argument is of type 'struct request_queue *' 947 | extern void blk_execute_rq(struct gendisk *, struct request *, int); | ^~~~~~~~~~~~~~~~ /tmp/B.jrLUje/BUILD/lin_tape-3.0.52/lower.c:544:30: warning: passing argument 3 of 'blk_execute_rq' makes integer from pointer without a cast [-Wint-conversion] 544 | blk_execute_rq(rq->q, NULL, rq, 1); | ^~ | | | struct request * In file included from ./include/scsi/scsi_device.h:8, from /tmp/B.jrLUje/BUILD/lin_tape-3.0.52/lower.c:38: ./include/linux/blkdev.h:947:64: note: expected 'int' but argument is of type 'struct request *' 947 | extern void blk_execute_rq(struct gendisk *, struct request *, int); | ^~~ /tmp/B.jrLUje/BUILD/lin_tape-3.0.52/lower.c:544:2: error: too many arguments to function 'blk_execute_rq' 544 | blk_execute_rq(rq->q, NULL, rq, 1); | ^~~~~~~~~~~~~~ In file included from ./include/scsi/scsi_device.h:8, from /tmp/B.jrLUje/BUILD/lin_tape-3.0.52/lower.c:38: ./include/linux/blkdev.h:947:13: note: declared here 947 | extern void blk_execute_rq(struct gendisk *, struct request *, int); | ^~~~~~~~~~~~~~ cc1: some warnings being treated as errors make[1]: *** [scripts/Makefile.build:271: /tmp/B.jrLUje/BUILD/lin_tape-3.0.52/lower.o] Error 1 CC [M] /tmp/B.jrLUje/BUILD/lin_tape-3.0.52/resolve_ibm_hp.o CC [M] /tmp/B.jrLUje/BUILD/lin_tape-3.0.52/lin_tape_extra_ioctl.o /tmp/B.jrLUje/BUILD/lin_tape-3.0.52/lin_tape_extra_ioctl.c: In function 'set_media_type': /tmp/B.jrLUje/BUILD/lin_tape-3.0.52/lin_tape_extra_ioctl.c:1904:10: warning: this statement may fall through [-Wimplicit-fallthrough=] 1904 | *worm = 1; | ~~~~~~^~~ /tmp/B.jrLUje/BUILD/lin_tape-3.0.52/lin_tape_extra_ioctl.c:1905:3: note: here 1905 | case '3': /* fall-through for 'T' and '3' */ | ^~~~ /tmp/B.jrLUje/BUILD/lin_tape-3.0.52/lin_tape_extra_ioctl.c:1910:10: warning: this statement may fall through [-Wimplicit-fallthrough=] 1910 | *worm = 1; | ~~~~~~^~~ /tmp/B.jrLUje/BUILD/lin_tape-3.0.52/lin_tape_extra_ioctl.c:1911:3: note: here 1911 | case '4': /* fall-through for 'U' and '4' */ | ^~~~ /tmp/B.jrLUje/BUILD/lin_tape-3.0.52/lin_tape_extra_ioctl.c:1916:10: warning: this statement may fall through [-Wimplicit-fallthrough=] 1916 | *worm = 1; | ~~~~~~^~~ /tmp/B.jrLUje/BUILD/lin_tape-3.0.52/lin_tape_extra_ioctl.c:1917:3: note: here 1917 | case '5': /* fall-through for 'V' and '5' */ | ^~~~ /tmp/B.jrLUje/BUILD/lin_tape-3.0.52/lin_tape_extra_ioctl.c:1922:10: warning: this statement may fall through [-Wimplicit-fallthrough=] 1922 | *worm = 1; | ~~~~~~^~~ /tmp/B.jrLUje/BUILD/lin_tape-3.0.52/lin_tape_extra_ioctl.c:1923:3: note: here 1923 | case '6': /* fall-through for 'W' and '6' */ | ^~~~ /tmp/B.jrLUje/BUILD/lin_tape-3.0.52/lin_tape_extra_ioctl.c:1928:10: warning: this statement may fall through [-Wimplicit-fallthrough=] 1928 | *worm = 1; | ~~~~~~^~~ /tmp/B.jrLUje/BUILD/lin_tape-3.0.52/lin_tape_extra_ioctl.c:1929:3: note: here 1929 | case '7': /* fall-through for 'X' and '7' */ | ^~~~ /tmp/B.jrLUje/BUILD/lin_tape-3.0.52/lin_tape_extra_ioctl.c:1934:10: warning: this statement may fall through [-Wimplicit-fallthrough=] 1934 | *worm = 1; | ~~~~~~^~~ /tmp/B.jrLUje/BUILD/lin_tape-3.0.52/lin_tape_extra_ioctl.c:1935:3: note: here 1935 | case '8': /* fall-through for 'Y' and '8' */ | ^~~~ CC [M] /tmp/B.jrLUje/BUILD/lin_tape-3.0.52/upper.o /tmp/B.jrLUje/BUILD/lin_tape-3.0.52/upper.c: In function 'pfo_internal_command': /tmp/B.jrLUje/BUILD/lin_tape-3.0.52/upper.c:164:7: warning: this statement may fall through [-Wimplicit-fallthrough=] 164 | if (sdev->removable) | ^ /tmp/B.jrLUje/BUILD/lin_tape-3.0.52/upper.c:166:3: note: here 166 | case UNIT_ATTENTION: | ^~~~ /tmp/B.jrLUje/BUILD/lin_tape-3.0.52/upper.c:167:7: warning: this statement may fall through [-Wimplicit-fallthrough=] 167 | if (sdev->removable) { | ^ /tmp/B.jrLUje/BUILD/lin_tape-3.0.52/upper.c:172:3: note: here 172 | default: /* Fall through for non-removable media */ | ^~~~~~~ CC [M] /tmp/B.jrLUje/BUILD/lin_tape-3.0.52/lin_tape_ioctl_changer.o CC [M] /tmp/B.jrLUje/BUILD/lin_tape-3.0.52/intercept.o CC [M] /tmp/B.jrLUje/BUILD/lin_tape-3.0.52/lin_tape_scsi_tape.o make: *** [Makefile:1851: /tmp/B.jrLUje/BUILD/lin_tape-3.0.52] Error 2 error: Bad exit status from /tmp/B.jrLUje/BUILD/tmp/rpm-tmp.mVdtEl (%build) RPM build errors: Could not canonicalize hostname: ymir Bad exit status from /tmp/B.jrLUje/BUILD/tmp/rpm-tmp.mVdtEl (%build) ended at: Mon May 3 03:29:31 2021, done in 0:00:52.597978 error: No files produced. + chmod -R u+rwX /tmp/B.jrLUje/BUILD + rm -rf /tmp/B.jrLUje/tmp /tmp/B.jrLUje/BUILD + rm -rf /tmp/B.jrLUje Begin-PLD-Builder-Info Build-Time: user:143.18s sys:25.30s real:69.78s (faults io:8 non-io:4611745) End-PLD-Builder-Info
[Back to list of logs] [View rpm -qa of builder]