FailedOk

th/SRPMS[OK]
th/x32[OK]
th/i686[OK]
th/x86_64[OK]

ac/SRPMS[OK]
ac/i386[OK]
ac/i586[OK]
ac/i686[OK]
ac/alpha[OK]
ac/amd64[OK]
ac/athlon[OK]
ac/ppc[OK]
ac/sparc[OK]
ac/sparc64[OK]

Advanced Search
main()
Powered by PLD Linux
(c) 2002-2021 PLD Team
$Revision: 1.37 $
Powered by Star Treck.
Your IP: 18.204.227.34

lin_tape dbbe45c7-c4c9-4e4b-8e11-66dc5a0360c0

Status:Failed
Source URL:https://buildlogs.pld-linux.org/pld/th/x86_64/FAIL/lin_tape,dbbe45c7-c4c9-4e4b-8e11-66dc5a0360c0.bz2
text/plain URL:View!
full text:View!
rpm -qa of builder:View!
Date:2021/05/03 23:32:03
Runtime:0:00:44.731109

Toc:

  • error 1
  • /tmp/B.SfbUre/BUILD/lin_tape-3.0.52/lin_tape_scsi_config.h:64:6: error: expected declaration specifiers or '...' before string constant
  • error 2
  • make[1]: *** [scripts/Makefile.build:271: /tmp/B.SfbUre/BUILD/lin_tape-3.0.52/lin_tape_scsi_config.o] Error 1
  • error 3
  • /tmp/B.SfbUre/BUILD/lin_tape-3.0.52/lin_tape_ioctl_tape.c:6564:20: error: passing argument 1 of 'blk_execute_rq' from incompatible pointer type [-Werror=incompatible-pointer-types]
  • error 4
  • /tmp/B.SfbUre/BUILD/lin_tape-3.0.52/lin_tape_ioctl_tape.c:6564:2: error: too many arguments to function 'blk_execute_rq'
  • error 5
  • make[1]: *** [scripts/Makefile.build:271: /tmp/B.SfbUre/BUILD/lin_tape-3.0.52/lin_tape_ioctl_tape.o] Error 1
  • error 6
  • error: Bad exit status from /tmp/B.SfbUre/BUILD/tmp/rpm-tmp.yaV76b (%build)
  • error 7
  • RPM build errors:
  • error 8
  • error: No files produced.

Content:

      |       ^
/tmp/B.SfbUre/BUILD/lin_tape-3.0.52/upper.c:172:3: note: here
  172 |   default: /* Fall through for non-removable media */
      |   ^~~~~~~
  CC [M]  /tmp/B.SfbUre/BUILD/lin_tape-3.0.52/intercept.o
  CC [M]  /tmp/B.SfbUre/BUILD/lin_tape-3.0.52/trace.o
  LD [M]  /tmp/B.SfbUre/BUILD/lin_tape-3.0.52/pfo.o
  CC [M]  /tmp/B.SfbUre/BUILD/lin_tape-3.0.52/lin_tape_scsi_config.o
  CC [M]  /tmp/B.SfbUre/BUILD/lin_tape-3.0.52/lin_tape_scsi_tape.o
  CC [M]  /tmp/B.SfbUre/BUILD/lin_tape-3.0.52/lin_tape_ioctl_tape.o
/tmp/B.SfbUre/BUILD/lin_tape-3.0.52/lin_tape_ioctl_tape.c: In function 'tape_set_tod':
/tmp/B.SfbUre/BUILD/lin_tape-3.0.52/lin_tape_ioctl_tape.c:2841:2: warning: ISO C90 forbids mixed declarations and code [-Wdeclaration-after-statement]
 2841 |  struct timespec64 __now__;
      |  ^~~~~~
/tmp/B.SfbUre/BUILD/lin_tape-3.0.52/lin_tape_ioctl_tape.c: In function 'erp_tod':
/tmp/B.SfbUre/BUILD/lin_tape-3.0.52/lin_tape_ioctl_tape.c:8978:2: warning: ISO C90 forbids mixed declarations and code [-Wdeclaration-after-statement]
 8978 |  struct timespec64 __now__;
      |  ^~~~~~
  LD [M]  /tmp/B.SfbUre/BUILD/lin_tape-3.0.52/lin_tape.o
  MODPOST /tmp/B.SfbUre/BUILD/lin_tape-3.0.52/Module.symvers
  CC [M]  /tmp/B.SfbUre/BUILD/lin_tape-3.0.52/lin_tape.mod.o
  CC [M]  /tmp/B.SfbUre/BUILD/lin_tape-3.0.52/pfo.mod.o
  LD [M]  /tmp/B.SfbUre/BUILD/lin_tape-3.0.52/lin_tape.ko
  LD [M]  /tmp/B.SfbUre/BUILD/lin_tape-3.0.52/pfo.ko
+ CC=x86_64-pld-linux-gcc 
+ '[' -r /usr/src/linux-4.14/.config ']'
+ rm -rf o
+ install -d o/include/linux o/include/generated o/arch/x86/include o/arch/powerpc/lib
+ ln -sf /usr/src/linux-4.14/.config o/.config
+ ln -sf /usr/src/linux-4.14/Module.symvers o/Module.symvers
+ '[' -f /usr/src/linux-4.14/include/generated/autoconf.h ']'
+ ln -sf /usr/src/linux-4.14/include/generated/autoconf.h o/include/generated/autoconf.h
+ ln -s ../generated/autoconf.h o/include/linux/autoconf.h
+ '[' -d /usr/src/linux-4.14/arch/x86/include/generated ']'
+ ln -s /usr/src/linux-4.14/arch/x86/include/generated o/arch/x86/include
+ set +x
+ install -d o/include/config
+ touch o/include/config/MARKER
+ ln -sf /usr/src/linux-4.14/include/config/auto.conf o/include/config/auto.conf
+ ln -sf /usr/src/linux-4.14/scripts o/scripts
+ /usr/bin/make -Otarget -j9 -C /usr/src/linux-4.14 clean 'RCS_FIND_IGNORE=-name '\''*.[ks]o'\'' -o' 'M=/tmp/B.SfbUre/BUILD/lin_tape-3.0.52' 'HOSTCC=x86_64-pld-linux-gcc' 'SYSSRC=/usr/src/linux-4.14' 'SYSOUT=/tmp/B.SfbUre/BUILD/lin_tape-3.0.52/o' 'ARCH=x86_64'
make: Entering directory '/usr/src/linux-4.14-4.14.232'
  CLEAN   /tmp/B.SfbUre/BUILD/lin_tape-3.0.52/.tmp_versions
  CLEAN   /tmp/B.SfbUre/BUILD/lin_tape-3.0.52/Module.symvers
make: Leaving directory '/usr/src/linux-4.14-4.14.232'
+ CC=x86_64-pld-linux-gcc 
+ /usr/bin/make -Otarget -j9 -C /usr/src/linux-4.14 modules 'M=/tmp/B.SfbUre/BUILD/lin_tape-3.0.52' 'CONSTIFY_PLUGIN=' 'HOSTCC=x86_64-pld-linux-gcc' 'SYSSRC=/usr/src/linux-4.14' 'SYSOUT=/tmp/B.SfbUre/BUILD/lin_tape-3.0.52/o' 'ARCH=x86_64'
  CC [M]  /tmp/B.SfbUre/BUILD/lin_tape-3.0.52/lin_tape_scsi_trace.o
  CC [M]  /tmp/B.SfbUre/BUILD/lin_tape-3.0.52/join.o
  CC [M]  /tmp/B.SfbUre/BUILD/lin_tape-3.0.52/fo_util.o
  CC [M]  /tmp/B.SfbUre/BUILD/lin_tape-3.0.52/resolve_ibm_hp.o
  CC [M]  /tmp/B.SfbUre/BUILD/lin_tape-3.0.52/lin_tape_extra_ioctl.o
  CC [M]  /tmp/B.SfbUre/BUILD/lin_tape-3.0.52/lower.o
  CC [M]  /tmp/B.SfbUre/BUILD/lin_tape-3.0.52/upper.o
  CC [M]  /tmp/B.SfbUre/BUILD/lin_tape-3.0.52/lin_tape_ioctl_changer.o
  CC [M]  /tmp/B.SfbUre/BUILD/lin_tape-3.0.52/trace.o
  CC [M]  /tmp/B.SfbUre/BUILD/lin_tape-3.0.52/intercept.o
  LD [M]  /tmp/B.SfbUre/BUILD/lin_tape-3.0.52/pfo.o
  CC [M]  /tmp/B.SfbUre/BUILD/lin_tape-3.0.52/lin_tape_scsi_config.o
  CC [M]  /tmp/B.SfbUre/BUILD/lin_tape-3.0.52/lin_tape_scsi_tape.o
  CC [M]  /tmp/B.SfbUre/BUILD/lin_tape-3.0.52/lin_tape_ioctl_tape.o
  LD [M]  /tmp/B.SfbUre/BUILD/lin_tape-3.0.52/lin_tape.o
make: Entering directory '/usr/src/linux-4.14-4.14.232'
  Building modules, stage 2.
make: Leaving directory '/usr/src/linux-4.14-4.14.232'
  MODPOST 2 modules
  CC      /tmp/B.SfbUre/BUILD/lin_tape-3.0.52/lin_tape.mod.o
  CC      /tmp/B.SfbUre/BUILD/lin_tape-3.0.52/pfo.mod.o
  LD [M]  /tmp/B.SfbUre/BUILD/lin_tape-3.0.52/lin_tape.ko
  LD [M]  /tmp/B.SfbUre/BUILD/lin_tape-3.0.52/pfo.ko
+ CC=x86_64-pld-linux-gcc 
+ '[' -r /usr/src/linux/.config ']'
+ rm -rf o
+ install -d o/include/linux o/include/generated o/arch/x86/include o/arch/powerpc/lib
+ ln -sf /usr/src/linux/.config o/.config
+ ln -sf /usr/src/linux/Module.symvers o/Module.symvers
+ '[' -f /usr/src/linux/include/generated/autoconf.h ']'
+ ln -sf /usr/src/linux/include/generated/autoconf.h o/include/generated/autoconf.h
+ ln -s ../generated/autoconf.h o/include/linux/autoconf.h
+ '[' -d /usr/src/linux/arch/x86/include/generated ']'
+ ln -s /usr/src/linux/arch/x86/include/generated o/arch/x86/include
+ set +x
+ install -d o/include/config
+ touch o/include/config/MARKER
+ ln -sf /usr/src/linux/include/config/auto.conf o/include/config/auto.conf
+ ln -sf /usr/src/linux/scripts o/scripts
+ /usr/bin/make -Otarget -j9 -C /usr/src/linux clean 'RCS_FIND_IGNORE=-name '\''*.[ks]o'\'' -o' 'M=/tmp/B.SfbUre/BUILD/lin_tape-3.0.52' 'HOSTCC=x86_64-pld-linux-gcc' 'SYSSRC=/usr/src/linux' 'SYSOUT=/tmp/B.SfbUre/BUILD/lin_tape-3.0.52/o' 'ARCH=x86_64'
make: Entering directory '/usr/src/linux-5.12.1'
  CLEAN   /tmp/B.SfbUre/BUILD/lin_tape-3.0.52/Module.symvers
make: Leaving directory '/usr/src/linux-5.12.1'
+ CC=x86_64-pld-linux-gcc 
+ /usr/bin/make -Otarget -j9 -C /usr/src/linux modules 'M=/tmp/B.SfbUre/BUILD/lin_tape-3.0.52' 'CONSTIFY_PLUGIN=' 'HOSTCC=x86_64-pld-linux-gcc' 'SYSSRC=/usr/src/linux' 'SYSOUT=/tmp/B.SfbUre/BUILD/lin_tape-3.0.52/o' 'ARCH=x86_64'
  CC [M]  /tmp/B.SfbUre/BUILD/lin_tape-3.0.52/fo_util.o
/tmp/B.SfbUre/BUILD/lin_tape-3.0.52/fo_util.c: In function 'debug':
/tmp/B.SfbUre/BUILD/lin_tape-3.0.52/fo_util.c:132:2: warning: ISO C90 forbids array 'tmp' whose size cannot be evaluated [-Wvla]
  132 |  char tmp[DEBUG_LINE_SIZE];
      |  ^~~~
  CC [M]  /tmp/B.SfbUre/BUILD/lin_tape-3.0.52/lin_tape_scsi_config.o
In file included from /tmp/B.SfbUre/BUILD/lin_tape-3.0.52/lin_tape_scsi_config.c:24:
/tmp/B.SfbUre/BUILD/lin_tape-3.0.52/lin_tape_scsi_config.h:64:6: error: expected declaration specifiers or '...' before string constant
   64 |     ("IBM Tape Drives and Libraries");
      |      ^~~~~~~~~~~~~~~~~~~~~~~~~~~~~~~
make[1]: *** [scripts/Makefile.build:271: /tmp/B.SfbUre/BUILD/lin_tape-3.0.52/lin_tape_scsi_config.o] Error 1
make[1]: *** Waiting for unfinished jobs....
  CC [M]  /tmp/B.SfbUre/BUILD/lin_tape-3.0.52/lin_tape_scsi_trace.o
  CC [M]  /tmp/B.SfbUre/BUILD/lin_tape-3.0.52/join.o
  CC [M]  /tmp/B.SfbUre/BUILD/lin_tape-3.0.52/lin_tape_ioctl_tape.o
/tmp/B.SfbUre/BUILD/lin_tape-3.0.52/lin_tape_ioctl_tape.c: In function 'tape_set_tod':
/tmp/B.SfbUre/BUILD/lin_tape-3.0.52/lin_tape_ioctl_tape.c:2841:2: warning: ISO C90 forbids mixed declarations and code [-Wdeclaration-after-statement]
 2841 |  struct timespec64 __now__;
      |  ^~~~~~
/tmp/B.SfbUre/BUILD/lin_tape-3.0.52/lin_tape_ioctl_tape.c: In function 'lin_tape_blk_rq':
/tmp/B.SfbUre/BUILD/lin_tape-3.0.52/lin_tape_ioctl_tape.c:6564:20: error: passing argument 1 of 'blk_execute_rq' from incompatible pointer type [-Werror=incompatible-pointer-types]
 6564 |  blk_execute_rq(req->q, NULL, req, 1);
      |                 ~~~^~~
      |                    |
      |                    struct request_queue *
In file included from /tmp/B.SfbUre/BUILD/lin_tape-3.0.52/lin_tape_scsi_ioctl.h:26,
                 from /tmp/B.SfbUre/BUILD/lin_tape-3.0.52/lin_tape_ioctl_tape.c:22:
./include/linux/blkdev.h:947:28: note: expected 'struct gendisk *' but argument is of type 'struct request_queue *'
  947 | extern void blk_execute_rq(struct gendisk *, struct request *, int);
      |                            ^~~~~~~~~~~~~~~~
/tmp/B.SfbUre/BUILD/lin_tape-3.0.52/lin_tape_ioctl_tape.c:6564:31: warning: passing argument 3 of 'blk_execute_rq' makes integer from pointer without a cast [-Wint-conversion]
 6564 |  blk_execute_rq(req->q, NULL, req, 1);
      |                               ^~~
      |                               |
      |                               struct request *
In file included from /tmp/B.SfbUre/BUILD/lin_tape-3.0.52/lin_tape_scsi_ioctl.h:26,
                 from /tmp/B.SfbUre/BUILD/lin_tape-3.0.52/lin_tape_ioctl_tape.c:22:
./include/linux/blkdev.h:947:64: note: expected 'int' but argument is of type 'struct request *'
  947 | extern void blk_execute_rq(struct gendisk *, struct request *, int);
      |                                                                ^~~
/tmp/B.SfbUre/BUILD/lin_tape-3.0.52/lin_tape_ioctl_tape.c:6564:2: error: too many arguments to function 'blk_execute_rq'
 6564 |  blk_execute_rq(req->q, NULL, req, 1);
      |  ^~~~~~~~~~~~~~
In file included from /tmp/B.SfbUre/BUILD/lin_tape-3.0.52/lin_tape_scsi_ioctl.h:26,
                 from /tmp/B.SfbUre/BUILD/lin_tape-3.0.52/lin_tape_ioctl_tape.c:22:
./include/linux/blkdev.h:947:13: note: declared here
  947 | extern void blk_execute_rq(struct gendisk *, struct request *, int);
      |             ^~~~~~~~~~~~~~
/tmp/B.SfbUre/BUILD/lin_tape-3.0.52/lin_tape_ioctl_tape.c: In function 'erp_tod':
/tmp/B.SfbUre/BUILD/lin_tape-3.0.52/lin_tape_ioctl_tape.c:8978:2: warning: ISO C90 forbids mixed declarations and code [-Wdeclaration-after-statement]
 8978 |  struct timespec64 __now__;
      |  ^~~~~~
cc1: some warnings being treated as errors
make[1]: *** [scripts/Makefile.build:271: /tmp/B.SfbUre/BUILD/lin_tape-3.0.52/lin_tape_ioctl_tape.o] Error 1
  CC [M]  /tmp/B.SfbUre/BUILD/lin_tape-3.0.52/resolve_ibm_hp.o
  CC [M]  /tmp/B.SfbUre/BUILD/lin_tape-3.0.52/lin_tape_extra_ioctl.o
/tmp/B.SfbUre/BUILD/lin_tape-3.0.52/lin_tape_extra_ioctl.c: In function 'set_media_type':
/tmp/B.SfbUre/BUILD/lin_tape-3.0.52/lin_tape_extra_ioctl.c:1904:10: warning: this statement may fall through [-Wimplicit-fallthrough=]
 1904 |    *worm = 1;
      |    ~~~~~~^~~
/tmp/B.SfbUre/BUILD/lin_tape-3.0.52/lin_tape_extra_ioctl.c:1905:3: note: here
 1905 |   case '3': /* fall-through for 'T' and '3' */
      |   ^~~~
/tmp/B.SfbUre/BUILD/lin_tape-3.0.52/lin_tape_extra_ioctl.c:1910:10: warning: this statement may fall through [-Wimplicit-fallthrough=]
 1910 |    *worm = 1;
      |    ~~~~~~^~~
/tmp/B.SfbUre/BUILD/lin_tape-3.0.52/lin_tape_extra_ioctl.c:1911:3: note: here
 1911 |   case '4': /* fall-through for 'U' and '4' */
      |   ^~~~
/tmp/B.SfbUre/BUILD/lin_tape-3.0.52/lin_tape_extra_ioctl.c:1916:10: warning: this statement may fall through [-Wimplicit-fallthrough=]
 1916 |    *worm = 1;
      |    ~~~~~~^~~
/tmp/B.SfbUre/BUILD/lin_tape-3.0.52/lin_tape_extra_ioctl.c:1917:3: note: here
 1917 |   case '5': /* fall-through for 'V' and '5' */
      |   ^~~~
/tmp/B.SfbUre/BUILD/lin_tape-3.0.52/lin_tape_extra_ioctl.c:1922:10: warning: this statement may fall through [-Wimplicit-fallthrough=]
 1922 |    *worm = 1;
      |    ~~~~~~^~~
/tmp/B.SfbUre/BUILD/lin_tape-3.0.52/lin_tape_extra_ioctl.c:1923:3: note: here
 1923 |   case '6': /* fall-through for 'W' and '6' */
      |   ^~~~
/tmp/B.SfbUre/BUILD/lin_tape-3.0.52/lin_tape_extra_ioctl.c:1928:10: warning: this statement may fall through [-Wimplicit-fallthrough=]
 1928 |    *worm = 1;
      |    ~~~~~~^~~
/tmp/B.SfbUre/BUILD/lin_tape-3.0.52/lin_tape_extra_ioctl.c:1929:3: note: here
 1929 |   case '7': /* fall-through for 'X' and '7' */
      |   ^~~~
/tmp/B.SfbUre/BUILD/lin_tape-3.0.52/lin_tape_extra_ioctl.c:1934:10: warning: this statement may fall through [-Wimplicit-fallthrough=]
 1934 |    *worm = 1;
      |    ~~~~~~^~~
/tmp/B.SfbUre/BUILD/lin_tape-3.0.52/lin_tape_extra_ioctl.c:1935:3: note: here
 1935 |   case '8': /* fall-through for 'Y' and '8' */
      |   ^~~~
  CC [M]  /tmp/B.SfbUre/BUILD/lin_tape-3.0.52/lin_tape_ioctl_changer.o
  CC [M]  /tmp/B.SfbUre/BUILD/lin_tape-3.0.52/lin_tape_scsi_tape.o
make: *** [Makefile:1851: /tmp/B.SfbUre/BUILD/lin_tape-3.0.52] Error 2
error: Bad exit status from /tmp/B.SfbUre/BUILD/tmp/rpm-tmp.yaV76b (%build)


RPM build errors:
    Could not canonicalize hostname: ymir
    Bad exit status from /tmp/B.SfbUre/BUILD/tmp/rpm-tmp.yaV76b (%build)
ended at: Mon May  3 23:32:03 2021, done in 0:00:44.731109
error: No files produced.
+ chmod -R u+rwX /tmp/B.SfbUre/BUILD
+ rm -rf /tmp/B.SfbUre/tmp /tmp/B.SfbUre/BUILD
+ rm -rf /tmp/B.SfbUre
Begin-PLD-Builder-Info
Build-Time: user:117.84s sys:21.82s real:62.20s (faults io:20 non-io:3849787)

End-PLD-Builder-Info
[Back to list of logs] [View rpm -qa of builder]