FailedOk

th/SRPMS[OK]
th/x32[OK]
th/i686[OK]
th/x86_64[OK]

ac/SRPMS[OK]
ac/i386[OK]
ac/i586[OK]
ac/i686[OK]
ac/alpha[OK]
ac/amd64[OK]
ac/athlon[OK]
ac/ppc[OK]
ac/sparc[OK]
ac/sparc64[OK]

Advanced Search
main()
Powered by PLD Linux
(c) 2002-2021 PLD Team
$Revision: 1.37 $
Powered by electricity.
Your IP: 44.197.197.23

lttng-modules 43e289d6-0b6d-4293-82af-7585cd0bcba7

Status:Failed
Source URL:https://buildlogs.pld-linux.org/pld/th/x86_64/FAIL/lttng-modules,43e289d6-0b6d-4293-82af-7585cd0bcba7.bz2
text/plain URL:View!
rpm -qa of builder:View!
Date:2021/09/07 09:20:58
Runtime:0:01:32.128644

Toc:

  • prep
  • Executing(%prep): /bin/sh -e /tmp/B.xqhum465/BUILD/tmp/rpm-tmp.QY7ext
  • build
  • Executing(%build): /bin/sh -e /tmp/B.xqhum465/BUILD/tmp/rpm-tmp.exPxfT
  • error 1
  • /tmp/B.xqhum465/BUILD/lttng-modules-2.13.0/lttng-modules-2.13.0-rc2/src/probes/../../include/lttng/tracepoint-event-impl.h:133:6: error: conflicting types for 'trace_btrfs_writepage_end_io_hook'; have 'void(const struct page *, u64, u64, int)' {aka 'void(const struct page *, long long unsigned int, long long unsigned int, int)'}
  • error 2
  • make[3]: *** [scripts/Makefile.build:271: /tmp/B.xqhum465/BUILD/lttng-modules-2.13.0/lttng-modules-2.13.0-rc2/src/probes/lttng-probe-btrfs.o] Error 1
  • error 3
  • make[2]: *** [scripts/Makefile.build:514: /tmp/B.xqhum465/BUILD/lttng-modules-2.13.0/lttng-modules-2.13.0-rc2/src/probes] Error 2
  • error 4
  • /tmp/B.xqhum465/BUILD/lttng-modules-2.13.0/lttng-modules-2.13.0-rc2/src/lttng-statedump-impl.c:663:37: error: 'struct task_struct' has no member named 'state'; did you mean '__state'?
  • error 5
  • /tmp/B.xqhum465/BUILD/lttng-modules-2.13.0/lttng-modules-2.13.0-rc2/src/lttng-statedump-impl.c:674:39: error: 'struct task_struct' has no member named 'state'; did you mean '__state'?
  • error 6
  • make[2]: *** [scripts/Makefile.build:271: /tmp/B.xqhum465/BUILD/lttng-modules-2.13.0/lttng-modules-2.13.0-rc2/src/lttng-statedump-impl.o] Error 1
  • error 7
  • make[1]: *** [Makefile:1851: /tmp/B.xqhum465/BUILD/lttng-modules-2.13.0/lttng-modules-2.13.0-rc2/src] Error 2
  • error 8
  • error: Bad exit status from /tmp/B.xqhum465/BUILD/tmp/rpm-tmp.exPxfT (%build)
  • error 9
  • RPM build errors:
  • error 10
  • error: No files produced.

Content:

request from: baggins
checking if we should skip the build
started at: Tue Sep  7 09:19:06 2021
killing old processes on a builder
sending signal 9 to pid -1
cleaning up /tmp
fetching https://srcbuilder.pld-linux.org/th//srpms/43e289d6-0b6d-4293-82af-7585cd0bcba7/lttng-modules-2.13.0-2%405.14.1_1.src.rpm
fetched 354340 bytes, 1023.6 K/s
installing srpm: lttng-modules-2.13.0-2@5.14.1_1.src.rpm
+ install -d /tmp/B.xqhum465/BUILD /tmp/B.xqhum465/RPMS
+ LC_ALL=en_US.UTF-8
+ rpm -qp --changelog lttng-modules-2.13.0-2@5.14.1_1.src.rpm
* Tue Sep 07 2021 PLD Linux Team <feedback@pld-linux.org>
- For complete changelog see: http://git.pld-linux.org/?p=packages/lttng-modules.git;a=log;h=master
* Sun Jul 04 2021 Jan Rękorajski <baggins@pld-linux.org> 4b0bc27
- up to 2.13.0 rc2, rel 2 * Mon May 03 2021 Jan Rękorajski <baggins@pld-linux.org> 417a627
- up to 2.13.0-rc1 * Wed Feb 24 2021 Jan Rękorajski <baggins@pld-linux.org> 783d54c
- up to 2.12.5 * Sat Feb 06 2021 Jan Rękorajski <baggins@pld-linux.org> abf0d8a
- fix building with kernel 4.9.256 - rel 2 * Sat Nov 28 2020 Jan Rękorajski <baggins@pld-linux.org> b704ebb
- up to 2.2.13 + latest fixes * Sat Sep 26 2020 Jan Rękorajski <baggins@pld-linux.org> f9dfa75
- add fixes from upstream git with fixes to build modules on recent kernels - rel 2 * Sun Aug 16 2020 Jan Rękorajski <baggins@pld-linux.org> aa9cd3d
- up to 2.12.2 * Fri Jun 05 2020 Jan Rękorajski <baggins@pld-linux.org> 10babb8
- up to 2.12.1 * Tue Apr 14 2020 Jakub Bogusz <qboosh@pld-linux.org> 9a3ded0
- updated to 2.12.0 (for Linux 3.0+; ftrace integration dropped) - removed obsolete kernel-5.5.3 patch * Sat Apr 04 2020 Jan Rękorajski <baggins@pld-linux.org> 3efbae2
- up to 2.11.2 * Sun Feb 23 2020 Jan Rękorajski <baggins@pld-linux.org> 87b6b5d
- fix version macro * Sun Feb 23 2020 Jan Rękorajski <baggins@pld-linux.org> e66d568
- 4.14 doesn't need this * Sun Feb 23 2020 Jan Rękorajski <baggins@pld-linux.org> 50a7834
- enable fix on all kernels * Sun Feb 23 2020 Jan Rękorajski <baggins@pld-linux.org> 0c8875f
- 5.4 also needs this * Sun Feb 23 2020 Jan Rękorajski <baggins@pld-linux.org> bbbacb5
- fix paths in patch * Sun Feb 23 2020 Jan Rękorajski <baggins@pld-linux.org> d4618bf
- fix building with kernel 5.5.3+ - rel 2 * Wed Jan 29 2020 Jan Rękorajski <baggins@pld-linux.org> 4144a1b
- up to 2.11.1 * Sun Dec 01 2019 Jan Rękorajski <baggins@pld-linux.org> b91196d
- rework build dirs to make sure we clean them between building for different kernels - rel 2 * Sat Nov 30 2019 Jan Rękorajski <baggins@pld-linux.org> 04f5de0
- up to 2.11.0 * Sat Oct 26 2019 Jakub Bogusz <qboosh@pld-linux.org> e3bbd49
- updated to 2.10.12 + rpm -Uhv --nodeps --define '_topdir /tmp/B.xqhum465' --define '_specdir %{_topdir}' --define '_sourcedir %{_specdir}' --define '_rpmdir %{_topdir}/RPMS' --define '_builddir %{_topdir}/BUILD' --without userspace --define 'build_kernels 4.14,head,5.4,4.9,5.10,4.19' lttng-modules-2.13.0-2@5.14.1_1.src.rpm Updating / installing... lttng-modules-2.13.0-2@5.14.1_1 ######################################## + rm -f lttng-modules-2.13.0-2@5.14.1_1.src.rpm + install -m 700 -d /tmp/B.xqhum465/BUILD/tmp + TMPDIR=/tmp/B.xqhum465/BUILD/tmp + exec nice -n 0 rpmbuild -bp --short-circuit --nodeps --define '_topdir /tmp/B.xqhum465' --define '_specdir %{_topdir}' --define '_sourcedir %{_specdir}' --define '_rpmdir %{_topdir}/RPMS' --define '_builddir %{_topdir}/BUILD' --without userspace --target x86_64-pld-linux --define 'build_kernels 4.14,head,5.4,4.9,5.10,4.19' --define 'prep exit 0' /tmp/B.xqhum465/lttng-modules.spec warning: Could not canonicalize hostname: ymir Building target platforms: x86_64-pld-linux Building for target x86_64-pld-linux checking BuildConflict-ing packages rpm: warning: Could not canonicalize hostname: ymir rpm: Building target platforms: x86_64-pld-linux rpm: Building for target x86_64-pld-linux no BuildConflicts found checking BR rpm: warning: Could not canonicalize hostname: ymir rpm: Building target platforms: x86_64-pld-linux rpm: Building for target x86_64-pld-linux no BR needed building RPM using: set -ex; : build-id: 43e289d6-0b6d-4293-82af-7585cd0bcba7; TMPDIR=/tmp/B.xqhum465/BUILD/tmp exec nice -n 0 rpmbuild -bb --define '_smp_mflags -j9' --define '_make_opts -Otarget' --define '_pld_builder 1' --define '_topdir /tmp/B.xqhum465' --define '_specdir %{_topdir}' --define '_sourcedir %{_specdir}' --define '_rpmdir %{_topdir}/RPMS' --define '_builddir %{_topdir}/BUILD' --without userspace --target x86_64-pld-linux --define 'build_kernels 4.14,head,5.4,4.9,5.10,4.19' /tmp/B.xqhum465/lttng-modules.spec + : build-id: 43e289d6-0b6d-4293-82af-7585cd0bcba7 + TMPDIR=/tmp/B.xqhum465/BUILD/tmp + exec nice -n 0 rpmbuild -bb --define '_smp_mflags -j9' --define '_make_opts -Otarget' --define '_pld_builder 1' --define '_topdir /tmp/B.xqhum465' --define '_specdir %{_topdir}' --define '_sourcedir %{_specdir}' --define '_rpmdir %{_topdir}/RPMS' --define '_builddir %{_topdir}/BUILD' --without userspace --target x86_64-pld-linux --define 'build_kernels 4.14,head,5.4,4.9,5.10,4.19' /tmp/B.xqhum465/lttng-modules.spec warning: Could not canonicalize hostname: ymir Building target platforms: x86_64-pld-linux Building for target x86_64-pld-linux Executing(%prep): /bin/sh -e /tmp/B.xqhum465/BUILD/tmp/rpm-tmp.QY7ext + umask 022 + cd /tmp/B.xqhum465/BUILD + cd /tmp/B.xqhum465/BUILD + rm -rf lttng-modules-2.13.0 + /bin/mkdir -p lttng-modules-2.13.0 + cd lttng-modules-2.13.0 + /usr/bin/bzip2 -dc /tmp/B.xqhum465/lttng-modules-2.13.0-rc2.tar.bz2 + /bin/tar -xof - + STATUS=0 + '[' 0 -ne 0 ']' + /bin/chmod -Rf a+rX,u+w,g-w,o-w . + cd lttng-modules-2.13.0-rc2 + echo 'Patch #0 (build.patch):' Patch #0 (build.patch): + </tmp/B.xqhum465/build.patch + /usr/bin/patch -s -p1 '--fuzz=0' + RPM_EC=0 + jobs -p + exit 0 Executing(%build): /bin/sh -e /tmp/B.xqhum465/BUILD/tmp/rpm-tmp.exPxfT TMP=/home/users/builder/tmp HOME=/home/users/builder PATH=/home/users/builder/GNUstep/Tools:/bin:/usr/bin:/usr/local/bin:/home/users/builder/bin TMPDIR=/tmp/B.xqhum465/BUILD/tmp + umask 022 + cd /tmp/B.xqhum465/BUILD + cd lttng-modules-2.13.0 + cd lttng-modules-2.13.0-rc2 + /usr/bin/make -Otarget -j9 clean 'KERNELDIR=/usr/src/linux-4.14' /usr/bin/make -C /usr/src/linux-4.14 M=/tmp/B.xqhum465/BUILD/lttng-modules-2.13.0/lttng-modules-2.13.0-rc2/src clean + /usr/bin/make -Otarget -j9 'KERNELDIR=/usr/src/linux-4.14' /usr/bin/make -C /usr/src/linux-4.14 M=/tmp/B.xqhum465/BUILD/lttng-modules-2.13.0/lttng-modules-2.13.0-rc2/src \ CONFIG_LTTNG=m CONFIG_LTTNG_CLOCK_PLUGIN_TEST=m \ KCPPFLAGS='' \ modules CC [M] /tmp/B.xqhum465/BUILD/lttng-modules-2.13.0/lttng-modules-2.13.0-rc2/src/lttng-ring-buffer-event-notifier-client.o CC [M] /tmp/B.xqhum465/BUILD/lttng-modules-2.13.0/lttng-modules-2.13.0-rc2/src/lttng-ring-buffer-metadata-client.o CC [M] /tmp/B.xqhum465/BUILD/lttng-modules-2.13.0/lttng-modules-2.13.0-rc2/src/lttng-ring-buffer-client-discard.o CC [M] /tmp/B.xqhum465/BUILD/lttng-modules-2.13.0/lttng-modules-2.13.0-rc2/src/lttng-ring-buffer-metadata-mmap-client.o CC [M] /tmp/B.xqhum465/BUILD/lttng-modules-2.13.0/lttng-modules-2.13.0-rc2/src/lttng-counter-client-percpu-32-modular.o CC [M] /tmp/B.xqhum465/BUILD/lttng-modules-2.13.0/lttng-modules-2.13.0-rc2/src/lttng-counter-client-percpu-64-modular.o CC [M] /tmp/B.xqhum465/BUILD/lttng-modules-2.13.0/lttng-modules-2.13.0-rc2/src/lttng-ring-buffer-client-overwrite.o CC [M] /tmp/B.xqhum465/BUILD/lttng-modules-2.13.0/lttng-modules-2.13.0-rc2/src/lttng-ring-buffer-client-mmap-discard.o CC [M] /tmp/B.xqhum465/BUILD/lttng-modules-2.13.0/lttng-modules-2.13.0-rc2/src/lttng-ring-buffer-client-mmap-overwrite.o CC [M] /tmp/B.xqhum465/BUILD/lttng-modules-2.13.0/lttng-modules-2.13.0-rc2/src/lib/msgpack/msgpack.o CC [M] /tmp/B.xqhum465/BUILD/lttng-modules-2.13.0/lttng-modules-2.13.0-rc2/src/lttng-string-utils.o CC [M] /tmp/B.xqhum465/BUILD/lttng-modules-2.13.0/lttng-modules-2.13.0-rc2/src/lttng-clock.o CC [M] /tmp/B.xqhum465/BUILD/lttng-modules-2.13.0/lttng-modules-2.13.0-rc2/src/lttng-context-pid.o CC [M] /tmp/B.xqhum465/BUILD/lttng-modules-2.13.0/lttng-modules-2.13.0-rc2/src/lttng-context.o CC [M] /tmp/B.xqhum465/BUILD/lttng-modules-2.13.0/lttng-modules-2.13.0-rc2/src/lttng-probes.o CC [M] /tmp/B.xqhum465/BUILD/lttng-modules-2.13.0/lttng-modules-2.13.0-rc2/src/lttng-context-procname.o CC [M] /tmp/B.xqhum465/BUILD/lttng-modules-2.13.0/lttng-modules-2.13.0-rc2/src/lttng-context-prio.o CC [M] /tmp/B.xqhum465/BUILD/lttng-modules-2.13.0/lttng-modules-2.13.0-rc2/src/lttng-context-nice.o CC [M] /tmp/B.xqhum465/BUILD/lttng-modules-2.13.0/lttng-modules-2.13.0-rc2/src/lttng-abi.o CC [M] /tmp/B.xqhum465/BUILD/lttng-modules-2.13.0/lttng-modules-2.13.0-rc2/src/lttng-context-vpid.o CC [M] /tmp/B.xqhum465/BUILD/lttng-modules-2.13.0/lttng-modules-2.13.0-rc2/src/lttng-context-vtid.o CC [M] /tmp/B.xqhum465/BUILD/lttng-modules-2.13.0/lttng-modules-2.13.0-rc2/src/lttng-context-tid.o CC [M] /tmp/B.xqhum465/BUILD/lttng-modules-2.13.0/lttng-modules-2.13.0-rc2/src/lttng-context-cpu-id.o CC [M] /tmp/B.xqhum465/BUILD/lttng-modules-2.13.0/lttng-modules-2.13.0-rc2/src/lttng-context-ppid.o CC [M] /tmp/B.xqhum465/BUILD/lttng-modules-2.13.0/lttng-modules-2.13.0-rc2/src/lttng-context-uid.o CC [M] /tmp/B.xqhum465/BUILD/lttng-modules-2.13.0/lttng-modules-2.13.0-rc2/src/lttng-context-vppid.o CC [M] /tmp/B.xqhum465/BUILD/lttng-modules-2.13.0/lttng-modules-2.13.0-rc2/src/lttng-events.o CC [M] /tmp/B.xqhum465/BUILD/lttng-modules-2.13.0/lttng-modules-2.13.0-rc2/src/lttng-context-euid.o CC [M] /tmp/B.xqhum465/BUILD/lttng-modules-2.13.0/lttng-modules-2.13.0-rc2/src/lttng-context-suid.o CC [M] /tmp/B.xqhum465/BUILD/lttng-modules-2.13.0/lttng-modules-2.13.0-rc2/src/lttng-context-egid.o CC [M] /tmp/B.xqhum465/BUILD/lttng-modules-2.13.0/lttng-modules-2.13.0-rc2/src/lttng-context-gid.o CC [M] /tmp/B.xqhum465/BUILD/lttng-modules-2.13.0/lttng-modules-2.13.0-rc2/src/lttng-context-sgid.o CC [M] /tmp/B.xqhum465/BUILD/lttng-modules-2.13.0/lttng-modules-2.13.0-rc2/src/lttng-context-vuid.o CC [M] /tmp/B.xqhum465/BUILD/lttng-modules-2.13.0/lttng-modules-2.13.0-rc2/src/lttng-context-veuid.o CC [M] /tmp/B.xqhum465/BUILD/lttng-modules-2.13.0/lttng-modules-2.13.0-rc2/src/lttng-context-vsuid.o CC [M] /tmp/B.xqhum465/BUILD/lttng-modules-2.13.0/lttng-modules-2.13.0-rc2/src/lttng-context-vgid.o CC [M] /tmp/B.xqhum465/BUILD/lttng-modules-2.13.0/lttng-modules-2.13.0-rc2/src/lttng-context-vegid.o CC [M] /tmp/B.xqhum465/BUILD/lttng-modules-2.13.0/lttng-modules-2.13.0-rc2/src/lttng-context-vsgid.o CC [M] /tmp/B.xqhum465/BUILD/lttng-modules-2.13.0/lttng-modules-2.13.0-rc2/src/lttng-calibrate.o CC [M] /tmp/B.xqhum465/BUILD/lttng-modules-2.13.0/lttng-modules-2.13.0-rc2/src/lttng-context-interruptible.o CC [M] /tmp/B.xqhum465/BUILD/lttng-modules-2.13.0/lttng-modules-2.13.0-rc2/src/lttng-context-need-reschedule.o CC [M] /tmp/B.xqhum465/BUILD/lttng-modules-2.13.0/lttng-modules-2.13.0-rc2/src/probes/lttng.o CC [M] /tmp/B.xqhum465/BUILD/lttng-modules-2.13.0/lttng-modules-2.13.0-rc2/src/lttng-context-hostname.o CC [M] /tmp/B.xqhum465/BUILD/lttng-modules-2.13.0/lttng-modules-2.13.0-rc2/src/lttng-bytecode.o CC [M] /tmp/B.xqhum465/BUILD/lttng-modules-2.13.0/lttng-modules-2.13.0-rc2/src/lttng-context-callstack.o CC [M] /tmp/B.xqhum465/BUILD/lttng-modules-2.13.0/lttng-modules-2.13.0-rc2/src/lttng-tracker-id.o CC [M] /tmp/B.xqhum465/BUILD/lttng-modules-2.13.0/lttng-modules-2.13.0-rc2/src/lttng-tp-mempool.o CC [M] /tmp/B.xqhum465/BUILD/lttng-modules-2.13.0/lttng-modules-2.13.0-rc2/src/probes/lttng-probe-user.o CC [M] /tmp/B.xqhum465/BUILD/lttng-modules-2.13.0/lttng-modules-2.13.0-rc2/src/lttng-bytecode-interpreter.o CC [M] /tmp/B.xqhum465/BUILD/lttng-modules-2.13.0/lttng-modules-2.13.0-rc2/src/lttng-bytecode-specialize.o CC [M] /tmp/B.xqhum465/BUILD/lttng-modules-2.13.0/lttng-modules-2.13.0-rc2/src/lttng-bytecode-validator.o CC [M] /tmp/B.xqhum465/BUILD/lttng-modules-2.13.0/lttng-modules-2.13.0-rc2/src/lttng-event-notifier-notification.o CC [M] /tmp/B.xqhum465/BUILD/lttng-modules-2.13.0/lttng-modules-2.13.0-rc2/src/lttng-syscalls-enum.o CC [M] /tmp/B.xqhum465/BUILD/lttng-modules-2.13.0/lttng-modules-2.13.0-rc2/src/lttng-context-perf-counters.o CC [M] /tmp/B.xqhum465/BUILD/lttng-modules-2.13.0/lttng-modules-2.13.0-rc2/src/lttng-tracepoint.o CC [M] /tmp/B.xqhum465/BUILD/lttng-modules-2.13.0/lttng-modules-2.13.0-rc2/src/lttng-context-cgroup-ns.o CC [M] /tmp/B.xqhum465/BUILD/lttng-modules-2.13.0/lttng-modules-2.13.0-rc2/src/lttng-syscalls.o CC [M] /tmp/B.xqhum465/BUILD/lttng-modules-2.13.0/lttng-modules-2.13.0-rc2/src/lttng-context-ipc-ns.o CC [M] /tmp/B.xqhum465/BUILD/lttng-modules-2.13.0/lttng-modules-2.13.0-rc2/src/lttng-context-mnt-ns.o CC [M] /tmp/B.xqhum465/BUILD/lttng-modules-2.13.0/lttng-modules-2.13.0-rc2/src/lttng-context-pid-ns.o CC [M] /tmp/B.xqhum465/BUILD/lttng-modules-2.13.0/lttng-modules-2.13.0-rc2/src/lttng-context-net-ns.o CC [M] /tmp/B.xqhum465/BUILD/lttng-modules-2.13.0/lttng-modules-2.13.0-rc2/src/lttng-context-user-ns.o CC [M] /tmp/B.xqhum465/BUILD/lttng-modules-2.13.0/lttng-modules-2.13.0-rc2/src/lttng-context-uts-ns.o CC [M] /tmp/B.xqhum465/BUILD/lttng-modules-2.13.0/lttng-modules-2.13.0-rc2/src/wrapper/page_alloc.o CC [M] /tmp/B.xqhum465/BUILD/lttng-modules-2.13.0/lttng-modules-2.13.0-rc2/src/wrapper/random.o CC [M] /tmp/B.xqhum465/BUILD/lttng-modules-2.13.0/lttng-modules-2.13.0-rc2/src/wrapper/trace-clock.o CC [M] /tmp/B.xqhum465/BUILD/lttng-modules-2.13.0/lttng-modules-2.13.0-rc2/src/wrapper/kallsyms.o CC [M] /tmp/B.xqhum465/BUILD/lttng-modules-2.13.0/lttng-modules-2.13.0-rc2/src/wrapper/fdtable.o CC [M] /tmp/B.xqhum465/BUILD/lttng-modules-2.13.0/lttng-modules-2.13.0-rc2/src/wrapper/irqdesc.o CC [M] /tmp/B.xqhum465/BUILD/lttng-modules-2.13.0/lttng-modules-2.13.0-rc2/src/lttng-wrapper-impl.o CC [M] /tmp/B.xqhum465/BUILD/lttng-modules-2.13.0/lttng-modules-2.13.0-rc2/src/probes/lttng-probe-irq.o LD [M] /tmp/B.xqhum465/BUILD/lttng-modules-2.13.0/lttng-modules-2.13.0-rc2/src/lttng-wrapper.o CC [M] /tmp/B.xqhum465/BUILD/lttng-modules-2.13.0/lttng-modules-2.13.0-rc2/src/tests/probes/lttng-test.o CC [M] /tmp/B.xqhum465/BUILD/lttng-modules-2.13.0/lttng-modules-2.13.0-rc2/src/lttng-statedump-impl.o LD [M] /tmp/B.xqhum465/BUILD/lttng-modules-2.13.0/lttng-modules-2.13.0-rc2/src/lttng-statedump.o LD [M] /tmp/B.xqhum465/BUILD/lttng-modules-2.13.0/lttng-modules-2.13.0-rc2/src/tests/lttng-test.o CC [M] /tmp/B.xqhum465/BUILD/lttng-modules-2.13.0/lttng-modules-2.13.0-rc2/src/probes/lttng-probe-sched.o CC [M] /tmp/B.xqhum465/BUILD/lttng-modules-2.13.0/lttng-modules-2.13.0-rc2/src/lib/ringbuffer/ring_buffer_backend.o CC [M] /tmp/B.xqhum465/BUILD/lttng-modules-2.13.0/lttng-modules-2.13.0-rc2/src/tests/clock-plugin/lttng-clock-plugin-test.o LD [M] /tmp/B.xqhum465/BUILD/lttng-modules-2.13.0/lttng-modules-2.13.0-rc2/src/tests/lttng-clock-plugin-test.o CC [M] /tmp/B.xqhum465/BUILD/lttng-modules-2.13.0/lttng-modules-2.13.0-rc2/src/lib/ringbuffer/ring_buffer_frontend.o CC [M] /tmp/B.xqhum465/BUILD/lttng-modules-2.13.0/lttng-modules-2.13.0-rc2/src/probes/lttng-probe-timer.o CC [M] /tmp/B.xqhum465/BUILD/lttng-modules-2.13.0/lttng-modules-2.13.0-rc2/src/lib/ringbuffer/ring_buffer_iterator.o CC [M] /tmp/B.xqhum465/BUILD/lttng-modules-2.13.0/lttng-modules-2.13.0-rc2/src/lib/ringbuffer/ring_buffer_vfs.o CC [M] /tmp/B.xqhum465/BUILD/lttng-modules-2.13.0/lttng-modules-2.13.0-rc2/src/lib/ringbuffer/ring_buffer_splice.o CC [M] /tmp/B.xqhum465/BUILD/lttng-modules-2.13.0/lttng-modules-2.13.0-rc2/src/lib/prio_heap/lttng_prio_heap.o CC [M] /tmp/B.xqhum465/BUILD/lttng-modules-2.13.0/lttng-modules-2.13.0-rc2/src/lib/../wrapper/splice.o CC [M] /tmp/B.xqhum465/BUILD/lttng-modules-2.13.0/lttng-modules-2.13.0-rc2/src/lib/ringbuffer/ring_buffer_mmap.o CC [M] /tmp/B.xqhum465/BUILD/lttng-modules-2.13.0/lttng-modules-2.13.0-rc2/src/probes/lttng-probe-module.o CC [M] /tmp/B.xqhum465/BUILD/lttng-modules-2.13.0/lttng-modules-2.13.0-rc2/src/probes/lttng-probe-kmem.o LD [M] /tmp/B.xqhum465/BUILD/lttng-modules-2.13.0/lttng-modules-2.13.0-rc2/src/lib/lttng-lib-ring-buffer.o CC [M] /tmp/B.xqhum465/BUILD/lttng-modules-2.13.0/lttng-modules-2.13.0-rc2/src/lib/counter/counter.o CC [M] /tmp/B.xqhum465/BUILD/lttng-modules-2.13.0/lttng-modules-2.13.0-rc2/src/probes/lttng-probe-power.o LD [M] /tmp/B.xqhum465/BUILD/lttng-modules-2.13.0/lttng-modules-2.13.0-rc2/src/lib/lttng-counter.o CC [M] /tmp/B.xqhum465/BUILD/lttng-modules-2.13.0/lttng-modules-2.13.0-rc2/src/probes/lttng-probe-9p.o CC [M] /tmp/B.xqhum465/BUILD/lttng-modules-2.13.0/lttng-modules-2.13.0-rc2/src/probes/lttng-probe-i2c.o CC [M] /tmp/B.xqhum465/BUILD/lttng-modules-2.13.0/lttng-modules-2.13.0-rc2/src/probes/lttng-probe-kvm.o CC [M] /tmp/B.xqhum465/BUILD/lttng-modules-2.13.0/lttng-modules-2.13.0-rc2/src/probes/lttng-probe-statedump.o CC [M] /tmp/B.xqhum465/BUILD/lttng-modules-2.13.0/lttng-modules-2.13.0-rc2/src/probes/lttng-probe-kvm-x86-mmu.o CC [M] /tmp/B.xqhum465/BUILD/lttng-modules-2.13.0/lttng-modules-2.13.0-rc2/src/probes/lttng-probe-x86-irq-vectors.o CC [M] /tmp/B.xqhum465/BUILD/lttng-modules-2.13.0/lttng-modules-2.13.0-rc2/src/probes/lttng-probe-x86-exceptions.o CC [M] /tmp/B.xqhum465/BUILD/lttng-modules-2.13.0/lttng-modules-2.13.0-rc2/src/probes/lttng-probe-signal.o CC [M] /tmp/B.xqhum465/BUILD/lttng-modules-2.13.0/lttng-modules-2.13.0-rc2/src/probes/lttng-probe-napi.o CC [M] /tmp/B.xqhum465/BUILD/lttng-modules-2.13.0/lttng-modules-2.13.0-rc2/src/probes/lttng-probe-kvm-x86.o CC [M] /tmp/B.xqhum465/BUILD/lttng-modules-2.13.0/lttng-modules-2.13.0-rc2/src/probes/lttng-probe-skb.o CC [M] /tmp/B.xqhum465/BUILD/lttng-modules-2.13.0/lttng-modules-2.13.0-rc2/src/probes/lttng-probe-net.o CC [M] /tmp/B.xqhum465/BUILD/lttng-modules-2.13.0/lttng-modules-2.13.0-rc2/src/probes/lttng-probe-block.o CC [M] /tmp/B.xqhum465/BUILD/lttng-modules-2.13.0/lttng-modules-2.13.0-rc2/src/probes/lttng-probe-sock.o CC [M] /tmp/B.xqhum465/BUILD/lttng-modules-2.13.0/lttng-modules-2.13.0-rc2/src/probes/lttng-probe-udp.o CC [M] /tmp/B.xqhum465/BUILD/lttng-modules-2.13.0/lttng-modules-2.13.0-rc2/src/probes/lttng-probe-asoc.o CC [M] /tmp/B.xqhum465/BUILD/lttng-modules-2.13.0/lttng-modules-2.13.0-rc2/src/probes/lttng-probe-gpio.o CC [M] /tmp/B.xqhum465/BUILD/lttng-modules-2.13.0/lttng-modules-2.13.0-rc2/src/probes/lttng-probe-regulator.o CC [M] /tmp/B.xqhum465/BUILD/lttng-modules-2.13.0/lttng-modules-2.13.0-rc2/src/probes/lttng-probe-jbd2.o CC [M] /tmp/B.xqhum465/BUILD/lttng-modules-2.13.0/lttng-modules-2.13.0-rc2/src/probes/lttng-probe-scsi.o CC [M] /tmp/B.xqhum465/BUILD/lttng-modules-2.13.0/lttng-modules-2.13.0-rc2/src/probes/lttng-probe-compaction.o CC [M] /tmp/B.xqhum465/BUILD/lttng-modules-2.13.0/lttng-modules-2.13.0-rc2/src/probes/lttng-probe-printk.o CC [M] /tmp/B.xqhum465/BUILD/lttng-modules-2.13.0/lttng-modules-2.13.0-rc2/src/probes/lttng-probe-vmscan.o CC [M] /tmp/B.xqhum465/BUILD/lttng-modules-2.13.0/lttng-modules-2.13.0-rc2/src/probes/lttng-probe-rcu.o CC [M] /tmp/B.xqhum465/BUILD/lttng-modules-2.13.0/lttng-modules-2.13.0-rc2/src/probes/lttng-probe-random.o CC [M] /tmp/B.xqhum465/BUILD/lttng-modules-2.13.0/lttng-modules-2.13.0-rc2/src/probes/lttng-probe-regmap.o CC [M] /tmp/B.xqhum465/BUILD/lttng-modules-2.13.0/lttng-modules-2.13.0-rc2/src/probes/lttng-probe-btrfs.o CC [M] /tmp/B.xqhum465/BUILD/lttng-modules-2.13.0/lttng-modules-2.13.0-rc2/src/probes/lttng-probe-v4l2.o CC [M] /tmp/B.xqhum465/BUILD/lttng-modules-2.13.0/lttng-modules-2.13.0-rc2/src/probes/lttng-probe-sunrpc.o CC [M] /tmp/B.xqhum465/BUILD/lttng-modules-2.13.0/lttng-modules-2.13.0-rc2/src/probes/lttng-probe-workqueue.o CC [M] /tmp/B.xqhum465/BUILD/lttng-modules-2.13.0/lttng-modules-2.13.0-rc2/src/probes/lttng-kprobes.o CC [M] /tmp/B.xqhum465/BUILD/lttng-modules-2.13.0/lttng-modules-2.13.0-rc2/src/probes/lttng-uprobes.o CC [M] /tmp/B.xqhum465/BUILD/lttng-modules-2.13.0/lttng-modules-2.13.0-rc2/src/probes/lttng-kretprobes.o CC [M] /tmp/B.xqhum465/BUILD/lttng-modules-2.13.0/lttng-modules-2.13.0-rc2/src/probes/lttng-probe-writeback.o CC [M] /tmp/B.xqhum465/BUILD/lttng-modules-2.13.0/lttng-modules-2.13.0-rc2/src/lttng-syscalls-entry-compat-table.o CC [M] /tmp/B.xqhum465/BUILD/lttng-modules-2.13.0/lttng-modules-2.13.0-rc2/src/probes/lttng-probe-ext4.o CC [M] /tmp/B.xqhum465/BUILD/lttng-modules-2.13.0/lttng-modules-2.13.0-rc2/src/lttng-syscalls-entry-table.o CC [M] /tmp/B.xqhum465/BUILD/lttng-modules-2.13.0/lttng-modules-2.13.0-rc2/src/lttng-syscalls-exit-compat-table.o CC [M] /tmp/B.xqhum465/BUILD/lttng-modules-2.13.0/lttng-modules-2.13.0-rc2/src/lttng-syscalls-exit-table.o LD [M] /tmp/B.xqhum465/BUILD/lttng-modules-2.13.0/lttng-modules-2.13.0-rc2/src/lttng-tracer.o make[1]: Entering directory '/usr/src/linux-4.14-4.14.246' Building modules, stage 2. make[1]: Leaving directory '/usr/src/linux-4.14-4.14.246' MODPOST 58 modules CC /tmp/B.xqhum465/BUILD/lttng-modules-2.13.0/lttng-modules-2.13.0-rc2/src/lttng-clock.mod.o CC /tmp/B.xqhum465/BUILD/lttng-modules-2.13.0/lttng-modules-2.13.0-rc2/src/lib/lttng-counter.mod.o CC /tmp/B.xqhum465/BUILD/lttng-modules-2.13.0/lttng-modules-2.13.0-rc2/src/lttng-counter-client-percpu-32-modular.mod.o CC /tmp/B.xqhum465/BUILD/lttng-modules-2.13.0/lttng-modules-2.13.0-rc2/src/lttng-ring-buffer-client-overwrite.mod.o CC /tmp/B.xqhum465/BUILD/lttng-modules-2.13.0/lttng-modules-2.13.0-rc2/src/lib/lttng-lib-ring-buffer.mod.o CC /tmp/B.xqhum465/BUILD/lttng-modules-2.13.0/lttng-modules-2.13.0-rc2/src/lttng-ring-buffer-client-discard.mod.o CC /tmp/B.xqhum465/BUILD/lttng-modules-2.13.0/lttng-modules-2.13.0-rc2/src/lttng-counter-client-percpu-64-modular.mod.o CC /tmp/B.xqhum465/BUILD/lttng-modules-2.13.0/lttng-modules-2.13.0-rc2/src/lttng-ring-buffer-client-mmap-discard.mod.o CC /tmp/B.xqhum465/BUILD/lttng-modules-2.13.0/lttng-modules-2.13.0-rc2/src/lttng-ring-buffer-client-mmap-overwrite.mod.o CC /tmp/B.xqhum465/BUILD/lttng-modules-2.13.0/lttng-modules-2.13.0-rc2/src/lttng-ring-buffer-event-notifier-client.mod.o CC /tmp/B.xqhum465/BUILD/lttng-modules-2.13.0/lttng-modules-2.13.0-rc2/src/lttng-ring-buffer-metadata-client.mod.o CC /tmp/B.xqhum465/BUILD/lttng-modules-2.13.0/lttng-modules-2.13.0-rc2/src/lttng-tracer.mod.o CC /tmp/B.xqhum465/BUILD/lttng-modules-2.13.0/lttng-modules-2.13.0-rc2/src/lttng-statedump.mod.o CC /tmp/B.xqhum465/BUILD/lttng-modules-2.13.0/lttng-modules-2.13.0-rc2/src/lttng-wrapper.mod.o CC /tmp/B.xqhum465/BUILD/lttng-modules-2.13.0/lttng-modules-2.13.0-rc2/src/lttng-ring-buffer-metadata-mmap-client.mod.o CC /tmp/B.xqhum465/BUILD/lttng-modules-2.13.0/lttng-modules-2.13.0-rc2/src/probes/lttng-kprobes.mod.o CC /tmp/B.xqhum465/BUILD/lttng-modules-2.13.0/lttng-modules-2.13.0-rc2/src/probes/lttng-kretprobes.mod.o CC /tmp/B.xqhum465/BUILD/lttng-modules-2.13.0/lttng-modules-2.13.0-rc2/src/probes/lttng-probe-9p.mod.o CC /tmp/B.xqhum465/BUILD/lttng-modules-2.13.0/lttng-modules-2.13.0-rc2/src/probes/lttng-probe-asoc.mod.o CC /tmp/B.xqhum465/BUILD/lttng-modules-2.13.0/lttng-modules-2.13.0-rc2/src/probes/lttng-probe-block.mod.o CC /tmp/B.xqhum465/BUILD/lttng-modules-2.13.0/lttng-modules-2.13.0-rc2/src/probes/lttng-probe-compaction.mod.o CC /tmp/B.xqhum465/BUILD/lttng-modules-2.13.0/lttng-modules-2.13.0-rc2/src/probes/lttng-probe-btrfs.mod.o CC /tmp/B.xqhum465/BUILD/lttng-modules-2.13.0/lttng-modules-2.13.0-rc2/src/probes/lttng-probe-ext4.mod.o CC /tmp/B.xqhum465/BUILD/lttng-modules-2.13.0/lttng-modules-2.13.0-rc2/src/probes/lttng-probe-gpio.mod.o CC /tmp/B.xqhum465/BUILD/lttng-modules-2.13.0/lttng-modules-2.13.0-rc2/src/probes/lttng-probe-i2c.mod.o CC /tmp/B.xqhum465/BUILD/lttng-modules-2.13.0/lttng-modules-2.13.0-rc2/src/probes/lttng-probe-jbd2.mod.o CC /tmp/B.xqhum465/BUILD/lttng-modules-2.13.0/lttng-modules-2.13.0-rc2/src/probes/lttng-probe-irq.mod.o CC /tmp/B.xqhum465/BUILD/lttng-modules-2.13.0/lttng-modules-2.13.0-rc2/src/probes/lttng-probe-kmem.mod.o CC /tmp/B.xqhum465/BUILD/lttng-modules-2.13.0/lttng-modules-2.13.0-rc2/src/probes/lttng-probe-kvm-x86-mmu.mod.o CC /tmp/B.xqhum465/BUILD/lttng-modules-2.13.0/lttng-modules-2.13.0-rc2/src/probes/lttng-probe-kvm.mod.o CC /tmp/B.xqhum465/BUILD/lttng-modules-2.13.0/lttng-modules-2.13.0-rc2/src/probes/lttng-probe-kvm-x86.mod.o CC /tmp/B.xqhum465/BUILD/lttng-modules-2.13.0/lttng-modules-2.13.0-rc2/src/probes/lttng-probe-napi.mod.o CC /tmp/B.xqhum465/BUILD/lttng-modules-2.13.0/lttng-modules-2.13.0-rc2/src/probes/lttng-probe-net.mod.o CC /tmp/B.xqhum465/BUILD/lttng-modules-2.13.0/lttng-modules-2.13.0-rc2/src/probes/lttng-probe-module.mod.o CC /tmp/B.xqhum465/BUILD/lttng-modules-2.13.0/lttng-modules-2.13.0-rc2/src/probes/lttng-probe-printk.mod.o CC /tmp/B.xqhum465/BUILD/lttng-modules-2.13.0/lttng-modules-2.13.0-rc2/src/probes/lttng-probe-power.mod.o CC /tmp/B.xqhum465/BUILD/lttng-modules-2.13.0/lttng-modules-2.13.0-rc2/src/probes/lttng-probe-rcu.mod.o CC /tmp/B.xqhum465/BUILD/lttng-modules-2.13.0/lttng-modules-2.13.0-rc2/src/probes/lttng-probe-random.mod.o CC /tmp/B.xqhum465/BUILD/lttng-modules-2.13.0/lttng-modules-2.13.0-rc2/src/probes/lttng-probe-regulator.mod.o CC /tmp/B.xqhum465/BUILD/lttng-modules-2.13.0/lttng-modules-2.13.0-rc2/src/probes/lttng-probe-regmap.mod.o CC /tmp/B.xqhum465/BUILD/lttng-modules-2.13.0/lttng-modules-2.13.0-rc2/src/probes/lttng-probe-scsi.mod.o CC /tmp/B.xqhum465/BUILD/lttng-modules-2.13.0/lttng-modules-2.13.0-rc2/src/probes/lttng-probe-sched.mod.o CC /tmp/B.xqhum465/BUILD/lttng-modules-2.13.0/lttng-modules-2.13.0-rc2/src/probes/lttng-probe-skb.mod.o CC /tmp/B.xqhum465/BUILD/lttng-modules-2.13.0/lttng-modules-2.13.0-rc2/src/probes/lttng-probe-signal.mod.o CC /tmp/B.xqhum465/BUILD/lttng-modules-2.13.0/lttng-modules-2.13.0-rc2/src/probes/lttng-probe-sock.mod.o CC /tmp/B.xqhum465/BUILD/lttng-modules-2.13.0/lttng-modules-2.13.0-rc2/src/probes/lttng-probe-statedump.mod.o CC /tmp/B.xqhum465/BUILD/lttng-modules-2.13.0/lttng-modules-2.13.0-rc2/src/probes/lttng-probe-sunrpc.mod.o CC /tmp/B.xqhum465/BUILD/lttng-modules-2.13.0/lttng-modules-2.13.0-rc2/src/probes/lttng-probe-timer.mod.o CC /tmp/B.xqhum465/BUILD/lttng-modules-2.13.0/lttng-modules-2.13.0-rc2/src/probes/lttng-probe-udp.mod.o CC /tmp/B.xqhum465/BUILD/lttng-modules-2.13.0/lttng-modules-2.13.0-rc2/src/probes/lttng-probe-v4l2.mod.o LD [M] /tmp/B.xqhum465/BUILD/lttng-modules-2.13.0/lttng-modules-2.13.0-rc2/src/lib/lttng-counter.ko LD [M] /tmp/B.xqhum465/BUILD/lttng-modules-2.13.0/lttng-modules-2.13.0-rc2/src/lib/lttng-lib-ring-buffer.ko LD [M] /tmp/B.xqhum465/BUILD/lttng-modules-2.13.0/lttng-modules-2.13.0-rc2/src/lttng-clock.ko LD [M] /tmp/B.xqhum465/BUILD/lttng-modules-2.13.0/lttng-modules-2.13.0-rc2/src/lttng-counter-client-percpu-32-modular.ko CC /tmp/B.xqhum465/BUILD/lttng-modules-2.13.0/lttng-modules-2.13.0-rc2/src/probes/lttng-probe-vmscan.mod.o LD [M] /tmp/B.xqhum465/BUILD/lttng-modules-2.13.0/lttng-modules-2.13.0-rc2/src/lttng-counter-client-percpu-64-modular.ko LD [M] /tmp/B.xqhum465/BUILD/lttng-modules-2.13.0/lttng-modules-2.13.0-rc2/src/lttng-ring-buffer-client-discard.ko LD [M] /tmp/B.xqhum465/BUILD/lttng-modules-2.13.0/lttng-modules-2.13.0-rc2/src/lttng-ring-buffer-client-mmap-discard.ko CC /tmp/B.xqhum465/BUILD/lttng-modules-2.13.0/lttng-modules-2.13.0-rc2/src/probes/lttng-probe-workqueue.mod.o LD [M] /tmp/B.xqhum465/BUILD/lttng-modules-2.13.0/lttng-modules-2.13.0-rc2/src/lttng-ring-buffer-client-mmap-overwrite.ko LD [M] /tmp/B.xqhum465/BUILD/lttng-modules-2.13.0/lttng-modules-2.13.0-rc2/src/lttng-ring-buffer-client-overwrite.ko LD [M] /tmp/B.xqhum465/BUILD/lttng-modules-2.13.0/lttng-modules-2.13.0-rc2/src/lttng-ring-buffer-event-notifier-client.ko LD [M] /tmp/B.xqhum465/BUILD/lttng-modules-2.13.0/lttng-modules-2.13.0-rc2/src/lttng-ring-buffer-metadata-client.ko LD [M] /tmp/B.xqhum465/BUILD/lttng-modules-2.13.0/lttng-modules-2.13.0-rc2/src/lttng-ring-buffer-metadata-mmap-client.ko CC /tmp/B.xqhum465/BUILD/lttng-modules-2.13.0/lttng-modules-2.13.0-rc2/src/probes/lttng-probe-x86-exceptions.mod.o LD [M] /tmp/B.xqhum465/BUILD/lttng-modules-2.13.0/lttng-modules-2.13.0-rc2/src/lttng-statedump.ko CC /tmp/B.xqhum465/BUILD/lttng-modules-2.13.0/lttng-modules-2.13.0-rc2/src/probes/lttng-probe-writeback.mod.o LD [M] /tmp/B.xqhum465/BUILD/lttng-modules-2.13.0/lttng-modules-2.13.0-rc2/src/lttng-tracer.ko LD [M] /tmp/B.xqhum465/BUILD/lttng-modules-2.13.0/lttng-modules-2.13.0-rc2/src/lttng-wrapper.ko LD [M] /tmp/B.xqhum465/BUILD/lttng-modules-2.13.0/lttng-modules-2.13.0-rc2/src/probes/lttng-kprobes.ko LD [M] /tmp/B.xqhum465/BUILD/lttng-modules-2.13.0/lttng-modules-2.13.0-rc2/src/probes/lttng-probe-9p.ko LD [M] /tmp/B.xqhum465/BUILD/lttng-modules-2.13.0/lttng-modules-2.13.0-rc2/src/probes/lttng-kretprobes.ko LD [M] /tmp/B.xqhum465/BUILD/lttng-modules-2.13.0/lttng-modules-2.13.0-rc2/src/probes/lttng-probe-asoc.ko LD [M] /tmp/B.xqhum465/BUILD/lttng-modules-2.13.0/lttng-modules-2.13.0-rc2/src/probes/lttng-probe-block.ko LD [M] /tmp/B.xqhum465/BUILD/lttng-modules-2.13.0/lttng-modules-2.13.0-rc2/src/probes/lttng-probe-btrfs.ko LD [M] /tmp/B.xqhum465/BUILD/lttng-modules-2.13.0/lttng-modules-2.13.0-rc2/src/probes/lttng-probe-compaction.ko LD [M] /tmp/B.xqhum465/BUILD/lttng-modules-2.13.0/lttng-modules-2.13.0-rc2/src/probes/lttng-probe-ext4.ko LD [M] /tmp/B.xqhum465/BUILD/lttng-modules-2.13.0/lttng-modules-2.13.0-rc2/src/probes/lttng-probe-gpio.ko LD [M] /tmp/B.xqhum465/BUILD/lttng-modules-2.13.0/lttng-modules-2.13.0-rc2/src/probes/lttng-probe-i2c.ko LD [M] /tmp/B.xqhum465/BUILD/lttng-modules-2.13.0/lttng-modules-2.13.0-rc2/src/probes/lttng-probe-irq.ko LD [M] /tmp/B.xqhum465/BUILD/lttng-modules-2.13.0/lttng-modules-2.13.0-rc2/src/probes/lttng-probe-jbd2.ko LD [M] /tmp/B.xqhum465/BUILD/lttng-modules-2.13.0/lttng-modules-2.13.0-rc2/src/probes/lttng-probe-kmem.ko LD [M] /tmp/B.xqhum465/BUILD/lttng-modules-2.13.0/lttng-modules-2.13.0-rc2/src/probes/lttng-probe-kvm-x86-mmu.ko CC /tmp/B.xqhum465/BUILD/lttng-modules-2.13.0/lttng-modules-2.13.0-rc2/src/probes/lttng-uprobes.mod.o LD [M] /tmp/B.xqhum465/BUILD/lttng-modules-2.13.0/lttng-modules-2.13.0-rc2/src/probes/lttng-probe-kvm-x86.ko LD [M] /tmp/B.xqhum465/BUILD/lttng-modules-2.13.0/lttng-modules-2.13.0-rc2/src/probes/lttng-probe-kvm.ko LD [M] /tmp/B.xqhum465/BUILD/lttng-modules-2.13.0/lttng-modules-2.13.0-rc2/src/probes/lttng-probe-module.ko LD [M] /tmp/B.xqhum465/BUILD/lttng-modules-2.13.0/lttng-modules-2.13.0-rc2/src/probes/lttng-probe-napi.ko CC /tmp/B.xqhum465/BUILD/lttng-modules-2.13.0/lttng-modules-2.13.0-rc2/src/probes/lttng-probe-x86-irq-vectors.mod.o LD [M] /tmp/B.xqhum465/BUILD/lttng-modules-2.13.0/lttng-modules-2.13.0-rc2/src/probes/lttng-probe-net.ko LD [M] /tmp/B.xqhum465/BUILD/lttng-modules-2.13.0/lttng-modules-2.13.0-rc2/src/probes/lttng-probe-power.ko LD [M] /tmp/B.xqhum465/BUILD/lttng-modules-2.13.0/lttng-modules-2.13.0-rc2/src/probes/lttng-probe-printk.ko LD [M] /tmp/B.xqhum465/BUILD/lttng-modules-2.13.0/lttng-modules-2.13.0-rc2/src/probes/lttng-probe-random.ko LD [M] /tmp/B.xqhum465/BUILD/lttng-modules-2.13.0/lttng-modules-2.13.0-rc2/src/probes/lttng-probe-rcu.ko LD [M] /tmp/B.xqhum465/BUILD/lttng-modules-2.13.0/lttng-modules-2.13.0-rc2/src/probes/lttng-probe-regmap.ko LD [M] /tmp/B.xqhum465/BUILD/lttng-modules-2.13.0/lttng-modules-2.13.0-rc2/src/probes/lttng-probe-regulator.ko LD [M] /tmp/B.xqhum465/BUILD/lttng-modules-2.13.0/lttng-modules-2.13.0-rc2/src/probes/lttng-probe-sched.ko LD [M] /tmp/B.xqhum465/BUILD/lttng-modules-2.13.0/lttng-modules-2.13.0-rc2/src/probes/lttng-probe-scsi.ko LD [M] /tmp/B.xqhum465/BUILD/lttng-modules-2.13.0/lttng-modules-2.13.0-rc2/src/probes/lttng-probe-signal.ko LD [M] /tmp/B.xqhum465/BUILD/lttng-modules-2.13.0/lttng-modules-2.13.0-rc2/src/probes/lttng-probe-skb.ko LD [M] /tmp/B.xqhum465/BUILD/lttng-modules-2.13.0/lttng-modules-2.13.0-rc2/src/probes/lttng-probe-sock.ko LD [M] /tmp/B.xqhum465/BUILD/lttng-modules-2.13.0/lttng-modules-2.13.0-rc2/src/probes/lttng-probe-statedump.ko LD [M] /tmp/B.xqhum465/BUILD/lttng-modules-2.13.0/lttng-modules-2.13.0-rc2/src/probes/lttng-probe-sunrpc.ko LD [M] /tmp/B.xqhum465/BUILD/lttng-modules-2.13.0/lttng-modules-2.13.0-rc2/src/probes/lttng-probe-timer.ko LD [M] /tmp/B.xqhum465/BUILD/lttng-modules-2.13.0/lttng-modules-2.13.0-rc2/src/probes/lttng-probe-udp.ko LD [M] /tmp/B.xqhum465/BUILD/lttng-modules-2.13.0/lttng-modules-2.13.0-rc2/src/probes/lttng-probe-vmscan.ko LD [M] /tmp/B.xqhum465/BUILD/lttng-modules-2.13.0/lttng-modules-2.13.0-rc2/src/probes/lttng-probe-v4l2.ko LD [M] /tmp/B.xqhum465/BUILD/lttng-modules-2.13.0/lttng-modules-2.13.0-rc2/src/probes/lttng-probe-workqueue.ko CC /tmp/B.xqhum465/BUILD/lttng-modules-2.13.0/lttng-modules-2.13.0-rc2/src/tests/lttng-clock-plugin-test.mod.o LD [M] /tmp/B.xqhum465/BUILD/lttng-modules-2.13.0/lttng-modules-2.13.0-rc2/src/probes/lttng-probe-writeback.ko LD [M] /tmp/B.xqhum465/BUILD/lttng-modules-2.13.0/lttng-modules-2.13.0-rc2/src/probes/lttng-probe-x86-exceptions.ko CC /tmp/B.xqhum465/BUILD/lttng-modules-2.13.0/lttng-modules-2.13.0-rc2/src/tests/lttng-test.mod.o LD [M] /tmp/B.xqhum465/BUILD/lttng-modules-2.13.0/lttng-modules-2.13.0-rc2/src/probes/lttng-uprobes.ko LD [M] /tmp/B.xqhum465/BUILD/lttng-modules-2.13.0/lttng-modules-2.13.0-rc2/src/tests/lttng-clock-plugin-test.ko LD [M] /tmp/B.xqhum465/BUILD/lttng-modules-2.13.0/lttng-modules-2.13.0-rc2/src/probes/lttng-probe-x86-irq-vectors.ko LD [M] /tmp/B.xqhum465/BUILD/lttng-modules-2.13.0/lttng-modules-2.13.0-rc2/src/tests/lttng-test.ko + pwd + p=/tmp/B.xqhum465/BUILD/lttng-modules-2.13.0/lttng-modules-2.13.0-rc2 + /usr/bin/make -Otarget -j9 modules_install 'INSTALL_MOD_PATH=/tmp/B.xqhum465/BUILD/lttng-modules-2.13.0/lttng-modules-2.13.0-rc2/../installed' 'INSTALL_MOD_DIR=kernel/lttng' 'KERNELDIR=/usr/src/linux-4.14' /usr/bin/make -C /usr/src/linux-4.14 M=/tmp/B.xqhum465/BUILD/lttng-modules-2.13.0/lttng-modules-2.13.0-rc2/src \ CONFIG_LTTNG=m CONFIG_LTTNG_CLOCK_PLUGIN_TEST=m \ KCPPFLAGS='' \ modules_install INSTALL /tmp/B.xqhum465/BUILD/lttng-modules-2.13.0/lttng-modules-2.13.0-rc2/src/lttng-clock.ko INSTALL /tmp/B.xqhum465/BUILD/lttng-modules-2.13.0/lttng-modules-2.13.0-rc2/src/lib/lttng-counter.ko INSTALL /tmp/B.xqhum465/BUILD/lttng-modules-2.13.0/lttng-modules-2.13.0-rc2/src/lttng-counter-client-percpu-32-modular.ko INSTALL /tmp/B.xqhum465/BUILD/lttng-modules-2.13.0/lttng-modules-2.13.0-rc2/src/lttng-counter-client-percpu-64-modular.ko INSTALL /tmp/B.xqhum465/BUILD/lttng-modules-2.13.0/lttng-modules-2.13.0-rc2/src/lttng-ring-buffer-client-discard.ko INSTALL /tmp/B.xqhum465/BUILD/lttng-modules-2.13.0/lttng-modules-2.13.0-rc2/src/lttng-ring-buffer-client-overwrite.ko INSTALL /tmp/B.xqhum465/BUILD/lttng-modules-2.13.0/lttng-modules-2.13.0-rc2/src/lttng-ring-buffer-client-mmap-discard.ko INSTALL /tmp/B.xqhum465/BUILD/lttng-modules-2.13.0/lttng-modules-2.13.0-rc2/src/lttng-ring-buffer-client-mmap-overwrite.ko INSTALL /tmp/B.xqhum465/BUILD/lttng-modules-2.13.0/lttng-modules-2.13.0-rc2/src/lttng-ring-buffer-event-notifier-client.ko INSTALL /tmp/B.xqhum465/BUILD/lttng-modules-2.13.0/lttng-modules-2.13.0-rc2/src/lttng-ring-buffer-metadata-mmap-client.ko INSTALL /tmp/B.xqhum465/BUILD/lttng-modules-2.13.0/lttng-modules-2.13.0-rc2/src/lttng-statedump.ko INSTALL /tmp/B.xqhum465/BUILD/lttng-modules-2.13.0/lttng-modules-2.13.0-rc2/src/lttng-ring-buffer-metadata-client.ko INSTALL /tmp/B.xqhum465/BUILD/lttng-modules-2.13.0/lttng-modules-2.13.0-rc2/src/lttng-wrapper.ko INSTALL /tmp/B.xqhum465/BUILD/lttng-modules-2.13.0/lttng-modules-2.13.0-rc2/src/probes/lttng-kprobes.ko INSTALL /tmp/B.xqhum465/BUILD/lttng-modules-2.13.0/lttng-modules-2.13.0-rc2/src/probes/lttng-kretprobes.ko INSTALL /tmp/B.xqhum465/BUILD/lttng-modules-2.13.0/lttng-modules-2.13.0-rc2/src/probes/lttng-probe-9p.ko INSTALL /tmp/B.xqhum465/BUILD/lttng-modules-2.13.0/lttng-modules-2.13.0-rc2/src/probes/lttng-probe-compaction.ko INSTALL /tmp/B.xqhum465/BUILD/lttng-modules-2.13.0/lttng-modules-2.13.0-rc2/src/probes/lttng-probe-asoc.ko INSTALL /tmp/B.xqhum465/BUILD/lttng-modules-2.13.0/lttng-modules-2.13.0-rc2/src/probes/lttng-probe-i2c.ko INSTALL /tmp/B.xqhum465/BUILD/lttng-modules-2.13.0/lttng-modules-2.13.0-rc2/src/probes/lttng-probe-gpio.ko INSTALL /tmp/B.xqhum465/BUILD/lttng-modules-2.13.0/lttng-modules-2.13.0-rc2/src/lib/lttng-lib-ring-buffer.ko INSTALL /tmp/B.xqhum465/BUILD/lttng-modules-2.13.0/lttng-modules-2.13.0-rc2/src/probes/lttng-probe-block.ko INSTALL /tmp/B.xqhum465/BUILD/lttng-modules-2.13.0/lttng-modules-2.13.0-rc2/src/probes/lttng-probe-irq.ko INSTALL /tmp/B.xqhum465/BUILD/lttng-modules-2.13.0/lttng-modules-2.13.0-rc2/src/probes/lttng-probe-jbd2.ko INSTALL /tmp/B.xqhum465/BUILD/lttng-modules-2.13.0/lttng-modules-2.13.0-rc2/src/probes/lttng-probe-kmem.ko INSTALL /tmp/B.xqhum465/BUILD/lttng-modules-2.13.0/lttng-modules-2.13.0-rc2/src/probes/lttng-probe-btrfs.ko INSTALL /tmp/B.xqhum465/BUILD/lttng-modules-2.13.0/lttng-modules-2.13.0-rc2/src/probes/lttng-probe-napi.ko INSTALL /tmp/B.xqhum465/BUILD/lttng-modules-2.13.0/lttng-modules-2.13.0-rc2/src/probes/lttng-probe-kvm-x86-mmu.ko INSTALL /tmp/B.xqhum465/BUILD/lttng-modules-2.13.0/lttng-modules-2.13.0-rc2/src/probes/lttng-probe-module.ko INSTALL /tmp/B.xqhum465/BUILD/lttng-modules-2.13.0/lttng-modules-2.13.0-rc2/src/probes/lttng-probe-net.ko INSTALL /tmp/B.xqhum465/BUILD/lttng-modules-2.13.0/lttng-modules-2.13.0-rc2/src/probes/lttng-probe-kvm.ko INSTALL /tmp/B.xqhum465/BUILD/lttng-modules-2.13.0/lttng-modules-2.13.0-rc2/src/probes/lttng-probe-printk.ko INSTALL /tmp/B.xqhum465/BUILD/lttng-modules-2.13.0/lttng-modules-2.13.0-rc2/src/probes/lttng-probe-power.ko INSTALL /tmp/B.xqhum465/BUILD/lttng-modules-2.13.0/lttng-modules-2.13.0-rc2/src/probes/lttng-probe-rcu.ko INSTALL /tmp/B.xqhum465/BUILD/lttng-modules-2.13.0/lttng-modules-2.13.0-rc2/src/probes/lttng-probe-kvm-x86.ko INSTALL /tmp/B.xqhum465/BUILD/lttng-modules-2.13.0/lttng-modules-2.13.0-rc2/src/probes/lttng-probe-random.ko INSTALL /tmp/B.xqhum465/BUILD/lttng-modules-2.13.0/lttng-modules-2.13.0-rc2/src/probes/lttng-probe-regulator.ko INSTALL /tmp/B.xqhum465/BUILD/lttng-modules-2.13.0/lttng-modules-2.13.0-rc2/src/probes/lttng-probe-regmap.ko INSTALL /tmp/B.xqhum465/BUILD/lttng-modules-2.13.0/lttng-modules-2.13.0-rc2/src/probes/lttng-probe-signal.ko INSTALL /tmp/B.xqhum465/BUILD/lttng-modules-2.13.0/lttng-modules-2.13.0-rc2/src/probes/lttng-probe-scsi.ko INSTALL /tmp/B.xqhum465/BUILD/lttng-modules-2.13.0/lttng-modules-2.13.0-rc2/src/probes/lttng-probe-sched.ko INSTALL /tmp/B.xqhum465/BUILD/lttng-modules-2.13.0/lttng-modules-2.13.0-rc2/src/probes/lttng-probe-sock.ko INSTALL /tmp/B.xqhum465/BUILD/lttng-modules-2.13.0/lttng-modules-2.13.0-rc2/src/probes/lttng-probe-skb.ko INSTALL /tmp/B.xqhum465/BUILD/lttng-modules-2.13.0/lttng-modules-2.13.0-rc2/src/probes/lttng-probe-udp.ko INSTALL /tmp/B.xqhum465/BUILD/lttng-modules-2.13.0/lttng-modules-2.13.0-rc2/src/probes/lttng-probe-v4l2.ko INSTALL /tmp/B.xqhum465/BUILD/lttng-modules-2.13.0/lttng-modules-2.13.0-rc2/src/probes/lttng-probe-sunrpc.ko INSTALL /tmp/B.xqhum465/BUILD/lttng-modules-2.13.0/lttng-modules-2.13.0-rc2/src/probes/lttng-probe-timer.ko INSTALL /tmp/B.xqhum465/BUILD/lttng-modules-2.13.0/lttng-modules-2.13.0-rc2/src/probes/lttng-probe-ext4.ko INSTALL /tmp/B.xqhum465/BUILD/lttng-modules-2.13.0/lttng-modules-2.13.0-rc2/src/probes/lttng-probe-x86-exceptions.ko INSTALL /tmp/B.xqhum465/BUILD/lttng-modules-2.13.0/lttng-modules-2.13.0-rc2/src/probes/lttng-probe-vmscan.ko INSTALL /tmp/B.xqhum465/BUILD/lttng-modules-2.13.0/lttng-modules-2.13.0-rc2/src/probes/lttng-probe-statedump.ko INSTALL /tmp/B.xqhum465/BUILD/lttng-modules-2.13.0/lttng-modules-2.13.0-rc2/src/probes/lttng-probe-workqueue.ko INSTALL /tmp/B.xqhum465/BUILD/lttng-modules-2.13.0/lttng-modules-2.13.0-rc2/src/probes/lttng-probe-x86-irq-vectors.ko INSTALL /tmp/B.xqhum465/BUILD/lttng-modules-2.13.0/lttng-modules-2.13.0-rc2/src/tests/lttng-clock-plugin-test.ko INSTALL /tmp/B.xqhum465/BUILD/lttng-modules-2.13.0/lttng-modules-2.13.0-rc2/src/probes/lttng-uprobes.ko INSTALL /tmp/B.xqhum465/BUILD/lttng-modules-2.13.0/lttng-modules-2.13.0-rc2/src/tests/lttng-test.ko INSTALL /tmp/B.xqhum465/BUILD/lttng-modules-2.13.0/lttng-modules-2.13.0-rc2/src/probes/lttng-probe-writeback.ko INSTALL /tmp/B.xqhum465/BUILD/lttng-modules-2.13.0/lttng-modules-2.13.0-rc2/src/lttng-tracer.ko make[1]: Entering directory '/usr/src/linux-4.14-4.14.246' DEPMOD 4.14.246-1 make[1]: Leaving directory '/usr/src/linux-4.14-4.14.246' + /usr/bin/make -Otarget -j9 clean 'KERNELDIR=/usr/src/linux' /usr/bin/make -C /usr/src/linux M=/tmp/B.xqhum465/BUILD/lttng-modules-2.13.0/lttng-modules-2.13.0-rc2/src clean make[1]: Entering directory '/usr/src/linux-5.14.1' CLEAN /tmp/B.xqhum465/BUILD/lttng-modules-2.13.0/lttng-modules-2.13.0-rc2/src/Module.symvers make[1]: Leaving directory '/usr/src/linux-5.14.1' + /usr/bin/make -Otarget -j9 'KERNELDIR=/usr/src/linux' /usr/bin/make -C /usr/src/linux M=/tmp/B.xqhum465/BUILD/lttng-modules-2.13.0/lttng-modules-2.13.0-rc2/src \ CONFIG_LTTNG=m CONFIG_LTTNG_CLOCK_PLUGIN_TEST=m \ KCPPFLAGS='' \ modules CC [M] /tmp/B.xqhum465/BUILD/lttng-modules-2.13.0/lttng-modules-2.13.0-rc2/src/lttng-ring-buffer-metadata-client.o CC [M] /tmp/B.xqhum465/BUILD/lttng-modules-2.13.0/lttng-modules-2.13.0-rc2/src/lttng-ring-buffer-metadata-mmap-client.o CC [M] /tmp/B.xqhum465/BUILD/lttng-modules-2.13.0/lttng-modules-2.13.0-rc2/src/tests/probes/lttng-test.o CC [M] /tmp/B.xqhum465/BUILD/lttng-modules-2.13.0/lttng-modules-2.13.0-rc2/src/lttng-ring-buffer-client-overwrite.o CC [M] /tmp/B.xqhum465/BUILD/lttng-modules-2.13.0/lttng-modules-2.13.0-rc2/src/lttng-ring-buffer-client-mmap-overwrite.o CC [M] /tmp/B.xqhum465/BUILD/lttng-modules-2.13.0/lttng-modules-2.13.0-rc2/src/lttng-ring-buffer-client-mmap-discard.o CC [M] /tmp/B.xqhum465/BUILD/lttng-modules-2.13.0/lttng-modules-2.13.0-rc2/src/lttng-ring-buffer-client-discard.o LD [M] /tmp/B.xqhum465/BUILD/lttng-modules-2.13.0/lttng-modules-2.13.0-rc2/src/tests/lttng-test.o CC [M] /tmp/B.xqhum465/BUILD/lttng-modules-2.13.0/lttng-modules-2.13.0-rc2/src/lib/ringbuffer/ring_buffer_backend.o CC [M] /tmp/B.xqhum465/BUILD/lttng-modules-2.13.0/lttng-modules-2.13.0-rc2/src/lttng-counter-client-percpu-32-modular.o CC [M] /tmp/B.xqhum465/BUILD/lttng-modules-2.13.0/lttng-modules-2.13.0-rc2/src/tests/clock-plugin/lttng-clock-plugin-test.o LD [M] /tmp/B.xqhum465/BUILD/lttng-modules-2.13.0/lttng-modules-2.13.0-rc2/src/tests/lttng-clock-plugin-test.o CC [M] /tmp/B.xqhum465/BUILD/lttng-modules-2.13.0/lttng-modules-2.13.0-rc2/src/probes/lttng-probe-sched.o CC [M] /tmp/B.xqhum465/BUILD/lttng-modules-2.13.0/lttng-modules-2.13.0-rc2/src/lttng-ring-buffer-event-notifier-client.o CC [M] /tmp/B.xqhum465/BUILD/lttng-modules-2.13.0/lttng-modules-2.13.0-rc2/src/lttng-counter-client-percpu-64-modular.o CC [M] /tmp/B.xqhum465/BUILD/lttng-modules-2.13.0/lttng-modules-2.13.0-rc2/src/lib/msgpack/msgpack.o CC [M] /tmp/B.xqhum465/BUILD/lttng-modules-2.13.0/lttng-modules-2.13.0-rc2/src/lib/ringbuffer/ring_buffer_iterator.o CC [M] /tmp/B.xqhum465/BUILD/lttng-modules-2.13.0/lttng-modules-2.13.0-rc2/src/lib/ringbuffer/ring_buffer_vfs.o CC [M] /tmp/B.xqhum465/BUILD/lttng-modules-2.13.0/lttng-modules-2.13.0-rc2/src/lib/ringbuffer/ring_buffer_splice.o CC [M] /tmp/B.xqhum465/BUILD/lttng-modules-2.13.0/lttng-modules-2.13.0-rc2/src/lttng-clock.o CC [M] /tmp/B.xqhum465/BUILD/lttng-modules-2.13.0/lttng-modules-2.13.0-rc2/src/lib/ringbuffer/ring_buffer_frontend.o CC [M] /tmp/B.xqhum465/BUILD/lttng-modules-2.13.0/lttng-modules-2.13.0-rc2/src/lttng-string-utils.o /tmp/B.xqhum465/BUILD/lttng-modules-2.13.0/lttng-modules-2.13.0-rc2/src/lttng-string-utils.c: In function 'strutils_star_glob_match_char_cb': /tmp/B.xqhum465/BUILD/lttng-modules-2.13.0/lttng-modules-2.13.0-rc2/src/lttng-string-utils.c:302:29: warning: this statement may fall through [-Wimplicit-fallthrough=] 302 | p = pattern_get_char_at_cb(p_at, | ^~~~~~~~~~~~~~~~~~~~~~~~~~~~ 303 | pattern_get_char_at_cb_data); | ~~~~~~~~~~~~~~~~~~~~~~~~~~~~ /tmp/B.xqhum465/BUILD/lttng-modules-2.13.0/lttng-modules-2.13.0-rc2/src/lttng-string-utils.c:306:17: note: here 306 | default: | ^~~~~~~ CC [M] /tmp/B.xqhum465/BUILD/lttng-modules-2.13.0/lttng-modules-2.13.0-rc2/src/probes/lttng-probe-irq.o CC [M] /tmp/B.xqhum465/BUILD/lttng-modules-2.13.0/lttng-modules-2.13.0-rc2/src/lib/ringbuffer/ring_buffer_mmap.o CC [M] /tmp/B.xqhum465/BUILD/lttng-modules-2.13.0/lttng-modules-2.13.0-rc2/src/lib/prio_heap/lttng_prio_heap.o CC [M] /tmp/B.xqhum465/BUILD/lttng-modules-2.13.0/lttng-modules-2.13.0-rc2/src/lttng-abi.o CC [M] /tmp/B.xqhum465/BUILD/lttng-modules-2.13.0/lttng-modules-2.13.0-rc2/src/probes/lttng-probe-timer.o CC [M] /tmp/B.xqhum465/BUILD/lttng-modules-2.13.0/lttng-modules-2.13.0-rc2/src/probes/lttng-probe-kmem.o CC [M] /tmp/B.xqhum465/BUILD/lttng-modules-2.13.0/lttng-modules-2.13.0-rc2/src/probes/lttng-probe-module.o CC [M] /tmp/B.xqhum465/BUILD/lttng-modules-2.13.0/lttng-modules-2.13.0-rc2/src/probes/lttng-probe-power.o CC [M] /tmp/B.xqhum465/BUILD/lttng-modules-2.13.0/lttng-modules-2.13.0-rc2/src/lib/../wrapper/splice.o CC [M] /tmp/B.xqhum465/BUILD/lttng-modules-2.13.0/lttng-modules-2.13.0-rc2/src/probes/lttng-probe-9p.o CC [M] /tmp/B.xqhum465/BUILD/lttng-modules-2.13.0/lttng-modules-2.13.0-rc2/src/lttng-events.o /tmp/B.xqhum465/BUILD/lttng-modules-2.13.0/lttng-modules-2.13.0-rc2/src/lttng-events.c: In function 'print_escaped_ctf_string': /tmp/B.xqhum465/BUILD/lttng-modules-2.13.0/lttng-modules-2.13.0-rc2/src/lttng-events.c:3877:28: warning: this statement may fall through [-Wimplicit-fallthrough=] 3877 | if (ret) | ^ /tmp/B.xqhum465/BUILD/lttng-modules-2.13.0/lttng-modules-2.13.0-rc2/src/lttng-events.c:3881:17: note: here 3881 | default: | ^~~~~~~ CC [M] /tmp/B.xqhum465/BUILD/lttng-modules-2.13.0/lttng-modules-2.13.0-rc2/src/probes/lttng-probe-i2c.o CC [M] /tmp/B.xqhum465/BUILD/lttng-modules-2.13.0/lttng-modules-2.13.0-rc2/src/lttng-probes.o CC [M] /tmp/B.xqhum465/BUILD/lttng-modules-2.13.0/lttng-modules-2.13.0-rc2/src/lttng-context.o CC [M] /tmp/B.xqhum465/BUILD/lttng-modules-2.13.0/lttng-modules-2.13.0-rc2/src/lib/counter/counter.o LD [M] /tmp/B.xqhum465/BUILD/lttng-modules-2.13.0/lttng-modules-2.13.0-rc2/src/lib/lttng-lib-ring-buffer.o LD [M] /tmp/B.xqhum465/BUILD/lttng-modules-2.13.0/lttng-modules-2.13.0-rc2/src/lib/lttng-counter.o CC [M] /tmp/B.xqhum465/BUILD/lttng-modules-2.13.0/lttng-modules-2.13.0-rc2/src/lttng-context-pid.o CC [M] /tmp/B.xqhum465/BUILD/lttng-modules-2.13.0/lttng-modules-2.13.0-rc2/src/probes/lttng-probe-statedump.o CC [M] /tmp/B.xqhum465/BUILD/lttng-modules-2.13.0/lttng-modules-2.13.0-rc2/src/lttng-context-procname.o CC [M] /tmp/B.xqhum465/BUILD/lttng-modules-2.13.0/lttng-modules-2.13.0-rc2/src/probes/lttng-probe-kvm.o CC [M] /tmp/B.xqhum465/BUILD/lttng-modules-2.13.0/lttng-modules-2.13.0-rc2/src/lttng-context-prio.o CC [M] /tmp/B.xqhum465/BUILD/lttng-modules-2.13.0/lttng-modules-2.13.0-rc2/src/probes/lttng-probe-x86-irq-vectors.o CC [M] /tmp/B.xqhum465/BUILD/lttng-modules-2.13.0/lttng-modules-2.13.0-rc2/src/lttng-context-nice.o CC [M] /tmp/B.xqhum465/BUILD/lttng-modules-2.13.0/lttng-modules-2.13.0-rc2/src/probes/lttng-probe-x86-exceptions.o CC [M] /tmp/B.xqhum465/BUILD/lttng-modules-2.13.0/lttng-modules-2.13.0-rc2/src/lttng-context-vpid.o CC [M] /tmp/B.xqhum465/BUILD/lttng-modules-2.13.0/lttng-modules-2.13.0-rc2/src/lttng-context-tid.o CC [M] /tmp/B.xqhum465/BUILD/lttng-modules-2.13.0/lttng-modules-2.13.0-rc2/src/lttng-context-vtid.o CC [M] /tmp/B.xqhum465/BUILD/lttng-modules-2.13.0/lttng-modules-2.13.0-rc2/src/probes/lttng-probe-kvm-x86-mmu.o CC [M] /tmp/B.xqhum465/BUILD/lttng-modules-2.13.0/lttng-modules-2.13.0-rc2/src/probes/lttng-probe-kvm-x86.o CC [M] /tmp/B.xqhum465/BUILD/lttng-modules-2.13.0/lttng-modules-2.13.0-rc2/src/lttng-context-ppid.o CC [M] /tmp/B.xqhum465/BUILD/lttng-modules-2.13.0/lttng-modules-2.13.0-rc2/src/probes/lttng-probe-signal.o CC [M] /tmp/B.xqhum465/BUILD/lttng-modules-2.13.0/lttng-modules-2.13.0-rc2/src/lttng-context-cpu-id.o CC [M] /tmp/B.xqhum465/BUILD/lttng-modules-2.13.0/lttng-modules-2.13.0-rc2/src/lttng-context-vppid.o CC [M] /tmp/B.xqhum465/BUILD/lttng-modules-2.13.0/lttng-modules-2.13.0-rc2/src/lttng-context-uid.o CC [M] /tmp/B.xqhum465/BUILD/lttng-modules-2.13.0/lttng-modules-2.13.0-rc2/src/lttng-context-euid.o CC [M] /tmp/B.xqhum465/BUILD/lttng-modules-2.13.0/lttng-modules-2.13.0-rc2/src/probes/lttng-probe-napi.o CC [M] /tmp/B.xqhum465/BUILD/lttng-modules-2.13.0/lttng-modules-2.13.0-rc2/src/lttng-context-suid.o CC [M] /tmp/B.xqhum465/BUILD/lttng-modules-2.13.0/lttng-modules-2.13.0-rc2/src/lttng-context-gid.o CC [M] /tmp/B.xqhum465/BUILD/lttng-modules-2.13.0/lttng-modules-2.13.0-rc2/src/lttng-context-egid.o CC [M] /tmp/B.xqhum465/BUILD/lttng-modules-2.13.0/lttng-modules-2.13.0-rc2/src/lttng-context-sgid.o CC [M] /tmp/B.xqhum465/BUILD/lttng-modules-2.13.0/lttng-modules-2.13.0-rc2/src/probes/lttng-probe-block.o CC [M] /tmp/B.xqhum465/BUILD/lttng-modules-2.13.0/lttng-modules-2.13.0-rc2/src/lttng-context-veuid.o CC [M] /tmp/B.xqhum465/BUILD/lttng-modules-2.13.0/lttng-modules-2.13.0-rc2/src/lttng-context-vuid.o CC [M] /tmp/B.xqhum465/BUILD/lttng-modules-2.13.0/lttng-modules-2.13.0-rc2/src/probes/lttng-probe-skb.o CC [M] /tmp/B.xqhum465/BUILD/lttng-modules-2.13.0/lttng-modules-2.13.0-rc2/src/lttng-context-vsuid.o CC [M] /tmp/B.xqhum465/BUILD/lttng-modules-2.13.0/lttng-modules-2.13.0-rc2/src/lttng-calibrate.o CC [M] /tmp/B.xqhum465/BUILD/lttng-modules-2.13.0/lttng-modules-2.13.0-rc2/src/lttng-context-vgid.o CC [M] /tmp/B.xqhum465/BUILD/lttng-modules-2.13.0/lttng-modules-2.13.0-rc2/src/lttng-context-vegid.o CC [M] /tmp/B.xqhum465/BUILD/lttng-modules-2.13.0/lttng-modules-2.13.0-rc2/src/lttng-context-vsgid.o CC [M] /tmp/B.xqhum465/BUILD/lttng-modules-2.13.0/lttng-modules-2.13.0-rc2/src/lttng-context-interruptible.o CC [M] /tmp/B.xqhum465/BUILD/lttng-modules-2.13.0/lttng-modules-2.13.0-rc2/src/probes/lttng-probe-net.o CC [M] /tmp/B.xqhum465/BUILD/lttng-modules-2.13.0/lttng-modules-2.13.0-rc2/src/lttng-context-need-reschedule.o CC [M] /tmp/B.xqhum465/BUILD/lttng-modules-2.13.0/lttng-modules-2.13.0-rc2/src/probes/lttng-probe-gpio.o CC [M] /tmp/B.xqhum465/BUILD/lttng-modules-2.13.0/lttng-modules-2.13.0-rc2/src/probes/lttng-probe-regulator.o CC [M] /tmp/B.xqhum465/BUILD/lttng-modules-2.13.0/lttng-modules-2.13.0-rc2/src/probes/lttng-probe-sock.o CC [M] /tmp/B.xqhum465/BUILD/lttng-modules-2.13.0/lttng-modules-2.13.0-rc2/src/lttng-context-hostname.o CC [M] /tmp/B.xqhum465/BUILD/lttng-modules-2.13.0/lttng-modules-2.13.0-rc2/src/probes/lttng-probe-udp.o CC [M] /tmp/B.xqhum465/BUILD/lttng-modules-2.13.0/lttng-modules-2.13.0-rc2/src/lttng-context-callstack.o CC [M] /tmp/B.xqhum465/BUILD/lttng-modules-2.13.0/lttng-modules-2.13.0-rc2/src/probes/lttng-probe-asoc.o CC [M] /tmp/B.xqhum465/BUILD/lttng-modules-2.13.0/lttng-modules-2.13.0-rc2/src/probes/lttng-probe-jbd2.o CC [M] /tmp/B.xqhum465/BUILD/lttng-modules-2.13.0/lttng-modules-2.13.0-rc2/src/probes/lttng-probe-scsi.o CC [M] /tmp/B.xqhum465/BUILD/lttng-modules-2.13.0/lttng-modules-2.13.0-rc2/src/probes/lttng-probe-compaction.o CC [M] /tmp/B.xqhum465/BUILD/lttng-modules-2.13.0/lttng-modules-2.13.0-rc2/src/probes/lttng.o CC [M] /tmp/B.xqhum465/BUILD/lttng-modules-2.13.0/lttng-modules-2.13.0-rc2/src/probes/lttng-probe-printk.o CC [M] /tmp/B.xqhum465/BUILD/lttng-modules-2.13.0/lttng-modules-2.13.0-rc2/src/lttng-tracker-id.o CC [M] /tmp/B.xqhum465/BUILD/lttng-modules-2.13.0/lttng-modules-2.13.0-rc2/src/probes/lttng-probe-rcu.o CC [M] /tmp/B.xqhum465/BUILD/lttng-modules-2.13.0/lttng-modules-2.13.0-rc2/src/probes/lttng-probe-btrfs.o In file included from /tmp/B.xqhum465/BUILD/lttng-modules-2.13.0/lttng-modules-2.13.0-rc2/src/probes/../../include/lttng/define_trace.h:87, from /tmp/B.xqhum465/BUILD/lttng-modules-2.13.0/lttng-modules-2.13.0-rc2/src/probes/../../include/instrumentation/events/btrfs.h:2484, from /tmp/B.xqhum465/BUILD/lttng-modules-2.13.0/lttng-modules-2.13.0-rc2/src/probes/lttng-probe-btrfs.c:36: /tmp/B.xqhum465/BUILD/lttng-modules-2.13.0/lttng-modules-2.13.0-rc2/src/probes/../../include/lttng/tracepoint-event-impl.h:133:6: error: conflicting types for 'trace_btrfs_writepage_end_io_hook'; have 'void(const struct page *, u64, u64, int)' {aka 'void(const struct page *, long long unsigned int, long long unsigned int, int)'} 133 | void trace_##_name(_proto); | ^~~~~~ /tmp/B.xqhum465/BUILD/lttng-modules-2.13.0/lttng-modules-2.13.0-rc2/src/probes/../../include/lttng/tracepoint-event-impl.h:45:9: note: in expansion of macro 'LTTNG_TRACEPOINT_EVENT_INSTANCE_MAP' 45 | LTTNG_TRACEPOINT_EVENT_INSTANCE_MAP(map, name, map, PARAMS(proto), PARAMS(args)) | ^~~~~~~~~~~~~~~~~~~~~~~~~~~~~~~~~~~ /tmp/B.xqhum465/BUILD/lttng-modules-2.13.0/lttng-modules-2.13.0-rc2/src/probes/../../include/lttng/tracepoint-event-impl.h:87:9: note: in expansion of macro 'LTTNG_TRACEPOINT_EVENT_MAP' 87 | LTTNG_TRACEPOINT_EVENT_MAP(name, name, \ | ^~~~~~~~~~~~~~~~~~~~~~~~~~ /tmp/B.xqhum465/BUILD/lttng-modules-2.13.0/lttng-modules-2.13.0-rc2/src/probes/../../include/instrumentation/events/btrfs.h:622:1: note: in expansion of macro 'LTTNG_TRACEPOINT_EVENT' 622 | LTTNG_TRACEPOINT_EVENT(btrfs_writepage_end_io_hook, | ^~~~~~~~~~~~~~~~~~~~~~ In file included from ./include/trace/events/btrfs.h:9, from ./include/../fs/btrfs/ctree.h:19, from /tmp/B.xqhum465/BUILD/lttng-modules-2.13.0/lttng-modules-2.13.0-rc2/src/probes/lttng-probe-btrfs.c:14: ./include/linux/tracepoint.h:245:28: note: previous definition of 'trace_btrfs_writepage_end_io_hook' with type 'void(const struct btrfs_inode *, u64, u64, int)' {aka 'void(const struct btrfs_inode *, long long unsigned int, long long unsigned int, int)'} 245 | static inline void trace_##name(proto) \ | ^~~~~~ ./include/linux/tracepoint.h:419:9: note: in expansion of macro '__DECLARE_TRACE' 419 | __DECLARE_TRACE(name, PARAMS(proto), PARAMS(args), \ | ^~~~~~~~~~~~~~~ ./include/linux/tracepoint.h:553:9: note: in expansion of macro 'DECLARE_TRACE' 553 | DECLARE_TRACE(name, PARAMS(proto), PARAMS(args)) | ^~~~~~~~~~~~~ ./include/trace/events/btrfs.h:654:1: note: in expansion of macro 'TRACE_EVENT' 654 | TRACE_EVENT(btrfs_writepage_end_io_hook, | ^~~~~~~~~~~ make[3]: *** [scripts/Makefile.build:271: /tmp/B.xqhum465/BUILD/lttng-modules-2.13.0/lttng-modules-2.13.0-rc2/src/probes/lttng-probe-btrfs.o] Error 1 make[3]: *** Waiting for unfinished jobs.... CC [M] /tmp/B.xqhum465/BUILD/lttng-modules-2.13.0/lttng-modules-2.13.0-rc2/src/probes/lttng-probe-vmscan.o CC [M] /tmp/B.xqhum465/BUILD/lttng-modules-2.13.0/lttng-modules-2.13.0-rc2/src/probes/lttng-probe-random.o CC [M] /tmp/B.xqhum465/BUILD/lttng-modules-2.13.0/lttng-modules-2.13.0-rc2/src/lttng-bytecode.o CC [M] /tmp/B.xqhum465/BUILD/lttng-modules-2.13.0/lttng-modules-2.13.0-rc2/src/probes/lttng-probe-regmap.o CC [M] /tmp/B.xqhum465/BUILD/lttng-modules-2.13.0/lttng-modules-2.13.0-rc2/src/probes/lttng-probe-v4l2.o CC [M] /tmp/B.xqhum465/BUILD/lttng-modules-2.13.0/lttng-modules-2.13.0-rc2/src/probes/lttng-probe-workqueue.o CC [M] /tmp/B.xqhum465/BUILD/lttng-modules-2.13.0/lttng-modules-2.13.0-rc2/src/lttng-tp-mempool.o CC [M] /tmp/B.xqhum465/BUILD/lttng-modules-2.13.0/lttng-modules-2.13.0-rc2/src/probes/lttng-probe-sunrpc.o CC [M] /tmp/B.xqhum465/BUILD/lttng-modules-2.13.0/lttng-modules-2.13.0-rc2/src/probes/lttng-probe-user.o CC [M] /tmp/B.xqhum465/BUILD/lttng-modules-2.13.0/lttng-modules-2.13.0-rc2/src/lttng-bytecode-specialize.o CC [M] /tmp/B.xqhum465/BUILD/lttng-modules-2.13.0/lttng-modules-2.13.0-rc2/src/lttng-bytecode-interpreter.o CC [M] /tmp/B.xqhum465/BUILD/lttng-modules-2.13.0/lttng-modules-2.13.0-rc2/src/lttng-bytecode-validator.o CC [M] /tmp/B.xqhum465/BUILD/lttng-modules-2.13.0/lttng-modules-2.13.0-rc2/src/lttng-event-notifier-notification.o CC [M] /tmp/B.xqhum465/BUILD/lttng-modules-2.13.0/lttng-modules-2.13.0-rc2/src/lttng-syscalls-enum.o CC [M] /tmp/B.xqhum465/BUILD/lttng-modules-2.13.0/lttng-modules-2.13.0-rc2/src/lttng-tracepoint.o CC [M] /tmp/B.xqhum465/BUILD/lttng-modules-2.13.0/lttng-modules-2.13.0-rc2/src/lttng-context-perf-counters.o CC [M] /tmp/B.xqhum465/BUILD/lttng-modules-2.13.0/lttng-modules-2.13.0-rc2/src/lttng-syscalls.o CC [M] /tmp/B.xqhum465/BUILD/lttng-modules-2.13.0/lttng-modules-2.13.0-rc2/src/lttng-context-ipc-ns.o CC [M] /tmp/B.xqhum465/BUILD/lttng-modules-2.13.0/lttng-modules-2.13.0-rc2/src/lttng-context-cgroup-ns.o CC [M] /tmp/B.xqhum465/BUILD/lttng-modules-2.13.0/lttng-modules-2.13.0-rc2/src/lttng-context-mnt-ns.o CC [M] /tmp/B.xqhum465/BUILD/lttng-modules-2.13.0/lttng-modules-2.13.0-rc2/src/lttng-context-pid-ns.o CC [M] /tmp/B.xqhum465/BUILD/lttng-modules-2.13.0/lttng-modules-2.13.0-rc2/src/lttng-context-net-ns.o CC [M] /tmp/B.xqhum465/BUILD/lttng-modules-2.13.0/lttng-modules-2.13.0-rc2/src/lttng-context-user-ns.o CC [M] /tmp/B.xqhum465/BUILD/lttng-modules-2.13.0/lttng-modules-2.13.0-rc2/src/lttng-context-uts-ns.o CC [M] /tmp/B.xqhum465/BUILD/lttng-modules-2.13.0/lttng-modules-2.13.0-rc2/src/wrapper/trace-clock.o CC [M] /tmp/B.xqhum465/BUILD/lttng-modules-2.13.0/lttng-modules-2.13.0-rc2/src/wrapper/random.o CC [M] /tmp/B.xqhum465/BUILD/lttng-modules-2.13.0/lttng-modules-2.13.0-rc2/src/lttng-context-time-ns.o CC [M] /tmp/B.xqhum465/BUILD/lttng-modules-2.13.0/lttng-modules-2.13.0-rc2/src/wrapper/page_alloc.o CC [M] /tmp/B.xqhum465/BUILD/lttng-modules-2.13.0/lttng-modules-2.13.0-rc2/src/wrapper/fdtable.o CC [M] /tmp/B.xqhum465/BUILD/lttng-modules-2.13.0/lttng-modules-2.13.0-rc2/src/probes/lttng-probe-ext4.o make[2]: *** [scripts/Makefile.build:514: /tmp/B.xqhum465/BUILD/lttng-modules-2.13.0/lttng-modules-2.13.0-rc2/src/probes] Error 2 make[2]: *** Waiting for unfinished jobs.... CC [M] /tmp/B.xqhum465/BUILD/lttng-modules-2.13.0/lttng-modules-2.13.0-rc2/src/lttng-wrapper-impl.o CC [M] /tmp/B.xqhum465/BUILD/lttng-modules-2.13.0/lttng-modules-2.13.0-rc2/src/wrapper/irqdesc.o CC [M] /tmp/B.xqhum465/BUILD/lttng-modules-2.13.0/lttng-modules-2.13.0-rc2/src/wrapper/kallsyms.o CC [M] /tmp/B.xqhum465/BUILD/lttng-modules-2.13.0/lttng-modules-2.13.0-rc2/src/lttng-statedump-impl.o /tmp/B.xqhum465/BUILD/lttng-modules-2.13.0/lttng-modules-2.13.0-rc2/src/lttng-statedump-impl.c: In function 'lttng_enumerate_process_states': /tmp/B.xqhum465/BUILD/lttng-modules-2.13.0/lttng-modules-2.13.0-rc2/src/lttng-statedump-impl.c:663:37: error: 'struct task_struct' has no member named 'state'; did you mean '__state'? 663 | else if (p->state == TASK_RUNNING) { | ^~~~~ | __state /tmp/B.xqhum465/BUILD/lttng-modules-2.13.0/lttng-modules-2.13.0-rc2/src/lttng-statedump-impl.c:674:39: error: 'struct task_struct' has no member named 'state'; did you mean '__state'? 674 | } else if (p->state & | ^~~~~ | __state make[2]: *** [scripts/Makefile.build:271: /tmp/B.xqhum465/BUILD/lttng-modules-2.13.0/lttng-modules-2.13.0-rc2/src/lttng-statedump-impl.o] Error 1 CC [M] /tmp/B.xqhum465/BUILD/lttng-modules-2.13.0/lttng-modules-2.13.0-rc2/src/lttng-syscalls-entry-compat-table.o CC [M] /tmp/B.xqhum465/BUILD/lttng-modules-2.13.0/lttng-modules-2.13.0-rc2/src/lttng-syscalls-entry-table.o CC [M] /tmp/B.xqhum465/BUILD/lttng-modules-2.13.0/lttng-modules-2.13.0-rc2/src/lttng-syscalls-exit-compat-table.o CC [M] /tmp/B.xqhum465/BUILD/lttng-modules-2.13.0/lttng-modules-2.13.0-rc2/src/lttng-syscalls-exit-table.o make[1]: *** [Makefile:1851: /tmp/B.xqhum465/BUILD/lttng-modules-2.13.0/lttng-modules-2.13.0-rc2/src] Error 2 make: *** [Makefile:31: modules] Error 2 error: Bad exit status from /tmp/B.xqhum465/BUILD/tmp/rpm-tmp.exPxfT (%build) RPM build errors: Could not canonicalize hostname: ymir Bad exit status from /tmp/B.xqhum465/BUILD/tmp/rpm-tmp.exPxfT (%build) ended at: Tue Sep 7 09:20:58 2021, done in 0:01:32.128644 error: No files produced. + chmod -R u+rwX /tmp/B.xqhum465/BUILD + rm -rf /tmp/B.xqhum465/tmp /tmp/B.xqhum465/BUILD + rm -rf /tmp/B.xqhum465 Begin-PLD-Builder-Info Build-Time: user:445.16s sys:57.34s real:111.74s (faults io:49 non-io:11443446) End-PLD-Builder-Info
[Back to list of logs] [View rpm -qa of builder]