FailedOk

th/SRPMS[OK]
th/x32[OK]
th/i686[OK]
th/x86_64[OK]

ac/SRPMS[OK]
ac/i386[OK]
ac/i586[OK]
ac/i686[OK]
ac/alpha[OK]
ac/amd64[OK]
ac/athlon[OK]
ac/ppc[OK]
ac/sparc[OK]
ac/sparc64[OK]

Advanced Search
main()
Powered by PLD Linux
(c) 2002-2021 PLD Team
$Revision: 1.37 $
Powered by power.
Your IP: 44.197.197.23

lttng-modules 9819ef68-44aa-43af-a696-958717b6364d

Status:Failed
Source URL:https://buildlogs.pld-linux.org/pld/th/x86_64/FAIL/lttng-modules,9819ef68-44aa-43af-a696-958717b6364d.bz2
text/plain URL:View!
full text:View!
rpm -qa of builder:View!
Date:2021/09/08 09:22:16
Runtime:0:00:45.109251

Toc:

  • error 1
  • /tmp/B.9jwwf2zx/BUILD/lttng-modules-2.13.0/lttng-modules-2.13.0-rc2/src/probes/../../include/lttng/tracepoint-event-impl.h:133:6: error: conflicting types for 'trace_btrfs_writepage_end_io_hook'; have 'void(const struct page *, u64, u64, int)' {aka 'void(const struct page *, long long unsigned int, long long unsigned int, int)'}
  • error 2
  • make[3]: *** [scripts/Makefile.build:271: /tmp/B.9jwwf2zx/BUILD/lttng-modules-2.13.0/lttng-modules-2.13.0-rc2/src/probes/lttng-probe-btrfs.o] Error 1
  • error 3
  • make[2]: *** [scripts/Makefile.build:514: /tmp/B.9jwwf2zx/BUILD/lttng-modules-2.13.0/lttng-modules-2.13.0-rc2/src/probes] Error 2
  • error 4
  • make[1]: *** [Makefile:1851: /tmp/B.9jwwf2zx/BUILD/lttng-modules-2.13.0/lttng-modules-2.13.0-rc2/src] Error 2
  • error 5
  • error: Bad exit status from /tmp/B.9jwwf2zx/BUILD/tmp/rpm-tmp.3gesJb (%build)
  • error 6
  • RPM build errors:
  • error 7
  • error: No files produced.

Content:

	modules
  CC [M]  /tmp/B.9jwwf2zx/BUILD/lttng-modules-2.13.0/lttng-modules-2.13.0-rc2/src/lttng-ring-buffer-metadata-mmap-client.o
  CC [M]  /tmp/B.9jwwf2zx/BUILD/lttng-modules-2.13.0/lttng-modules-2.13.0-rc2/src/lttng-ring-buffer-metadata-client.o
  CC [M]  /tmp/B.9jwwf2zx/BUILD/lttng-modules-2.13.0/lttng-modules-2.13.0-rc2/src/lttng-ring-buffer-client-discard.o
  CC [M]  /tmp/B.9jwwf2zx/BUILD/lttng-modules-2.13.0/lttng-modules-2.13.0-rc2/src/tests/probes/lttng-test.o
  CC [M]  /tmp/B.9jwwf2zx/BUILD/lttng-modules-2.13.0/lttng-modules-2.13.0-rc2/src/lttng-ring-buffer-client-overwrite.o
  CC [M]  /tmp/B.9jwwf2zx/BUILD/lttng-modules-2.13.0/lttng-modules-2.13.0-rc2/src/lttng-ring-buffer-client-mmap-discard.o
  LD [M]  /tmp/B.9jwwf2zx/BUILD/lttng-modules-2.13.0/lttng-modules-2.13.0-rc2/src/tests/lttng-test.o
  CC [M]  /tmp/B.9jwwf2zx/BUILD/lttng-modules-2.13.0/lttng-modules-2.13.0-rc2/src/lttng-ring-buffer-client-mmap-overwrite.o
  CC [M]  /tmp/B.9jwwf2zx/BUILD/lttng-modules-2.13.0/lttng-modules-2.13.0-rc2/src/lib/msgpack/msgpack.o
  CC [M]  /tmp/B.9jwwf2zx/BUILD/lttng-modules-2.13.0/lttng-modules-2.13.0-rc2/src/lib/ringbuffer/ring_buffer_backend.o
  CC [M]  /tmp/B.9jwwf2zx/BUILD/lttng-modules-2.13.0/lttng-modules-2.13.0-rc2/src/tests/clock-plugin/lttng-clock-plugin-test.o
  LD [M]  /tmp/B.9jwwf2zx/BUILD/lttng-modules-2.13.0/lttng-modules-2.13.0-rc2/src/tests/lttng-clock-plugin-test.o
  CC [M]  /tmp/B.9jwwf2zx/BUILD/lttng-modules-2.13.0/lttng-modules-2.13.0-rc2/src/probes/lttng-probe-irq.o
  CC [M]  /tmp/B.9jwwf2zx/BUILD/lttng-modules-2.13.0/lttng-modules-2.13.0-rc2/src/lttng-counter-client-percpu-32-modular.o
  CC [M]  /tmp/B.9jwwf2zx/BUILD/lttng-modules-2.13.0/lttng-modules-2.13.0-rc2/src/lttng-ring-buffer-event-notifier-client.o
  CC [M]  /tmp/B.9jwwf2zx/BUILD/lttng-modules-2.13.0/lttng-modules-2.13.0-rc2/src/lttng-counter-client-percpu-64-modular.o
  CC [M]  /tmp/B.9jwwf2zx/BUILD/lttng-modules-2.13.0/lttng-modules-2.13.0-rc2/src/probes/lttng-probe-sched.o
  CC [M]  /tmp/B.9jwwf2zx/BUILD/lttng-modules-2.13.0/lttng-modules-2.13.0-rc2/src/lttng-clock.o
  CC [M]  /tmp/B.9jwwf2zx/BUILD/lttng-modules-2.13.0/lttng-modules-2.13.0-rc2/src/lib/ringbuffer/ring_buffer_iterator.o
  CC [M]  /tmp/B.9jwwf2zx/BUILD/lttng-modules-2.13.0/lttng-modules-2.13.0-rc2/src/probes/lttng-probe-module.o
  CC [M]  /tmp/B.9jwwf2zx/BUILD/lttng-modules-2.13.0/lttng-modules-2.13.0-rc2/src/probes/lttng-probe-power.o
  CC [M]  /tmp/B.9jwwf2zx/BUILD/lttng-modules-2.13.0/lttng-modules-2.13.0-rc2/src/probes/lttng-probe-timer.o
  CC [M]  /tmp/B.9jwwf2zx/BUILD/lttng-modules-2.13.0/lttng-modules-2.13.0-rc2/src/lib/ringbuffer/ring_buffer_vfs.o
  CC [M]  /tmp/B.9jwwf2zx/BUILD/lttng-modules-2.13.0/lttng-modules-2.13.0-rc2/src/probes/lttng-probe-kmem.o
  CC [M]  /tmp/B.9jwwf2zx/BUILD/lttng-modules-2.13.0/lttng-modules-2.13.0-rc2/src/lib/ringbuffer/ring_buffer_splice.o
  CC [M]  /tmp/B.9jwwf2zx/BUILD/lttng-modules-2.13.0/lttng-modules-2.13.0-rc2/src/lib/ringbuffer/ring_buffer_frontend.o
  CC [M]  /tmp/B.9jwwf2zx/BUILD/lttng-modules-2.13.0/lttng-modules-2.13.0-rc2/src/lib/prio_heap/lttng_prio_heap.o
  CC [M]  /tmp/B.9jwwf2zx/BUILD/lttng-modules-2.13.0/lttng-modules-2.13.0-rc2/src/lttng-string-utils.o
/tmp/B.9jwwf2zx/BUILD/lttng-modules-2.13.0/lttng-modules-2.13.0-rc2/src/lttng-string-utils.c: In function 'strutils_star_glob_match_char_cb':
/tmp/B.9jwwf2zx/BUILD/lttng-modules-2.13.0/lttng-modules-2.13.0-rc2/src/lttng-string-utils.c:302:29: warning: this statement may fall through [-Wimplicit-fallthrough=]
  302 |                         p = pattern_get_char_at_cb(p_at,
      |                             ^~~~~~~~~~~~~~~~~~~~~~~~~~~~
  303 |                                 pattern_get_char_at_cb_data);
      |                                 ~~~~~~~~~~~~~~~~~~~~~~~~~~~~
/tmp/B.9jwwf2zx/BUILD/lttng-modules-2.13.0/lttng-modules-2.13.0-rc2/src/lttng-string-utils.c:306:17: note: here
  306 |                 default:
      |                 ^~~~~~~
  CC [M]  /tmp/B.9jwwf2zx/BUILD/lttng-modules-2.13.0/lttng-modules-2.13.0-rc2/src/lib/ringbuffer/ring_buffer_mmap.o
  CC [M]  /tmp/B.9jwwf2zx/BUILD/lttng-modules-2.13.0/lttng-modules-2.13.0-rc2/src/lib/../wrapper/splice.o
  CC [M]  /tmp/B.9jwwf2zx/BUILD/lttng-modules-2.13.0/lttng-modules-2.13.0-rc2/src/probes/lttng-probe-9p.o
  LD [M]  /tmp/B.9jwwf2zx/BUILD/lttng-modules-2.13.0/lttng-modules-2.13.0-rc2/src/lib/lttng-lib-ring-buffer.o
  CC [M]  /tmp/B.9jwwf2zx/BUILD/lttng-modules-2.13.0/lttng-modules-2.13.0-rc2/src/probes/lttng-probe-statedump.o
  CC [M]  /tmp/B.9jwwf2zx/BUILD/lttng-modules-2.13.0/lttng-modules-2.13.0-rc2/src/lttng-abi.o
  CC [M]  /tmp/B.9jwwf2zx/BUILD/lttng-modules-2.13.0/lttng-modules-2.13.0-rc2/src/probes/lttng-probe-i2c.o
  CC [M]  /tmp/B.9jwwf2zx/BUILD/lttng-modules-2.13.0/lttng-modules-2.13.0-rc2/src/lttng-probes.o
  CC [M]  /tmp/B.9jwwf2zx/BUILD/lttng-modules-2.13.0/lttng-modules-2.13.0-rc2/src/lttng-context.o
  CC [M]  /tmp/B.9jwwf2zx/BUILD/lttng-modules-2.13.0/lttng-modules-2.13.0-rc2/src/probes/lttng-probe-kvm.o
  CC [M]  /tmp/B.9jwwf2zx/BUILD/lttng-modules-2.13.0/lttng-modules-2.13.0-rc2/src/lib/counter/counter.o
  LD [M]  /tmp/B.9jwwf2zx/BUILD/lttng-modules-2.13.0/lttng-modules-2.13.0-rc2/src/lib/lttng-counter.o
  CC [M]  /tmp/B.9jwwf2zx/BUILD/lttng-modules-2.13.0/lttng-modules-2.13.0-rc2/src/lttng-context-pid.o
  CC [M]  /tmp/B.9jwwf2zx/BUILD/lttng-modules-2.13.0/lttng-modules-2.13.0-rc2/src/probes/lttng-probe-x86-irq-vectors.o
  CC [M]  /tmp/B.9jwwf2zx/BUILD/lttng-modules-2.13.0/lttng-modules-2.13.0-rc2/src/lttng-events.o
/tmp/B.9jwwf2zx/BUILD/lttng-modules-2.13.0/lttng-modules-2.13.0-rc2/src/lttng-events.c: In function 'print_escaped_ctf_string':
/tmp/B.9jwwf2zx/BUILD/lttng-modules-2.13.0/lttng-modules-2.13.0-rc2/src/lttng-events.c:3877:28: warning: this statement may fall through [-Wimplicit-fallthrough=]
 3877 |                         if (ret)
      |                            ^
/tmp/B.9jwwf2zx/BUILD/lttng-modules-2.13.0/lttng-modules-2.13.0-rc2/src/lttng-events.c:3881:17: note: here
 3881 |                 default:
      |                 ^~~~~~~
  CC [M]  /tmp/B.9jwwf2zx/BUILD/lttng-modules-2.13.0/lttng-modules-2.13.0-rc2/src/lttng-context-procname.o
  CC [M]  /tmp/B.9jwwf2zx/BUILD/lttng-modules-2.13.0/lttng-modules-2.13.0-rc2/src/lttng-context-prio.o
  CC [M]  /tmp/B.9jwwf2zx/BUILD/lttng-modules-2.13.0/lttng-modules-2.13.0-rc2/src/probes/lttng-probe-x86-exceptions.o
  CC [M]  /tmp/B.9jwwf2zx/BUILD/lttng-modules-2.13.0/lttng-modules-2.13.0-rc2/src/probes/lttng-probe-signal.o
  CC [M]  /tmp/B.9jwwf2zx/BUILD/lttng-modules-2.13.0/lttng-modules-2.13.0-rc2/src/probes/lttng-probe-kvm-x86-mmu.o
  CC [M]  /tmp/B.9jwwf2zx/BUILD/lttng-modules-2.13.0/lttng-modules-2.13.0-rc2/src/probes/lttng-probe-napi.o
  CC [M]  /tmp/B.9jwwf2zx/BUILD/lttng-modules-2.13.0/lttng-modules-2.13.0-rc2/src/lttng-context-nice.o
  CC [M]  /tmp/B.9jwwf2zx/BUILD/lttng-modules-2.13.0/lttng-modules-2.13.0-rc2/src/probes/lttng-probe-skb.o
  CC [M]  /tmp/B.9jwwf2zx/BUILD/lttng-modules-2.13.0/lttng-modules-2.13.0-rc2/src/probes/lttng-probe-sock.o
  CC [M]  /tmp/B.9jwwf2zx/BUILD/lttng-modules-2.13.0/lttng-modules-2.13.0-rc2/src/probes/lttng-probe-block.o
  CC [M]  /tmp/B.9jwwf2zx/BUILD/lttng-modules-2.13.0/lttng-modules-2.13.0-rc2/src/probes/lttng-probe-udp.o
  CC [M]  /tmp/B.9jwwf2zx/BUILD/lttng-modules-2.13.0/lttng-modules-2.13.0-rc2/src/probes/lttng-probe-kvm-x86.o
  CC [M]  /tmp/B.9jwwf2zx/BUILD/lttng-modules-2.13.0/lttng-modules-2.13.0-rc2/src/probes/lttng-probe-net.o
  CC [M]  /tmp/B.9jwwf2zx/BUILD/lttng-modules-2.13.0/lttng-modules-2.13.0-rc2/src/lttng-context-vpid.o
  CC [M]  /tmp/B.9jwwf2zx/BUILD/lttng-modules-2.13.0/lttng-modules-2.13.0-rc2/src/lttng-context-tid.o
  CC [M]  /tmp/B.9jwwf2zx/BUILD/lttng-modules-2.13.0/lttng-modules-2.13.0-rc2/src/probes/lttng-probe-asoc.o
  CC [M]  /tmp/B.9jwwf2zx/BUILD/lttng-modules-2.13.0/lttng-modules-2.13.0-rc2/src/lttng-context-vtid.o
  CC [M]  /tmp/B.9jwwf2zx/BUILD/lttng-modules-2.13.0/lttng-modules-2.13.0-rc2/src/probes/lttng-probe-gpio.o
  CC [M]  /tmp/B.9jwwf2zx/BUILD/lttng-modules-2.13.0/lttng-modules-2.13.0-rc2/src/lttng-context-cpu-id.o
  CC [M]  /tmp/B.9jwwf2zx/BUILD/lttng-modules-2.13.0/lttng-modules-2.13.0-rc2/src/probes/lttng-probe-regulator.o
  CC [M]  /tmp/B.9jwwf2zx/BUILD/lttng-modules-2.13.0/lttng-modules-2.13.0-rc2/src/lttng-context-ppid.o
  CC [M]  /tmp/B.9jwwf2zx/BUILD/lttng-modules-2.13.0/lttng-modules-2.13.0-rc2/src/probes/lttng-probe-jbd2.o
  CC [M]  /tmp/B.9jwwf2zx/BUILD/lttng-modules-2.13.0/lttng-modules-2.13.0-rc2/src/lttng-context-uid.o
  CC [M]  /tmp/B.9jwwf2zx/BUILD/lttng-modules-2.13.0/lttng-modules-2.13.0-rc2/src/lttng-context-vppid.o
  CC [M]  /tmp/B.9jwwf2zx/BUILD/lttng-modules-2.13.0/lttng-modules-2.13.0-rc2/src/lttng-context-euid.o
  CC [M]  /tmp/B.9jwwf2zx/BUILD/lttng-modules-2.13.0/lttng-modules-2.13.0-rc2/src/probes/lttng-probe-scsi.o
  CC [M]  /tmp/B.9jwwf2zx/BUILD/lttng-modules-2.13.0/lttng-modules-2.13.0-rc2/src/lttng-context-suid.o
  CC [M]  /tmp/B.9jwwf2zx/BUILD/lttng-modules-2.13.0/lttng-modules-2.13.0-rc2/src/lttng-context-egid.o
  CC [M]  /tmp/B.9jwwf2zx/BUILD/lttng-modules-2.13.0/lttng-modules-2.13.0-rc2/src/lttng-context-gid.o
  CC [M]  /tmp/B.9jwwf2zx/BUILD/lttng-modules-2.13.0/lttng-modules-2.13.0-rc2/src/lttng-context-sgid.o
  CC [M]  /tmp/B.9jwwf2zx/BUILD/lttng-modules-2.13.0/lttng-modules-2.13.0-rc2/src/lttng-context-vuid.o
  CC [M]  /tmp/B.9jwwf2zx/BUILD/lttng-modules-2.13.0/lttng-modules-2.13.0-rc2/src/lttng-context-veuid.o
  CC [M]  /tmp/B.9jwwf2zx/BUILD/lttng-modules-2.13.0/lttng-modules-2.13.0-rc2/src/lttng-context-vsuid.o
  CC [M]  /tmp/B.9jwwf2zx/BUILD/lttng-modules-2.13.0/lttng-modules-2.13.0-rc2/src/lttng-context-vgid.o
  CC [M]  /tmp/B.9jwwf2zx/BUILD/lttng-modules-2.13.0/lttng-modules-2.13.0-rc2/src/probes/lttng-probe-vmscan.o
  CC [M]  /tmp/B.9jwwf2zx/BUILD/lttng-modules-2.13.0/lttng-modules-2.13.0-rc2/src/probes/lttng-probe-btrfs.o
In file included from /tmp/B.9jwwf2zx/BUILD/lttng-modules-2.13.0/lttng-modules-2.13.0-rc2/src/probes/../../include/lttng/define_trace.h:87,
                 from /tmp/B.9jwwf2zx/BUILD/lttng-modules-2.13.0/lttng-modules-2.13.0-rc2/src/probes/../../include/instrumentation/events/btrfs.h:2484,
                 from /tmp/B.9jwwf2zx/BUILD/lttng-modules-2.13.0/lttng-modules-2.13.0-rc2/src/probes/lttng-probe-btrfs.c:36:
/tmp/B.9jwwf2zx/BUILD/lttng-modules-2.13.0/lttng-modules-2.13.0-rc2/src/probes/../../include/lttng/tracepoint-event-impl.h:133:6: error: conflicting types for 'trace_btrfs_writepage_end_io_hook'; have 'void(const struct page *, u64,  u64,  int)' {aka 'void(const struct page *, long long unsigned int,  long long unsigned int,  int)'}
  133 | void trace_##_name(_proto);
      |      ^~~~~~
/tmp/B.9jwwf2zx/BUILD/lttng-modules-2.13.0/lttng-modules-2.13.0-rc2/src/probes/../../include/lttng/tracepoint-event-impl.h:45:9: note: in expansion of macro 'LTTNG_TRACEPOINT_EVENT_INSTANCE_MAP'
   45 |         LTTNG_TRACEPOINT_EVENT_INSTANCE_MAP(map, name, map, PARAMS(proto), PARAMS(args))
      |         ^~~~~~~~~~~~~~~~~~~~~~~~~~~~~~~~~~~
/tmp/B.9jwwf2zx/BUILD/lttng-modules-2.13.0/lttng-modules-2.13.0-rc2/src/probes/../../include/lttng/tracepoint-event-impl.h:87:9: note: in expansion of macro 'LTTNG_TRACEPOINT_EVENT_MAP'
   87 |         LTTNG_TRACEPOINT_EVENT_MAP(name, name,                          \
      |         ^~~~~~~~~~~~~~~~~~~~~~~~~~
/tmp/B.9jwwf2zx/BUILD/lttng-modules-2.13.0/lttng-modules-2.13.0-rc2/src/probes/../../include/instrumentation/events/btrfs.h:622:1: note: in expansion of macro 'LTTNG_TRACEPOINT_EVENT'
  622 | LTTNG_TRACEPOINT_EVENT(btrfs_writepage_end_io_hook,
      | ^~~~~~~~~~~~~~~~~~~~~~
In file included from ./include/trace/events/btrfs.h:9,
                 from ./include/../fs/btrfs/ctree.h:19,
                 from /tmp/B.9jwwf2zx/BUILD/lttng-modules-2.13.0/lttng-modules-2.13.0-rc2/src/probes/lttng-probe-btrfs.c:14:
./include/linux/tracepoint.h:245:28: note: previous definition of 'trace_btrfs_writepage_end_io_hook' with type 'void(const struct btrfs_inode *, u64,  u64,  int)' {aka 'void(const struct btrfs_inode *, long long unsigned int,  long long unsigned int,  int)'}
  245 |         static inline void trace_##name(proto)                          \
      |                            ^~~~~~
./include/linux/tracepoint.h:419:9: note: in expansion of macro '__DECLARE_TRACE'
  419 |         __DECLARE_TRACE(name, PARAMS(proto), PARAMS(args),              \
      |         ^~~~~~~~~~~~~~~
./include/linux/tracepoint.h:553:9: note: in expansion of macro 'DECLARE_TRACE'
  553 |         DECLARE_TRACE(name, PARAMS(proto), PARAMS(args))
      |         ^~~~~~~~~~~~~
./include/trace/events/btrfs.h:654:1: note: in expansion of macro 'TRACE_EVENT'
  654 | TRACE_EVENT(btrfs_writepage_end_io_hook,
      | ^~~~~~~~~~~
make[3]: *** [scripts/Makefile.build:271: /tmp/B.9jwwf2zx/BUILD/lttng-modules-2.13.0/lttng-modules-2.13.0-rc2/src/probes/lttng-probe-btrfs.o] Error 1
make[3]: *** Waiting for unfinished jobs....
  CC [M]  /tmp/B.9jwwf2zx/BUILD/lttng-modules-2.13.0/lttng-modules-2.13.0-rc2/src/probes/lttng-probe-compaction.o
  CC [M]  /tmp/B.9jwwf2zx/BUILD/lttng-modules-2.13.0/lttng-modules-2.13.0-rc2/src/probes/lttng-probe-printk.o
  CC [M]  /tmp/B.9jwwf2zx/BUILD/lttng-modules-2.13.0/lttng-modules-2.13.0-rc2/src/lttng-context-vegid.o
  CC [M]  /tmp/B.9jwwf2zx/BUILD/lttng-modules-2.13.0/lttng-modules-2.13.0-rc2/src/lttng-context-vsgid.o
  CC [M]  /tmp/B.9jwwf2zx/BUILD/lttng-modules-2.13.0/lttng-modules-2.13.0-rc2/src/probes/lttng-probe-rcu.o
  CC [M]  /tmp/B.9jwwf2zx/BUILD/lttng-modules-2.13.0/lttng-modules-2.13.0-rc2/src/lttng-calibrate.o
  CC [M]  /tmp/B.9jwwf2zx/BUILD/lttng-modules-2.13.0/lttng-modules-2.13.0-rc2/src/lttng-context-interruptible.o
  CC [M]  /tmp/B.9jwwf2zx/BUILD/lttng-modules-2.13.0/lttng-modules-2.13.0-rc2/src/probes/lttng-probe-random.o
  CC [M]  /tmp/B.9jwwf2zx/BUILD/lttng-modules-2.13.0/lttng-modules-2.13.0-rc2/src/lttng-context-need-reschedule.o
  CC [M]  /tmp/B.9jwwf2zx/BUILD/lttng-modules-2.13.0/lttng-modules-2.13.0-rc2/src/lttng-context-hostname.o
  CC [M]  /tmp/B.9jwwf2zx/BUILD/lttng-modules-2.13.0/lttng-modules-2.13.0-rc2/src/probes/lttng.o
  CC [M]  /tmp/B.9jwwf2zx/BUILD/lttng-modules-2.13.0/lttng-modules-2.13.0-rc2/src/lttng-context-callstack.o
  CC [M]  /tmp/B.9jwwf2zx/BUILD/lttng-modules-2.13.0/lttng-modules-2.13.0-rc2/src/lttng-bytecode.o
  CC [M]  /tmp/B.9jwwf2zx/BUILD/lttng-modules-2.13.0/lttng-modules-2.13.0-rc2/src/lttng-tracker-id.o
  CC [M]  /tmp/B.9jwwf2zx/BUILD/lttng-modules-2.13.0/lttng-modules-2.13.0-rc2/src/lttng-tp-mempool.o
  CC [M]  /tmp/B.9jwwf2zx/BUILD/lttng-modules-2.13.0/lttng-modules-2.13.0-rc2/src/lttng-bytecode-specialize.o
  CC [M]  /tmp/B.9jwwf2zx/BUILD/lttng-modules-2.13.0/lttng-modules-2.13.0-rc2/src/probes/lttng-probe-user.o
  CC [M]  /tmp/B.9jwwf2zx/BUILD/lttng-modules-2.13.0/lttng-modules-2.13.0-rc2/src/lttng-bytecode-interpreter.o
  CC [M]  /tmp/B.9jwwf2zx/BUILD/lttng-modules-2.13.0/lttng-modules-2.13.0-rc2/src/lttng-bytecode-validator.o
  CC [M]  /tmp/B.9jwwf2zx/BUILD/lttng-modules-2.13.0/lttng-modules-2.13.0-rc2/src/lttng-event-notifier-notification.o
  CC [M]  /tmp/B.9jwwf2zx/BUILD/lttng-modules-2.13.0/lttng-modules-2.13.0-rc2/src/lttng-syscalls-enum.o
  CC [M]  /tmp/B.9jwwf2zx/BUILD/lttng-modules-2.13.0/lttng-modules-2.13.0-rc2/src/lttng-context-perf-counters.o
  CC [M]  /tmp/B.9jwwf2zx/BUILD/lttng-modules-2.13.0/lttng-modules-2.13.0-rc2/src/lttng-tracepoint.o
  CC [M]  /tmp/B.9jwwf2zx/BUILD/lttng-modules-2.13.0/lttng-modules-2.13.0-rc2/src/lttng-syscalls.o
  CC [M]  /tmp/B.9jwwf2zx/BUILD/lttng-modules-2.13.0/lttng-modules-2.13.0-rc2/src/lttng-context-mnt-ns.o
  CC [M]  /tmp/B.9jwwf2zx/BUILD/lttng-modules-2.13.0/lttng-modules-2.13.0-rc2/src/lttng-context-cgroup-ns.o
  CC [M]  /tmp/B.9jwwf2zx/BUILD/lttng-modules-2.13.0/lttng-modules-2.13.0-rc2/src/lttng-context-ipc-ns.o
  CC [M]  /tmp/B.9jwwf2zx/BUILD/lttng-modules-2.13.0/lttng-modules-2.13.0-rc2/src/lttng-context-net-ns.o
  CC [M]  /tmp/B.9jwwf2zx/BUILD/lttng-modules-2.13.0/lttng-modules-2.13.0-rc2/src/lttng-context-pid-ns.o
  CC [M]  /tmp/B.9jwwf2zx/BUILD/lttng-modules-2.13.0/lttng-modules-2.13.0-rc2/src/lttng-context-user-ns.o
  CC [M]  /tmp/B.9jwwf2zx/BUILD/lttng-modules-2.13.0/lttng-modules-2.13.0-rc2/src/lttng-context-uts-ns.o
  CC [M]  /tmp/B.9jwwf2zx/BUILD/lttng-modules-2.13.0/lttng-modules-2.13.0-rc2/src/wrapper/random.o
  CC [M]  /tmp/B.9jwwf2zx/BUILD/lttng-modules-2.13.0/lttng-modules-2.13.0-rc2/src/lttng-context-time-ns.o
  CC [M]  /tmp/B.9jwwf2zx/BUILD/lttng-modules-2.13.0/lttng-modules-2.13.0-rc2/src/wrapper/page_alloc.o
  CC [M]  /tmp/B.9jwwf2zx/BUILD/lttng-modules-2.13.0/lttng-modules-2.13.0-rc2/src/wrapper/trace-clock.o
  CC [M]  /tmp/B.9jwwf2zx/BUILD/lttng-modules-2.13.0/lttng-modules-2.13.0-rc2/src/probes/lttng-probe-ext4.o
make[2]: *** [scripts/Makefile.build:514: /tmp/B.9jwwf2zx/BUILD/lttng-modules-2.13.0/lttng-modules-2.13.0-rc2/src/probes] Error 2
make[2]: *** Waiting for unfinished jobs....
  CC [M]  /tmp/B.9jwwf2zx/BUILD/lttng-modules-2.13.0/lttng-modules-2.13.0-rc2/src/wrapper/fdtable.o
  CC [M]  /tmp/B.9jwwf2zx/BUILD/lttng-modules-2.13.0/lttng-modules-2.13.0-rc2/src/wrapper/irqdesc.o
  CC [M]  /tmp/B.9jwwf2zx/BUILD/lttng-modules-2.13.0/lttng-modules-2.13.0-rc2/src/lttng-wrapper-impl.o
  CC [M]  /tmp/B.9jwwf2zx/BUILD/lttng-modules-2.13.0/lttng-modules-2.13.0-rc2/src/wrapper/kallsyms.o
  CC [M]  /tmp/B.9jwwf2zx/BUILD/lttng-modules-2.13.0/lttng-modules-2.13.0-rc2/src/lttng-syscalls-entry-compat-table.o
  CC [M]  /tmp/B.9jwwf2zx/BUILD/lttng-modules-2.13.0/lttng-modules-2.13.0-rc2/src/lttng-syscalls-entry-table.o
  CC [M]  /tmp/B.9jwwf2zx/BUILD/lttng-modules-2.13.0/lttng-modules-2.13.0-rc2/src/lttng-syscalls-exit-compat-table.o
  CC [M]  /tmp/B.9jwwf2zx/BUILD/lttng-modules-2.13.0/lttng-modules-2.13.0-rc2/src/lttng-syscalls-exit-table.o
make[1]: *** [Makefile:1851: /tmp/B.9jwwf2zx/BUILD/lttng-modules-2.13.0/lttng-modules-2.13.0-rc2/src] Error 2
make: *** [Makefile:31: modules] Error 2
error: Bad exit status from /tmp/B.9jwwf2zx/BUILD/tmp/rpm-tmp.3gesJb (%build)


RPM build errors:
    Could not canonicalize hostname: ymir
    Bad exit status from /tmp/B.9jwwf2zx/BUILD/tmp/rpm-tmp.3gesJb (%build)
ended at: Wed Sep  8 09:22:15 2021, done in 0:00:45.109251
error: No files produced.
+ chmod -R u+rwX /tmp/B.9jwwf2zx/BUILD
+ rm -rf /tmp/B.9jwwf2zx/tmp /tmp/B.9jwwf2zx/BUILD
+ rm -rf /tmp/B.9jwwf2zx
Begin-PLD-Builder-Info
Build-Time: user:217.94s sys:28.86s real:64.69s (faults io:21 non-io:5152121)

End-PLD-Builder-Info
[Back to list of logs] [View rpm -qa of builder]