FailedOk

th/SRPMS[OK]
th/x32[OK]
th/i686[OK]
th/x86_64[OK]

ac/SRPMS[OK]
ac/i386[OK]
ac/i586[OK]
ac/i686[OK]
ac/alpha[OK]
ac/amd64[OK]
ac/athlon[OK]
ac/ppc[OK]
ac/sparc[OK]
ac/sparc64[OK]

Advanced Search
main()
Powered by PLD Linux
(c) 2002-2024 PLD Team
$Revision: 1.37 $
Powered by Leppe'.
Your IP: 44.213.60.33

lttng-modules ba7a5843-1d6f-49a7-bab4-b67a489cd545

Status:Failed
Source URL:https://buildlogs.pld-linux.org/pld/th/x86_64/FAIL/lttng-modules,ba7a5843-1d6f-49a7-bab4-b67a489cd545.bz2
text/plain URL:View!
full text:View!
rpm -qa of builder:View!
Date:2024/05/29 01:45:55
Runtime:0:00:32.261701

Toc:

  • error 1
  • /tmp/B.24bz_hbl/BUILD/lttng-modules-2.13.12/lttng-modules-2.13.12/src/lttng-statedump-impl.c:400:20: error: 'dev_base_lock' undeclared (first use in this function); did you mean 'device_lock'?
  • error 2
  • make[3]: *** [scripts/Makefile.build:244: /tmp/B.24bz_hbl/BUILD/lttng-modules-2.13.12/lttng-modules-2.13.12/src/lttng-statedump-impl.o] Error 1
  • error 3
  • /tmp/B.24bz_hbl/BUILD/lttng-modules-2.13.12/lttng-modules-2.13.12/src/probes/../../include/lttng/tracepoint-event-impl.h:133:6: error: conflicting types for 'trace_snd_soc_bias_level_start'; have 'void(struct snd_soc_card *, int)'
  • error 4
  • /tmp/B.24bz_hbl/BUILD/lttng-modules-2.13.12/lttng-modules-2.13.12/src/probes/../../include/lttng/tracepoint-event-impl.h:133:6: error: conflicting types for 'trace_snd_soc_bias_level_done'; have 'void(struct snd_soc_card *, int)'
  • error 5
  • /tmp/B.24bz_hbl/BUILD/lttng-modules-2.13.12/lttng-modules-2.13.12/src/probes/../../include/lttng/tracepoint-event-impl.h:133:6: error: conflicting types for 'trace_snd_soc_dapm_start'; have 'void(struct snd_soc_card *)'
  • error 6
  • /tmp/B.24bz_hbl/BUILD/lttng-modules-2.13.12/lttng-modules-2.13.12/src/probes/../../include/lttng/tracepoint-event-impl.h:133:6: error: conflicting types for 'trace_snd_soc_dapm_done'; have 'void(struct snd_soc_card *)'
  • error 7
  • make[4]: *** [scripts/Makefile.build:244: /tmp/B.24bz_hbl/BUILD/lttng-modules-2.13.12/lttng-modules-2.13.12/src/probes/lttng-probe-asoc.o] Error 1
  • error 8
  • /tmp/B.24bz_hbl/BUILD/lttng-modules-2.13.12/lttng-modules-2.13.12/src/probes/../../include/lttng/tracepoint-event-impl.h:133:6: error: conflicting types for 'trace_mm_compaction_migratepages'; have 'void(struct compact_control *, unsigned int)'
  • error 9
  • make[4]: *** [scripts/Makefile.build:244: /tmp/B.24bz_hbl/BUILD/lttng-modules-2.13.12/lttng-modules-2.13.12/src/probes/lttng-probe-compaction.o] Error 1
  • error 10
  • make[3]: *** [scripts/Makefile.build:485: /tmp/B.24bz_hbl/BUILD/lttng-modules-2.13.12/lttng-modules-2.13.12/src/probes] Error 2
  • error 11
  • make[2]: *** [/usr/src/linux-6.9.2/Makefile:1919: /tmp/B.24bz_hbl/BUILD/lttng-modules-2.13.12/lttng-modules-2.13.12/src] Error 2
  • error 12
  • make[1]: *** [Makefile:240: __sub-make] Error 2
  • error 13
  • error: Bad exit status from /tmp/B.24bz_hbl/BUILD/tmp/rpm-tmp.7MR4dO (%build)
  • error 14
  • RPM build errors:
  • error 15
  • error: No files produced.

Content:

  CC [M]  /tmp/B.24bz_hbl/BUILD/lttng-modules-2.13.12/lttng-modules-2.13.12/src/lttng-context-vppid.o
  CC [M]  /tmp/B.24bz_hbl/BUILD/lttng-modules-2.13.12/lttng-modules-2.13.12/src/lttng-context-ppid.o
  CC [M]  /tmp/B.24bz_hbl/BUILD/lttng-modules-2.13.12/lttng-modules-2.13.12/src/lttng-ring-buffer-client-overwrite.o
  CC [M]  /tmp/B.24bz_hbl/BUILD/lttng-modules-2.13.12/lttng-modules-2.13.12/src/lttng-ring-buffer-client-mmap-overwrite.o
  CC [M]  /tmp/B.24bz_hbl/BUILD/lttng-modules-2.13.12/lttng-modules-2.13.12/src/lttng-calibrate.o
/tmp/B.24bz_hbl/BUILD/lttng-modules-2.13.12/lttng-modules-2.13.12/src/lttng-calibrate.c:14:6: warning: no previous prototype for 'lttng_calibrate_kretprobe' [-Wmissing-prototypes]
   14 | void lttng_calibrate_kretprobe(void)
      |      ^~~~~~~~~~~~~~~~~~~~~~~~~
/tmp/B.24bz_hbl/BUILD/lttng-modules-2.13.12/lttng-modules-2.13.12/src/lttng-calibrate.c:19:5: warning: no previous prototype for 'lttng_calibrate' [-Wmissing-prototypes]
   19 | int lttng_calibrate(struct lttng_kernel_abi_calibrate *calibrate)
      |     ^~~~~~~~~~~~~~~
  CC [M]  /tmp/B.24bz_hbl/BUILD/lttng-modules-2.13.12/lttng-modules-2.13.12/src/lttng-context-egid.o
  CC [M]  /tmp/B.24bz_hbl/BUILD/lttng-modules-2.13.12/lttng-modules-2.13.12/src/lttng-context-gid.o
  CC [M]  /tmp/B.24bz_hbl/BUILD/lttng-modules-2.13.12/lttng-modules-2.13.12/src/lttng-tp-mempool.o
  CC [M]  /tmp/B.24bz_hbl/BUILD/lttng-modules-2.13.12/lttng-modules-2.13.12/src/lttng-context-veuid.o
  CC [M]  /tmp/B.24bz_hbl/BUILD/lttng-modules-2.13.12/lttng-modules-2.13.12/src/probes/lttng.o
/tmp/B.24bz_hbl/BUILD/lttng-modules-2.13.12/lttng-modules-2.13.12/src/probes/lttng.c:118:12: warning: no previous prototype for 'lttng_logger_init' [-Wmissing-prototypes]
  118 | int __init lttng_logger_init(void)
      |            ^~~~~~~~~~~~~~~~~
/tmp/B.24bz_hbl/BUILD/lttng-modules-2.13.12/lttng-modules-2.13.12/src/probes/lttng.c:155:6: warning: no previous prototype for 'lttng_logger_exit' [-Wmissing-prototypes]
  155 | void lttng_logger_exit(void)
      |      ^~~~~~~~~~~~~~~~~
  CC [M]  /tmp/B.24bz_hbl/BUILD/lttng-modules-2.13.12/lttng-modules-2.13.12/src/lttng-context-vsuid.o
  CC [M]  /tmp/B.24bz_hbl/BUILD/lttng-modules-2.13.12/lttng-modules-2.13.12/src/lttng-context-vegid.o
  CC [M]  /tmp/B.24bz_hbl/BUILD/lttng-modules-2.13.12/lttng-modules-2.13.12/src/lttng-context-interruptible.o
  CC [M]  /tmp/B.24bz_hbl/BUILD/lttng-modules-2.13.12/lttng-modules-2.13.12/src/lttng-context-vsgid.o
  CC [M]  /tmp/B.24bz_hbl/BUILD/lttng-modules-2.13.12/lttng-modules-2.13.12/src/lttng-context-vuid.o
  CC [M]  /tmp/B.24bz_hbl/BUILD/lttng-modules-2.13.12/lttng-modules-2.13.12/src/lttng-context-sgid.o
  CC [M]  /tmp/B.24bz_hbl/BUILD/lttng-modules-2.13.12/lttng-modules-2.13.12/src/lttng-context-hostname.o
  CC [M]  /tmp/B.24bz_hbl/BUILD/lttng-modules-2.13.12/lttng-modules-2.13.12/src/lttng-context-vgid.o
  CC [M]  /tmp/B.24bz_hbl/BUILD/lttng-modules-2.13.12/lttng-modules-2.13.12/src/probes/lttng-probe-user.o
  CC [M]  /tmp/B.24bz_hbl/BUILD/lttng-modules-2.13.12/lttng-modules-2.13.12/src/lttng-context-need-reschedule.o
  CC [M]  /tmp/B.24bz_hbl/BUILD/lttng-modules-2.13.12/lttng-modules-2.13.12/src/lttng-bytecode.o
/tmp/B.24bz_hbl/BUILD/lttng-modules-2.13.12/lttng-modules-2.13.12/src/lttng-bytecode.c:602:5: warning: no previous prototype for 'lttng_filter_enabler_attach_bytecode' [-Wmissing-prototypes]
  602 | int lttng_filter_enabler_attach_bytecode(struct lttng_enabler *enabler,
      |     ^~~~~~~~~~~~~~~~~~~~~~~~~~~~~~~~~~~~
/tmp/B.24bz_hbl/BUILD/lttng-modules-2.13.12/lttng-modules-2.13.12/src/lttng-bytecode.c:609:6: warning: no previous prototype for 'lttng_free_enabler_filter_bytecode' [-Wmissing-prototypes]
  609 | void lttng_free_enabler_filter_bytecode(struct lttng_enabler *enabler)
      |      ^~~~~~~~~~~~~~~~~~~~~~~~~~~~~~~~~~
  CC [M]  /tmp/B.24bz_hbl/BUILD/lttng-modules-2.13.12/lttng-modules-2.13.12/src/lttng-event-notifier-notification.o
/tmp/B.24bz_hbl/BUILD/lttng-modules-2.13.12/lttng-modules-2.13.12/src/lttng-event-notifier-notification.c:249:5: warning: no previous prototype for 'capture_sequence' [-Wmissing-prototypes]
  249 | int capture_sequence(struct lttng_msgpack_writer *writer,
      |     ^~~~~~~~~~~~~~~~
  CC [M]  /tmp/B.24bz_hbl/BUILD/lttng-modules-2.13.12/lttng-modules-2.13.12/src/lttng-context-callstack.o
/tmp/B.24bz_hbl/BUILD/lttng-modules-2.13.12/lttng-modules-2.13.12/src/lttng-context-callstack.c:123:41: warning: no previous prototype for 'lttng_cs_event_fields' [-Wmissing-prototypes]
  123 | const struct lttng_kernel_event_field **lttng_cs_event_fields(enum lttng_cs_ctx_modes mode)
      |                                         ^~~~~~~~~~~~~~~~~~~~~
  CC [M]  /tmp/B.24bz_hbl/BUILD/lttng-modules-2.13.12/lttng-modules-2.13.12/src/lttng-tracker-id.o
  CC [M]  /tmp/B.24bz_hbl/BUILD/lttng-modules-2.13.12/lttng-modules-2.13.12/src/lttng-bytecode-specialize.o
  CC [M]  /tmp/B.24bz_hbl/BUILD/lttng-modules-2.13.12/lttng-modules-2.13.12/src/lttng-bytecode-validator.o
  CC [M]  /tmp/B.24bz_hbl/BUILD/lttng-modules-2.13.12/lttng-modules-2.13.12/src/lttng-events.o
/tmp/B.24bz_hbl/BUILD/lttng-modules-2.13.12/lttng-modules-2.13.12/src/lttng-events.c:1720:33: warning: no previous prototype for 'get_tracker' [-Wmissing-prototypes]
 1720 | struct lttng_kernel_id_tracker *get_tracker(struct lttng_kernel_session *session,
      |                                 ^~~~~~~~~~~
/tmp/B.24bz_hbl/BUILD/lttng-modules-2.13.12/lttng-modules-2.13.12/src/lttng-events.c:3030:5: warning: no previous prototype for 'lttng_metadata_printf' [-Wmissing-prototypes]
 3030 | int lttng_metadata_printf(struct lttng_kernel_session *session,
      |     ^~~~~~~~~~~~~~~~~~~~~
  CC [M]  /tmp/B.24bz_hbl/BUILD/lttng-modules-2.13.12/lttng-modules-2.13.12/src/lttng-tracepoint.o
  CC [M]  /tmp/B.24bz_hbl/BUILD/lttng-modules-2.13.12/lttng-modules-2.13.12/src/lttng-syscalls-enum.o
  CC [M]  /tmp/B.24bz_hbl/BUILD/lttng-modules-2.13.12/lttng-modules-2.13.12/src/lttng-bytecode-interpreter.o
  CC [M]  /tmp/B.24bz_hbl/BUILD/lttng-modules-2.13.12/lttng-modules-2.13.12/src/wrapper/fdtable.o
  CC [M]  /tmp/B.24bz_hbl/BUILD/lttng-modules-2.13.12/lttng-modules-2.13.12/src/wrapper/random.o
  CC [M]  /tmp/B.24bz_hbl/BUILD/lttng-modules-2.13.12/lttng-modules-2.13.12/src/lttng-context-perf-counters.o
  CC [M]  /tmp/B.24bz_hbl/BUILD/lttng-modules-2.13.12/lttng-modules-2.13.12/src/wrapper/irqdesc.o
  CC [M]  /tmp/B.24bz_hbl/BUILD/lttng-modules-2.13.12/lttng-modules-2.13.12/src/lttng-context-mnt-ns.o
  CC [M]  /tmp/B.24bz_hbl/BUILD/lttng-modules-2.13.12/lttng-modules-2.13.12/src/lttng-context-uts-ns.o
  CC [M]  /tmp/B.24bz_hbl/BUILD/lttng-modules-2.13.12/lttng-modules-2.13.12/src/lttng-context-time-ns.o
  CC [M]  /tmp/B.24bz_hbl/BUILD/lttng-modules-2.13.12/lttng-modules-2.13.12/src/wrapper/trace-clock.o
  CC [M]  /tmp/B.24bz_hbl/BUILD/lttng-modules-2.13.12/lttng-modules-2.13.12/src/lttng-context-ipc-ns.o
  CC [M]  /tmp/B.24bz_hbl/BUILD/lttng-modules-2.13.12/lttng-modules-2.13.12/src/lttng-context-cgroup-ns.o
  CC [M]  /tmp/B.24bz_hbl/BUILD/lttng-modules-2.13.12/lttng-modules-2.13.12/src/lttng-wrapper-impl.o
  CC [M]  /tmp/B.24bz_hbl/BUILD/lttng-modules-2.13.12/lttng-modules-2.13.12/src/wrapper/page_alloc.o
/tmp/B.24bz_hbl/BUILD/lttng-modules-2.13.12/lttng-modules-2.13.12/src/wrapper/page_alloc.c:33:15: warning: no previous prototype for 'wrapper_get_pfnblock_flags_mask' [-Wmissing-prototypes]
   33 | unsigned long wrapper_get_pfnblock_flags_mask(struct page *page,
      |               ^~~~~~~~~~~~~~~~~~~~~~~~~~~~~~~
  CC [M]  /tmp/B.24bz_hbl/BUILD/lttng-modules-2.13.12/lttng-modules-2.13.12/src/lttng-context-user-ns.o
  CC [M]  /tmp/B.24bz_hbl/BUILD/lttng-modules-2.13.12/lttng-modules-2.13.12/src/lttng-context-pid-ns.o
  CC [M]  /tmp/B.24bz_hbl/BUILD/lttng-modules-2.13.12/lttng-modules-2.13.12/src/lttng-context-net-ns.o
  CC [M]  /tmp/B.24bz_hbl/BUILD/lttng-modules-2.13.12/lttng-modules-2.13.12/src/wrapper/kallsyms.o
  CC [M]  /tmp/B.24bz_hbl/BUILD/lttng-modules-2.13.12/lttng-modules-2.13.12/src/probes/lttng-probe-irq.o
  LD [M]  /tmp/B.24bz_hbl/BUILD/lttng-modules-2.13.12/lttng-modules-2.13.12/src/lttng-wrapper.o
  CC [M]  /tmp/B.24bz_hbl/BUILD/lttng-modules-2.13.12/lttng-modules-2.13.12/src/lttng-syscalls.o
/tmp/B.24bz_hbl/BUILD/lttng-modules-2.13.12/lttng-modules-2.13.12/src/lttng-syscalls.c:1813:5: warning: no previous prototype for 'lttng_abi_syscall_list' [-Wmissing-prototypes]
 1813 | int lttng_abi_syscall_list(void)
      |     ^~~~~~~~~~~~~~~~~~~~~~
  CC [M]  /tmp/B.24bz_hbl/BUILD/lttng-modules-2.13.12/lttng-modules-2.13.12/src/lttng-statedump-impl.o
In file included from /tmp/B.24bz_hbl/BUILD/lttng-modules-2.13.12/lttng-modules-2.13.12/src/lttng-statedump-impl.c:44:
/tmp/B.24bz_hbl/BUILD/lttng-modules-2.13.12/lttng-modules-2.13.12/src/../include/wrapper/genhd.h: In function '__canary__get_block_class':
/tmp/B.24bz_hbl/BUILD/lttng-modules-2.13.12/lttng-modules-2.13.12/src/../include/wrapper/genhd.h:57:16: warning: return discards 'const' qualifier from pointer target type [-Wdiscarded-qualifiers]
   57 |         return &block_class;
      |                ^~~~~~~~~~~~
In file included from ./include/linux/spinlock.h:305,
                 from ./include/linux/mmzone.h:8,
                 from ./include/linux/gfp.h:7,
                 from ./include/linux/umh.h:4,
                 from ./include/linux/kmod.h:9,
                 from ./include/linux/module.h:17,
                 from /tmp/B.24bz_hbl/BUILD/lttng-modules-2.13.12/lttng-modules-2.13.12/src/lttng-statedump-impl.c:17:
/tmp/B.24bz_hbl/BUILD/lttng-modules-2.13.12/lttng-modules-2.13.12/src/lttng-statedump-impl.c: In function 'lttng_enumerate_network_ip_interface':
/tmp/B.24bz_hbl/BUILD/lttng-modules-2.13.12/lttng-modules-2.13.12/src/lttng-statedump-impl.c:400:20: error: 'dev_base_lock' undeclared (first use in this function); did you mean 'device_lock'?
  400 |         read_lock(&dev_base_lock);
      |                    ^~~~~~~~~~~~~
./include/linux/rwlock.h:56:48: note: in definition of macro 'read_lock'
   56 | #define read_lock(lock)         _raw_read_lock(lock)
      |                                                ^~~~
/tmp/B.24bz_hbl/BUILD/lttng-modules-2.13.12/lttng-modules-2.13.12/src/lttng-statedump-impl.c:400:20: note: each undeclared identifier is reported only once for each function it appears in
  400 |         read_lock(&dev_base_lock);
      |                    ^~~~~~~~~~~~~
./include/linux/rwlock.h:56:48: note: in definition of macro 'read_lock'
   56 | #define read_lock(lock)         _raw_read_lock(lock)
      |                                                ^~~~
/tmp/B.24bz_hbl/BUILD/lttng-modules-2.13.12/lttng-modules-2.13.12/src/lttng-statedump-impl.c: At top level:
/tmp/B.24bz_hbl/BUILD/lttng-modules-2.13.12/lttng-modules-2.13.12/src/lttng-statedump-impl.c:815:5: warning: no previous prototype for 'lttng_statedump_start' [-Wmissing-prototypes]
  815 | int lttng_statedump_start(struct lttng_kernel_session *session)
      |     ^~~~~~~~~~~~~~~~~~~~~
make[3]: *** [scripts/Makefile.build:244: /tmp/B.24bz_hbl/BUILD/lttng-modules-2.13.12/lttng-modules-2.13.12/src/lttng-statedump-impl.o] Error 1
  CC [M]  /tmp/B.24bz_hbl/BUILD/lttng-modules-2.13.12/lttng-modules-2.13.12/src/lib/../wrapper/splice.o
/tmp/B.24bz_hbl/BUILD/lttng-modules-2.13.12/lttng-modules-2.13.12/src/lib/../wrapper/splice.c:59:9: warning: no previous prototype for 'wrapper_splice_to_pipe' [-Wmissing-prototypes]
   59 | ssize_t wrapper_splice_to_pipe(struct pipe_inode_info *pipe,
      |         ^~~~~~~~~~~~~~~~~~~~~~
make[3]: *** Waiting for unfinished jobs....
  CC [M]  /tmp/B.24bz_hbl/BUILD/lttng-modules-2.13.12/lttng-modules-2.13.12/src/tests/probes/lttng-test.o
  CC [M]  /tmp/B.24bz_hbl/BUILD/lttng-modules-2.13.12/lttng-modules-2.13.12/src/lib/prio_heap/lttng_prio_heap.o
  CC [M]  /tmp/B.24bz_hbl/BUILD/lttng-modules-2.13.12/lttng-modules-2.13.12/src/tests/clock-plugin/lttng-clock-plugin-test.o
  LD [M]  /tmp/B.24bz_hbl/BUILD/lttng-modules-2.13.12/lttng-modules-2.13.12/src/tests/lttng-test.o
  LD [M]  /tmp/B.24bz_hbl/BUILD/lttng-modules-2.13.12/lttng-modules-2.13.12/src/tests/lttng-clock-plugin-test.o
  CC [M]  /tmp/B.24bz_hbl/BUILD/lttng-modules-2.13.12/lttng-modules-2.13.12/src/probes/lttng-probe-timer.o
  CC [M]  /tmp/B.24bz_hbl/BUILD/lttng-modules-2.13.12/lttng-modules-2.13.12/src/probes/lttng-probe-module.o
  CC [M]  /tmp/B.24bz_hbl/BUILD/lttng-modules-2.13.12/lttng-modules-2.13.12/src/probes/lttng-probe-9p.o
  CC [M]  /tmp/B.24bz_hbl/BUILD/lttng-modules-2.13.12/lttng-modules-2.13.12/src/lib/ringbuffer/ring_buffer_splice.o
  CC [M]  /tmp/B.24bz_hbl/BUILD/lttng-modules-2.13.12/lttng-modules-2.13.12/src/lib/ringbuffer/ring_buffer_mmap.o
  CC [M]  /tmp/B.24bz_hbl/BUILD/lttng-modules-2.13.12/lttng-modules-2.13.12/src/lib/counter/counter.o
  CC [M]  /tmp/B.24bz_hbl/BUILD/lttng-modules-2.13.12/lttng-modules-2.13.12/src/lib/ringbuffer/ring_buffer_backend.o
  LD [M]  /tmp/B.24bz_hbl/BUILD/lttng-modules-2.13.12/lttng-modules-2.13.12/src/lib/lttng-counter.o
  CC [M]  /tmp/B.24bz_hbl/BUILD/lttng-modules-2.13.12/lttng-modules-2.13.12/src/probes/lttng-probe-power.o
  CC [M]  /tmp/B.24bz_hbl/BUILD/lttng-modules-2.13.12/lttng-modules-2.13.12/src/probes/lttng-probe-x86-exceptions.o
  CC [M]  /tmp/B.24bz_hbl/BUILD/lttng-modules-2.13.12/lttng-modules-2.13.12/src/probes/lttng-probe-sched.o
  CC [M]  /tmp/B.24bz_hbl/BUILD/lttng-modules-2.13.12/lttng-modules-2.13.12/src/lib/ringbuffer/ring_buffer_frontend.o
/tmp/B.24bz_hbl/BUILD/lttng-modules-2.13.12/lttng-modules-2.13.12/src/lib/ringbuffer/ring_buffer_frontend.c:2409:12: warning: no previous prototype for 'init_lib_ring_buffer_frontend' [-Wmissing-prototypes]
 2409 | int __init init_lib_ring_buffer_frontend(void)
      |            ^~~~~~~~~~~~~~~~~~~~~~~~~~~~~
/tmp/B.24bz_hbl/BUILD/lttng-modules-2.13.12/lttng-modules-2.13.12/src/lib/ringbuffer/ring_buffer_frontend.c:2420:13: warning: no previous prototype for 'exit_lib_ring_buffer_frontend' [-Wmissing-prototypes]
 2420 | void __exit exit_lib_ring_buffer_frontend(void)
      |             ^~~~~~~~~~~~~~~~~~~~~~~~~~~~~
  CC [M]  /tmp/B.24bz_hbl/BUILD/lttng-modules-2.13.12/lttng-modules-2.13.12/src/probes/lttng-probe-signal.o
  CC [M]  /tmp/B.24bz_hbl/BUILD/lttng-modules-2.13.12/lttng-modules-2.13.12/src/probes/lttng-probe-x86-irq-vectors.o
  CC [M]  /tmp/B.24bz_hbl/BUILD/lttng-modules-2.13.12/lttng-modules-2.13.12/src/lib/ringbuffer/ring_buffer_iterator.o
  CC [M]  /tmp/B.24bz_hbl/BUILD/lttng-modules-2.13.12/lttng-modules-2.13.12/src/probes/lttng-probe-i2c.o
  CC [M]  /tmp/B.24bz_hbl/BUILD/lttng-modules-2.13.12/lttng-modules-2.13.12/src/lib/ringbuffer/ring_buffer_vfs.o
  LD [M]  /tmp/B.24bz_hbl/BUILD/lttng-modules-2.13.12/lttng-modules-2.13.12/src/lib/lttng-lib-ring-buffer.o
  CC [M]  /tmp/B.24bz_hbl/BUILD/lttng-modules-2.13.12/lttng-modules-2.13.12/src/probes/lttng-probe-asoc.o
In file included from /tmp/B.24bz_hbl/BUILD/lttng-modules-2.13.12/lttng-modules-2.13.12/src/probes/../../include/lttng/define_trace.h:87,
                 from /tmp/B.24bz_hbl/BUILD/lttng-modules-2.13.12/lttng-modules-2.13.12/src/probes/../../include/instrumentation/events/asoc.h:414,
                 from /tmp/B.24bz_hbl/BUILD/lttng-modules-2.13.12/lttng-modules-2.13.12/src/probes/lttng-probe-asoc.c:29:
/tmp/B.24bz_hbl/BUILD/lttng-modules-2.13.12/lttng-modules-2.13.12/src/probes/../../include/lttng/tracepoint-event-impl.h:133:6: error: conflicting types for 'trace_snd_soc_bias_level_start'; have 'void(struct snd_soc_card *, int)'
  133 | void trace_##_name(_proto);
      |      ^~~~~~
/tmp/B.24bz_hbl/BUILD/lttng-modules-2.13.12/lttng-modules-2.13.12/src/probes/../../include/instrumentation/events/asoc.h:134:1: note: in expansion of macro 'LTTNG_TRACEPOINT_EVENT_INSTANCE_MAP'
  134 | LTTNG_TRACEPOINT_EVENT_INSTANCE_MAP(asoc_snd_soc_card, snd_soc_bias_level_start,
      | ^~~~~~~~~~~~~~~~~~~~~~~~~~~~~~~~~~~
In file included from ./include/trace/events/asoc.h:9,
                 from /tmp/B.24bz_hbl/BUILD/lttng-modules-2.13.12/lttng-modules-2.13.12/src/probes/lttng-probe-asoc.c:20:
./include/linux/tracepoint.h:256:28: note: previous definition of 'trace_snd_soc_bias_level_start' with type 'void(struct snd_soc_dapm_context *, int)'
  256 |         static inline void trace_##name(proto)                          \
      |                            ^~~~~~
./include/linux/tracepoint.h:434:9: note: in expansion of macro '__DECLARE_TRACE'
  434 |         __DECLARE_TRACE(name, PARAMS(proto), PARAMS(args),              \
      |         ^~~~~~~~~~~~~~~
./include/linux/tracepoint.h:557:9: note: in expansion of macro 'DECLARE_TRACE'
  557 |         DECLARE_TRACE(name, PARAMS(proto), PARAMS(args))
      |         ^~~~~~~~~~~~~
./include/trace/events/asoc.h:42:1: note: in expansion of macro 'DEFINE_EVENT'
   42 | DEFINE_EVENT(snd_soc_dapm, snd_soc_bias_level_start,
      | ^~~~~~~~~~~~
/tmp/B.24bz_hbl/BUILD/lttng-modules-2.13.12/lttng-modules-2.13.12/src/probes/../../include/lttng/tracepoint-event-impl.h:133:6: error: conflicting types for 'trace_snd_soc_bias_level_done'; have 'void(struct snd_soc_card *, int)'
  133 | void trace_##_name(_proto);
      |      ^~~~~~
/tmp/B.24bz_hbl/BUILD/lttng-modules-2.13.12/lttng-modules-2.13.12/src/probes/../../include/instrumentation/events/asoc.h:144:1: note: in expansion of macro 'LTTNG_TRACEPOINT_EVENT_INSTANCE_MAP'
  144 | LTTNG_TRACEPOINT_EVENT_INSTANCE_MAP(asoc_snd_soc_card, snd_soc_bias_level_done,
      | ^~~~~~~~~~~~~~~~~~~~~~~~~~~~~~~~~~~
./include/linux/tracepoint.h:256:28: note: previous definition of 'trace_snd_soc_bias_level_done' with type 'void(struct snd_soc_dapm_context *, int)'
  256 |         static inline void trace_##name(proto)                          \
      |                            ^~~~~~
./include/linux/tracepoint.h:434:9: note: in expansion of macro '__DECLARE_TRACE'
  434 |         __DECLARE_TRACE(name, PARAMS(proto), PARAMS(args),              \
      |         ^~~~~~~~~~~~~~~
./include/linux/tracepoint.h:557:9: note: in expansion of macro 'DECLARE_TRACE'
  557 |         DECLARE_TRACE(name, PARAMS(proto), PARAMS(args))
      |         ^~~~~~~~~~~~~
./include/trace/events/asoc.h:50:1: note: in expansion of macro 'DEFINE_EVENT'
   50 | DEFINE_EVENT(snd_soc_dapm, snd_soc_bias_level_done,
      | ^~~~~~~~~~~~
/tmp/B.24bz_hbl/BUILD/lttng-modules-2.13.12/lttng-modules-2.13.12/src/probes/../../include/lttng/tracepoint-event-impl.h:133:6: error: conflicting types for 'trace_snd_soc_dapm_start'; have 'void(struct snd_soc_card *)'
  133 | void trace_##_name(_proto);
      |      ^~~~~~
/tmp/B.24bz_hbl/BUILD/lttng-modules-2.13.12/lttng-modules-2.13.12/src/probes/../../include/instrumentation/events/asoc.h:165:1: note: in expansion of macro 'LTTNG_TRACEPOINT_EVENT_INSTANCE_MAP'
  165 | LTTNG_TRACEPOINT_EVENT_INSTANCE_MAP(asoc_snd_soc_dapm_basic, snd_soc_dapm_start,
      | ^~~~~~~~~~~~~~~~~~~~~~~~~~~~~~~~~~~
./include/linux/tracepoint.h:256:28: note: previous definition of 'trace_snd_soc_dapm_start' with type 'void(struct snd_soc_card *, int)'
  256 |         static inline void trace_##name(proto)                          \
      |                            ^~~~~~
./include/linux/tracepoint.h:434:9: note: in expansion of macro '__DECLARE_TRACE'
  434 |         __DECLARE_TRACE(name, PARAMS(proto), PARAMS(args),              \
      |         ^~~~~~~~~~~~~~~
./include/linux/tracepoint.h:557:9: note: in expansion of macro 'DECLARE_TRACE'
  557 |         DECLARE_TRACE(name, PARAMS(proto), PARAMS(args))
      |         ^~~~~~~~~~~~~
./include/trace/events/asoc.h:77:1: note: in expansion of macro 'DEFINE_EVENT'
   77 | DEFINE_EVENT(snd_soc_dapm_basic, snd_soc_dapm_start,
      | ^~~~~~~~~~~~
/tmp/B.24bz_hbl/BUILD/lttng-modules-2.13.12/lttng-modules-2.13.12/src/probes/../../include/lttng/tracepoint-event-impl.h:133:6: error: conflicting types for 'trace_snd_soc_dapm_done'; have 'void(struct snd_soc_card *)'
  133 | void trace_##_name(_proto);
      |      ^~~~~~
/tmp/B.24bz_hbl/BUILD/lttng-modules-2.13.12/lttng-modules-2.13.12/src/probes/../../include/instrumentation/events/asoc.h:175:1: note: in expansion of macro 'LTTNG_TRACEPOINT_EVENT_INSTANCE_MAP'
  175 | LTTNG_TRACEPOINT_EVENT_INSTANCE_MAP(asoc_snd_soc_dapm_basic, snd_soc_dapm_done,
      | ^~~~~~~~~~~~~~~~~~~~~~~~~~~~~~~~~~~
./include/linux/tracepoint.h:256:28: note: previous definition of 'trace_snd_soc_dapm_done' with type 'void(struct snd_soc_card *, int)'
  256 |         static inline void trace_##name(proto)                          \
      |                            ^~~~~~
./include/linux/tracepoint.h:434:9: note: in expansion of macro '__DECLARE_TRACE'
  434 |         __DECLARE_TRACE(name, PARAMS(proto), PARAMS(args),              \
      |         ^~~~~~~~~~~~~~~
./include/linux/tracepoint.h:557:9: note: in expansion of macro 'DECLARE_TRACE'
  557 |         DECLARE_TRACE(name, PARAMS(proto), PARAMS(args))
      |         ^~~~~~~~~~~~~
./include/trace/events/asoc.h:85:1: note: in expansion of macro 'DEFINE_EVENT'
   85 | DEFINE_EVENT(snd_soc_dapm_basic, snd_soc_dapm_done,
      | ^~~~~~~~~~~~
make[4]: *** [scripts/Makefile.build:244: /tmp/B.24bz_hbl/BUILD/lttng-modules-2.13.12/lttng-modules-2.13.12/src/probes/lttng-probe-asoc.o] Error 1
make[4]: *** Waiting for unfinished jobs....
  CC [M]  /tmp/B.24bz_hbl/BUILD/lttng-modules-2.13.12/lttng-modules-2.13.12/src/probes/lttng-probe-gpio.o
  CC [M]  /tmp/B.24bz_hbl/BUILD/lttng-modules-2.13.12/lttng-modules-2.13.12/src/probes/lttng-probe-kvm.o
  CC [M]  /tmp/B.24bz_hbl/BUILD/lttng-modules-2.13.12/lttng-modules-2.13.12/src/probes/lttng-probe-skb.o
  CC [M]  /tmp/B.24bz_hbl/BUILD/lttng-modules-2.13.12/lttng-modules-2.13.12/src/probes/lttng-probe-kmem.o
  CC [M]  /tmp/B.24bz_hbl/BUILD/lttng-modules-2.13.12/lttng-modules-2.13.12/src/probes/lttng-probe-napi.o
  CC [M]  /tmp/B.24bz_hbl/BUILD/lttng-modules-2.13.12/lttng-modules-2.13.12/src/probes/lttng-probe-sock.o
  CC [M]  /tmp/B.24bz_hbl/BUILD/lttng-modules-2.13.12/lttng-modules-2.13.12/src/probes/lttng-probe-regulator.o
  CC [M]  /tmp/B.24bz_hbl/BUILD/lttng-modules-2.13.12/lttng-modules-2.13.12/src/probes/lttng-probe-rcu.o
  CC [M]  /tmp/B.24bz_hbl/BUILD/lttng-modules-2.13.12/lttng-modules-2.13.12/src/probes/lttng-probe-kvm-x86-mmu.o
  CC [M]  /tmp/B.24bz_hbl/BUILD/lttng-modules-2.13.12/lttng-modules-2.13.12/src/probes/lttng-probe-compaction.o
In file included from /tmp/B.24bz_hbl/BUILD/lttng-modules-2.13.12/lttng-modules-2.13.12/src/probes/../../include/lttng/define_trace.h:87,
                 from /tmp/B.24bz_hbl/BUILD/lttng-modules-2.13.12/lttng-modules-2.13.12/src/probes/../../include/instrumentation/events/compaction.h:189,
                 from /tmp/B.24bz_hbl/BUILD/lttng-modules-2.13.12/lttng-modules-2.13.12/src/probes/lttng-probe-compaction.c:32:
/tmp/B.24bz_hbl/BUILD/lttng-modules-2.13.12/lttng-modules-2.13.12/src/probes/../../include/lttng/tracepoint-event-impl.h:133:6: error: conflicting types for 'trace_mm_compaction_migratepages'; have 'void(struct compact_control *, unsigned int)'
  133 | void trace_##_name(_proto);
      |      ^~~~~~
/tmp/B.24bz_hbl/BUILD/lttng-modules-2.13.12/lttng-modules-2.13.12/src/probes/../../include/lttng/tracepoint-event-impl.h:45:9: note: in expansion of macro 'LTTNG_TRACEPOINT_EVENT_INSTANCE_MAP'
   45 |         LTTNG_TRACEPOINT_EVENT_INSTANCE_MAP(map, name, map, PARAMS(proto), PARAMS(args))
      |         ^~~~~~~~~~~~~~~~~~~~~~~~~~~~~~~~~~~
/tmp/B.24bz_hbl/BUILD/lttng-modules-2.13.12/lttng-modules-2.13.12/src/probes/../../include/instrumentation/events/compaction.h:102:1: note: in expansion of macro 'LTTNG_TRACEPOINT_EVENT_MAP'
  102 | LTTNG_TRACEPOINT_EVENT_MAP(mm_compaction_migratepages,
      | ^~~~~~~~~~~~~~~~~~~~~~~~~~
In file included from ./include/trace/events/compaction.h:10,
                 from /tmp/B.24bz_hbl/BUILD/lttng-modules-2.13.12/lttng-modules-2.13.12/src/probes/lttng-probe-compaction.c:23:
./include/linux/tracepoint.h:256:28: note: previous definition of 'trace_mm_compaction_migratepages' with type 'void(unsigned int,  unsigned int)'
  256 |         static inline void trace_##name(proto)                          \
      |                            ^~~~~~
./include/linux/tracepoint.h:434:9: note: in expansion of macro '__DECLARE_TRACE'
  434 |         __DECLARE_TRACE(name, PARAMS(proto), PARAMS(args),              \
      |         ^~~~~~~~~~~~~~~
./include/linux/tracepoint.h:568:9: note: in expansion of macro 'DECLARE_TRACE'
  568 |         DECLARE_TRACE(name, PARAMS(proto), PARAMS(args))
      |         ^~~~~~~~~~~~~
./include/trace/events/compaction.h:79:1: note: in expansion of macro 'TRACE_EVENT'
   79 | TRACE_EVENT(mm_compaction_migratepages,
      | ^~~~~~~~~~~
make[4]: *** [scripts/Makefile.build:244: /tmp/B.24bz_hbl/BUILD/lttng-modules-2.13.12/lttng-modules-2.13.12/src/probes/lttng-probe-compaction.o] Error 1
  CC [M]  /tmp/B.24bz_hbl/BUILD/lttng-modules-2.13.12/lttng-modules-2.13.12/src/probes/lttng-probe-udp.o
  CC [M]  /tmp/B.24bz_hbl/BUILD/lttng-modules-2.13.12/lttng-modules-2.13.12/src/probes/lttng-probe-statedump.o
  CC [M]  /tmp/B.24bz_hbl/BUILD/lttng-modules-2.13.12/lttng-modules-2.13.12/src/probes/lttng-probe-net.o
  CC [M]  /tmp/B.24bz_hbl/BUILD/lttng-modules-2.13.12/lttng-modules-2.13.12/src/probes/lttng-probe-printk.o
  CC [M]  /tmp/B.24bz_hbl/BUILD/lttng-modules-2.13.12/lttng-modules-2.13.12/src/probes/lttng-probe-scsi.o
  CC [M]  /tmp/B.24bz_hbl/BUILD/lttng-modules-2.13.12/lttng-modules-2.13.12/src/probes/lttng-probe-regmap.o
  CC [M]  /tmp/B.24bz_hbl/BUILD/lttng-modules-2.13.12/lttng-modules-2.13.12/src/probes/lttng-probe-block.o
  CC [M]  /tmp/B.24bz_hbl/BUILD/lttng-modules-2.13.12/lttng-modules-2.13.12/src/probes/lttng-probe-jbd2.o
  CC [M]  /tmp/B.24bz_hbl/BUILD/lttng-modules-2.13.12/lttng-modules-2.13.12/src/probes/lttng-probe-vmscan.o
  CC [M]  /tmp/B.24bz_hbl/BUILD/lttng-modules-2.13.12/lttng-modules-2.13.12/src/probes/lttng-probe-sunrpc.o
  CC [M]  /tmp/B.24bz_hbl/BUILD/lttng-modules-2.13.12/lttng-modules-2.13.12/src/probes/lttng-probe-kvm-x86.o
  CC [M]  /tmp/B.24bz_hbl/BUILD/lttng-modules-2.13.12/lttng-modules-2.13.12/src/probes/lttng-probe-btrfs.o
  CC [M]  /tmp/B.24bz_hbl/BUILD/lttng-modules-2.13.12/lttng-modules-2.13.12/src/probes/lttng-probe-ext4.o
make[3]: *** [scripts/Makefile.build:485: /tmp/B.24bz_hbl/BUILD/lttng-modules-2.13.12/lttng-modules-2.13.12/src/probes] Error 2
  CC [M]  /tmp/B.24bz_hbl/BUILD/lttng-modules-2.13.12/lttng-modules-2.13.12/src/lttng-syscalls-exit-table.o
  CC [M]  /tmp/B.24bz_hbl/BUILD/lttng-modules-2.13.12/lttng-modules-2.13.12/src/lttng-syscalls-exit-compat-table.o
  CC [M]  /tmp/B.24bz_hbl/BUILD/lttng-modules-2.13.12/lttng-modules-2.13.12/src/lttng-syscalls-entry-compat-table.o
  CC [M]  /tmp/B.24bz_hbl/BUILD/lttng-modules-2.13.12/lttng-modules-2.13.12/src/lttng-syscalls-entry-table.o
make[2]: *** [/usr/src/linux-6.9.2/Makefile:1919: /tmp/B.24bz_hbl/BUILD/lttng-modules-2.13.12/lttng-modules-2.13.12/src] Error 2
make[1]: *** [Makefile:240: __sub-make] Error 2
make: *** [Makefile:31: modules] Error 2
error: Bad exit status from /tmp/B.24bz_hbl/BUILD/tmp/rpm-tmp.7MR4dO (%build)

RPM build warnings:
    Could not canonicalize hostname: ymir

RPM build errors:
    Bad exit status from /tmp/B.24bz_hbl/BUILD/tmp/rpm-tmp.7MR4dO (%build)
ended at: Wed May 29 01:45:55 2024, done in 0:00:32.261701
error: No files produced.
+ chmod -R u+rwX /tmp/B.24bz_hbl/BUILD
+ rm -rf /tmp/B.24bz_hbl/tmp /tmp/B.24bz_hbl/BUILD
+ rm -rf /tmp/B.24bz_hbl
Begin-PLD-Builder-Info
Build-Time: user:256.47s sys:27.24s real:49.57s (faults io:8 non-io:2937301)

End-PLD-Builder-Info
[Back to list of logs] [View rpm -qa of builder]