FailedOk

th/SRPMS[OK]
th/x32[OK]
th/i686[OK]
th/x86_64[OK]

ac/SRPMS[OK]
ac/i386[OK]
ac/i586[OK]
ac/i686[OK]
ac/alpha[OK]
ac/amd64[OK]
ac/athlon[OK]
ac/ppc[OK]
ac/sparc[OK]
ac/sparc64[OK]

Advanced Search
main()
Powered by PLD Linux
(c) 2002-2023 PLD Team
$Revision: 1.37 $
Powered by coffee.
Your IP: 3.222.251.91

lttng-modules f5f81ac1-fe4e-484d-8515-e92350930b9d

Status:Failed
Source URL:https://buildlogs.pld-linux.org/pld/th/x86_64/FAIL/lttng-modules,f5f81ac1-fe4e-484d-8515-e92350930b9d.bz2
text/plain URL:View!
rpm -qa of builder:View!
Date:2022/10/28 16:33:18
Runtime:0:01:35.912009

Toc:

  • prep
  • Executing(%prep): /bin/sh -e /tmp/B.rbg4g098/BUILD/tmp/rpm-tmp.TQLzbp
  • build
  • Executing(%build): /bin/sh -e /tmp/B.rbg4g098/BUILD/tmp/rpm-tmp.IdHx34
  • error 1
  • - SSL error:FFFFFFFF80000002:system library::No such file or directory: crypto/bio/bss_file.c:67
  • error 2
  • - SSL error:10000080:BIO routines::no such file: crypto/bio/bss_file.c:75
  • error 3
  • - SSL error:FFFFFFFF80000002:system library::No such file or directory: crypto/bio/bss_file.c:67
  • error 4
  • - SSL error:10000080:BIO routines::no such file: crypto/bio/bss_file.c:75
  • error 5
  • - SSL error:FFFFFFFF80000002:system library::No such file or directory: crypto/bio/bss_file.c:67
  • error 6
  • - SSL error:10000080:BIO routines::no such file: crypto/bio/bss_file.c:75
  • error 7
  • - SSL error:FFFFFFFF80000002:system library::No such file or directory: crypto/bio/bss_file.c:67
  • error 8
  • - SSL error:10000080:BIO routines::no such file: crypto/bio/bss_file.c:75
  • error 9
  • - SSL error:FFFFFFFF80000002:system library::No such file or directory: crypto/bio/bss_file.c:67
  • error 10
  • - SSL error:10000080:BIO routines::no such file: crypto/bio/bss_file.c:75
  • error 11
  • - SSL error:FFFFFFFF80000002:system library::No such file or directory: crypto/bio/bss_file.c:67
  • error 12
  • - SSL error:10000080:BIO routines::no such file: crypto/bio/bss_file.c:75
  • error 13
  • - SSL error:FFFFFFFF80000002:system library::No such file or directory: crypto/bio/bss_file.c:67
  • error 14
  • - SSL error:10000080:BIO routines::no such file: crypto/bio/bss_file.c:75
  • error 15
  • - SSL error:FFFFFFFF80000002:system library::No such file or directory: crypto/bio/bss_file.c:67
  • error 16
  • - SSL error:10000080:BIO routines::no such file: crypto/bio/bss_file.c:75
  • error 17
  • - SSL error:FFFFFFFF80000002:system library::No such file or directory: crypto/bio/bss_file.c:67
  • error 18
  • - SSL error:10000080:BIO routines::no such file: crypto/bio/bss_file.c:75
  • error 19
  • - SSL error:FFFFFFFF80000002:system library::No such file or directory: crypto/bio/bss_file.c:67
  • error 20
  • - SSL error:10000080:BIO routines::no such file: crypto/bio/bss_file.c:75
  • error 21
  • - SSL error:FFFFFFFF80000002:system library::No such file or directory: crypto/bio/bss_file.c:67
  • error 22
  • - SSL error:10000080:BIO routines::no such file: crypto/bio/bss_file.c:75
  • error 23
  • - SSL error:FFFFFFFF80000002:system library::No such file or directory: crypto/bio/bss_file.c:67
  • error 24
  • - SSL error:10000080:BIO routines::no such file: crypto/bio/bss_file.c:75
  • error 25
  • - SSL error:FFFFFFFF80000002:system library::No such file or directory: crypto/bio/bss_file.c:67
  • error 26
  • - SSL error:10000080:BIO routines::no such file: crypto/bio/bss_file.c:75
  • error 27
  • - SSL error:FFFFFFFF80000002:system library::No such file or directory: crypto/bio/bss_file.c:67
  • error 28
  • - SSL error:10000080:BIO routines::no such file: crypto/bio/bss_file.c:75
  • error 29
  • - SSL error:FFFFFFFF80000002:system library::No such file or directory: crypto/bio/bss_file.c:67
  • error 30
  • - SSL error:10000080:BIO routines::no such file: crypto/bio/bss_file.c:75
  • error 31
  • - SSL error:FFFFFFFF80000002:system library::No such file or directory: crypto/bio/bss_file.c:67
  • error 32
  • - SSL error:10000080:BIO routines::no such file: crypto/bio/bss_file.c:75
  • error 33
  • - SSL error:FFFFFFFF80000002:system library::No such file or directory: crypto/bio/bss_file.c:67
  • error 34
  • - SSL error:10000080:BIO routines::no such file: crypto/bio/bss_file.c:75
  • error 35
  • - SSL error:FFFFFFFF80000002:system library::No such file or directory: crypto/bio/bss_file.c:67
  • error 36
  • - SSL error:10000080:BIO routines::no such file: crypto/bio/bss_file.c:75
  • error 37
  • - SSL error:FFFFFFFF80000002:system library::No such file or directory: crypto/bio/bss_file.c:67
  • error 38
  • - SSL error:10000080:BIO routines::no such file: crypto/bio/bss_file.c:75
  • error 39
  • - SSL error:FFFFFFFF80000002:system library::No such file or directory: crypto/bio/bss_file.c:67
  • error 40
  • - SSL error:10000080:BIO routines::no such file: crypto/bio/bss_file.c:75
  • error 41
  • - SSL error:FFFFFFFF80000002:system library::No such file or directory: crypto/bio/bss_file.c:67
  • error 42
  • - SSL error:10000080:BIO routines::no such file: crypto/bio/bss_file.c:75
  • error 43
  • - SSL error:FFFFFFFF80000002:system library::No such file or directory: crypto/bio/bss_file.c:67
  • error 44
  • - SSL error:10000080:BIO routines::no such file: crypto/bio/bss_file.c:75
  • error 45
  • - SSL error:FFFFFFFF80000002:system library::No such file or directory: crypto/bio/bss_file.c:67
  • error 46
  • - SSL error:10000080:BIO routines::no such file: crypto/bio/bss_file.c:75
  • error 47
  • - SSL error:FFFFFFFF80000002:system library::No such file or directory: crypto/bio/bss_file.c:67
  • error 48
  • - SSL error:10000080:BIO routines::no such file: crypto/bio/bss_file.c:75
  • error 49
  • - SSL error:FFFFFFFF80000002:system library::No such file or directory: crypto/bio/bss_file.c:67
  • error 50
  • - SSL error:10000080:BIO routines::no such file: crypto/bio/bss_file.c:75
  • error 51
  • - SSL error:FFFFFFFF80000002:system library::No such file or directory: crypto/bio/bss_file.c:67
  • error 52
  • - SSL error:10000080:BIO routines::no such file: crypto/bio/bss_file.c:75
  • error 53
  • - SSL error:FFFFFFFF80000002:system library::No such file or directory: crypto/bio/bss_file.c:67
  • error 54
  • - SSL error:10000080:BIO routines::no such file: crypto/bio/bss_file.c:75
  • error 55
  • - SSL error:FFFFFFFF80000002:system library::No such file or directory: crypto/bio/bss_file.c:67
  • error 56
  • - SSL error:10000080:BIO routines::no such file: crypto/bio/bss_file.c:75
  • error 57
  • - SSL error:FFFFFFFF80000002:system library::No such file or directory: crypto/bio/bss_file.c:67
  • error 58
  • - SSL error:10000080:BIO routines::no such file: crypto/bio/bss_file.c:75
  • error 59
  • - SSL error:FFFFFFFF80000002:system library::No such file or directory: crypto/bio/bss_file.c:67
  • error 60
  • - SSL error:10000080:BIO routines::no such file: crypto/bio/bss_file.c:75
  • error 61
  • - SSL error:FFFFFFFF80000002:system library::No such file or directory: crypto/bio/bss_file.c:67
  • error 62
  • - SSL error:10000080:BIO routines::no such file: crypto/bio/bss_file.c:75
  • error 63
  • - SSL error:FFFFFFFF80000002:system library::No such file or directory: crypto/bio/bss_file.c:67
  • error 64
  • - SSL error:10000080:BIO routines::no such file: crypto/bio/bss_file.c:75
  • error 65
  • - SSL error:FFFFFFFF80000002:system library::No such file or directory: crypto/bio/bss_file.c:67
  • error 66
  • - SSL error:10000080:BIO routines::no such file: crypto/bio/bss_file.c:75
  • error 67
  • - SSL error:FFFFFFFF80000002:system library::No such file or directory: crypto/bio/bss_file.c:67
  • error 68
  • - SSL error:10000080:BIO routines::no such file: crypto/bio/bss_file.c:75
  • error 69
  • - SSL error:FFFFFFFF80000002:system library::No such file or directory: crypto/bio/bss_file.c:67
  • error 70
  • - SSL error:10000080:BIO routines::no such file: crypto/bio/bss_file.c:75
  • error 71
  • - SSL error:FFFFFFFF80000002:system library::No such file or directory: crypto/bio/bss_file.c:67
  • error 72
  • - SSL error:10000080:BIO routines::no such file: crypto/bio/bss_file.c:75
  • error 73
  • - SSL error:FFFFFFFF80000002:system library::No such file or directory: crypto/bio/bss_file.c:67
  • error 74
  • - SSL error:10000080:BIO routines::no such file: crypto/bio/bss_file.c:75
  • error 75
  • - SSL error:FFFFFFFF80000002:system library::No such file or directory: crypto/bio/bss_file.c:67
  • error 76
  • - SSL error:10000080:BIO routines::no such file: crypto/bio/bss_file.c:75
  • error 77
  • - SSL error:FFFFFFFF80000002:system library::No such file or directory: crypto/bio/bss_file.c:67
  • error 78
  • - SSL error:10000080:BIO routines::no such file: crypto/bio/bss_file.c:75
  • error 79
  • - SSL error:FFFFFFFF80000002:system library::No such file or directory: crypto/bio/bss_file.c:67
  • error 80
  • - SSL error:10000080:BIO routines::no such file: crypto/bio/bss_file.c:75
  • error 81
  • - SSL error:FFFFFFFF80000002:system library::No such file or directory: crypto/bio/bss_file.c:67
  • error 82
  • - SSL error:10000080:BIO routines::no such file: crypto/bio/bss_file.c:75
  • error 83
  • - SSL error:FFFFFFFF80000002:system library::No such file or directory: crypto/bio/bss_file.c:67
  • error 84
  • - SSL error:10000080:BIO routines::no such file: crypto/bio/bss_file.c:75
  • error 85
  • - SSL error:FFFFFFFF80000002:system library::No such file or directory: crypto/bio/bss_file.c:67
  • error 86
  • - SSL error:10000080:BIO routines::no such file: crypto/bio/bss_file.c:75
  • error 87
  • - SSL error:FFFFFFFF80000002:system library::No such file or directory: crypto/bio/bss_file.c:67
  • error 88
  • - SSL error:10000080:BIO routines::no such file: crypto/bio/bss_file.c:75
  • error 89
  • - SSL error:FFFFFFFF80000002:system library::No such file or directory: crypto/bio/bss_file.c:67
  • error 90
  • - SSL error:10000080:BIO routines::no such file: crypto/bio/bss_file.c:75
  • error 91
  • - SSL error:FFFFFFFF80000002:system library::No such file or directory: crypto/bio/bss_file.c:67
  • error 92
  • - SSL error:10000080:BIO routines::no such file: crypto/bio/bss_file.c:75
  • error 93
  • - SSL error:FFFFFFFF80000002:system library::No such file or directory: crypto/bio/bss_file.c:67
  • error 94
  • - SSL error:10000080:BIO routines::no such file: crypto/bio/bss_file.c:75
  • error 95
  • - SSL error:FFFFFFFF80000002:system library::No such file or directory: crypto/bio/bss_file.c:67
  • error 96
  • - SSL error:10000080:BIO routines::no such file: crypto/bio/bss_file.c:75
  • error 97
  • - SSL error:FFFFFFFF80000002:system library::No such file or directory: crypto/bio/bss_file.c:67
  • error 98
  • - SSL error:10000080:BIO routines::no such file: crypto/bio/bss_file.c:75
  • error 99
  • - SSL error:FFFFFFFF80000002:system library::No such file or directory: crypto/bio/bss_file.c:67
  • error 100
  • - SSL error:10000080:BIO routines::no such file: crypto/bio/bss_file.c:75
  • error 101
  • - SSL error:FFFFFFFF80000002:system library::No such file or directory: crypto/bio/bss_file.c:67
  • error 102
  • - SSL error:10000080:BIO routines::no such file: crypto/bio/bss_file.c:75
  • error 103
  • - SSL error:FFFFFFFF80000002:system library::No such file or directory: crypto/bio/bss_file.c:67
  • error 104
  • - SSL error:10000080:BIO routines::no such file: crypto/bio/bss_file.c:75
  • error 105
  • - SSL error:FFFFFFFF80000002:system library::No such file or directory: crypto/bio/bss_file.c:67
  • error 106
  • - SSL error:10000080:BIO routines::no such file: crypto/bio/bss_file.c:75
  • error 107
  • - SSL error:FFFFFFFF80000002:system library::No such file or directory: crypto/bio/bss_file.c:67
  • error 108
  • - SSL error:10000080:BIO routines::no such file: crypto/bio/bss_file.c:75
  • error 109
  • - SSL error:FFFFFFFF80000002:system library::No such file or directory: crypto/bio/bss_file.c:67
  • error 110
  • - SSL error:10000080:BIO routines::no such file: crypto/bio/bss_file.c:75
  • error 111
  • - SSL error:FFFFFFFF80000002:system library::No such file or directory: crypto/bio/bss_file.c:67
  • error 112
  • - SSL error:10000080:BIO routines::no such file: crypto/bio/bss_file.c:75
  • error 113
  • - SSL error:FFFFFFFF80000002:system library::No such file or directory: crypto/bio/bss_file.c:67
  • error 114
  • - SSL error:10000080:BIO routines::no such file: crypto/bio/bss_file.c:75
  • error 115
  • /tmp/B.rbg4g098/BUILD/lttng-modules-2.13.4/lttng-modules-2.13.4/src/probes/../../include/lttng/tracepoint-event-impl.h:133:6: error: conflicting types for 'trace_kmalloc'; have 'void(long unsigned int, const void *, size_t, size_t, gfp_t)' {aka 'void(long unsigned int, const void *, long unsigned int, long unsigned int, unsigned int)'}
  • error 116
  • /tmp/B.rbg4g098/BUILD/lttng-modules-2.13.4/lttng-modules-2.13.4/src/probes/../../include/lttng/tracepoint-event-impl.h:133:6: error: conflicting types for 'trace_kmem_cache_alloc'; have 'void(long unsigned int, const void *, size_t, size_t, gfp_t)' {aka 'void(long unsigned int, const void *, long unsigned int, long unsigned int, unsigned int)'}
  • error 117
  • /tmp/B.rbg4g098/BUILD/lttng-modules-2.13.4/lttng-modules-2.13.4/src/probes/../../include/lttng/tracepoint-event-impl.h:133:6: error: conflicting types for 'trace_kmalloc_node'; have 'void(long unsigned int, const void *, size_t, size_t, gfp_t, int)' {aka 'void(long unsigned int, const void *, long unsigned int, long unsigned int, unsigned int, int)'}
  • error 118
  • /tmp/B.rbg4g098/BUILD/lttng-modules-2.13.4/lttng-modules-2.13.4/src/probes/../../include/lttng/tracepoint-event-impl.h:133:6: error: conflicting types for 'trace_kmem_cache_alloc_node'; have 'void(long unsigned int, const void *, size_t, size_t, gfp_t, int)' {aka 'void(long unsigned int, const void *, long unsigned int, long unsigned int, unsigned int, int)'}
  • error 119
  • make[3]: *** [scripts/Makefile.build:249: /tmp/B.rbg4g098/BUILD/lttng-modules-2.13.4/lttng-modules-2.13.4/src/probes/lttng-probe-kmem.o] Error 1
  • error 120
  • make[2]: *** [scripts/Makefile.build:465: /tmp/B.rbg4g098/BUILD/lttng-modules-2.13.4/lttng-modules-2.13.4/src/probes] Error 2
  • error 121
  • /tmp/B.rbg4g098/BUILD/lttng-modules-2.13.4/lttng-modules-2.13.4/src/lttng-statedump-impl.c:209:13: error: implicit declaration of function 'bdevname'; did you mean 'dev_name'? [-Werror=implicit-function-declaration]
  • error 122
  • make[2]: *** [scripts/Makefile.build:249: /tmp/B.rbg4g098/BUILD/lttng-modules-2.13.4/lttng-modules-2.13.4/src/lttng-statedump-impl.o] Error 1
  • error 123
  • make[1]: *** [Makefile:1852: /tmp/B.rbg4g098/BUILD/lttng-modules-2.13.4/lttng-modules-2.13.4/src] Error 2
  • error 124
  • error: Bad exit status from /tmp/B.rbg4g098/BUILD/tmp/rpm-tmp.IdHx34 (%build)
  • error 125
  • RPM build errors:
  • error 126
  • error: No files produced.

Content:

request from: baggins
checking if we should skip the build
started at: Fri Oct 28 16:31:21 2022
killing old processes on a builder
sending signal 9 to pid -1
cleaning up /tmp
fetching https://srcbuilder.pld-linux.org/th//srpms/f5f81ac1-fe4e-484d-8515-e92350930b9d/lttng-modules-2.13.4-3%406.0.5_1.src.rpm
fetched 361404 bytes, 864.5 K/s
installing srpm: lttng-modules-2.13.4-3@6.0.5_1.src.rpm
+ install -d /tmp/B.rbg4g098/BUILD /tmp/B.rbg4g098/RPMS
+ LC_ALL=en_US.UTF-8
+ rpm -qp --changelog lttng-modules-2.13.4-3@6.0.5_1.src.rpm
* Fri Oct 28 2022 PLD Linux Team <feedback@pld-linux.org>
- For complete changelog see: http://git.pld-linux.org/?p=packages/lttng-modules.git;a=log;h=auto/th/lttng-modules-2.13.4-3
* Sun Aug 28 2022 Jan Rękorajski <baggins@pld-linux.org> 695e001
- kernel 5.10 compatibility fix, rel 3 * Sat Aug 13 2022 Jan Rękorajski <baggins@pld-linux.org> ba894a6
- upstream fixes for kernel 5.19, rel 2 * Thu Jun 16 2022 Jan Rękorajski <baggins@pld-linux.org> 3496d32
- up to 2.13.4 * Wed May 25 2022 Jan Rękorajski <baggins@pld-linux.org> 5041df6
- upstream fixes for kernel 5.18 compatibility, rel 2 * Sat Apr 02 2022 Jan Rękorajski <baggins@pld-linux.org> 812c8d8
- up to 2.13.3 * Sat Jan 15 2022 Jan Rękorajski <baggins@pld-linux.org> 5ef7e51
- up to 2.13.1 * Sun Nov 07 2021 Jan Rękorajski <baggins@pld-linux.org> 84fe1df
- upstream fix for kernel 5.15, rel 4 * Tue Sep 07 2021 Jan Rękorajski <baggins@pld-linux.org> 1d12a08
- up to 2.13.0 final * Sun Jul 04 2021 Jan Rękorajski <baggins@pld-linux.org> 4b0bc27
- up to 2.13.0 rc2, rel 2 * Mon May 03 2021 Jan Rękorajski <baggins@pld-linux.org> 417a627
- up to 2.13.0-rc1 * Wed Feb 24 2021 Jan Rękorajski <baggins@pld-linux.org> 783d54c
- up to 2.12.5 * Sat Feb 06 2021 Jan Rękorajski <baggins@pld-linux.org> abf0d8a
- fix building with kernel 4.9.256 - rel 2 * Sat Nov 28 2020 Jan Rękorajski <baggins@pld-linux.org> b704ebb
- up to 2.2.13 + latest fixes * Sat Sep 26 2020 Jan Rękorajski <baggins@pld-linux.org> f9dfa75
- add fixes from upstream git with fixes to build modules on recent kernels - rel 2 * Sun Aug 16 2020 Jan Rękorajski <baggins@pld-linux.org> aa9cd3d
- up to 2.12.2 * Fri Jun 05 2020 Jan Rękorajski <baggins@pld-linux.org> 10babb8
- up to 2.12.1 * Tue Apr 14 2020 Jakub Bogusz <qboosh@pld-linux.org> 9a3ded0
- updated to 2.12.0 (for Linux 3.0+; ftrace integration dropped) - removed obsolete kernel-5.5.3 patch * Sat Apr 04 2020 Jan Rękorajski <baggins@pld-linux.org> 3efbae2
- up to 2.11.2 * Sun Feb 23 2020 Jan Rękorajski <baggins@pld-linux.org> 87b6b5d
- fix version macro * Sun Feb 23 2020 Jan Rękorajski <baggins@pld-linux.org> e66d568
- 4.14 doesn't need this + rpm -Uhv --nodeps --define '_topdir /tmp/B.rbg4g098' --define '_specdir %{_topdir}' --define '_sourcedir %{_specdir}' --define '_rpmdir %{_topdir}/RPMS' --define '_builddir %{_topdir}/BUILD' --without userspace --define 'build_kernels 5.4,4.19,head,4.14,4.9,5.10,5.15' lttng-modules-2.13.4-3@6.0.5_1.src.rpm Updating / installing... lttng-modules-2.13.4-3@6.0.5_1 ######################################## + rm -f lttng-modules-2.13.4-3@6.0.5_1.src.rpm + install -m 700 -d /tmp/B.rbg4g098/BUILD/tmp + TMPDIR=/tmp/B.rbg4g098/BUILD/tmp + exec nice -n 0 rpmbuild -bp --short-circuit --nodeps --define '_topdir /tmp/B.rbg4g098' --define '_specdir %{_topdir}' --define '_sourcedir %{_specdir}' --define '_rpmdir %{_topdir}/RPMS' --define '_builddir %{_topdir}/BUILD' --without userspace --target x86_64-pld-linux --define 'build_kernels 5.4,4.19,head,4.14,4.9,5.10,5.15' --define 'prep exit 0' /tmp/B.rbg4g098/lttng-modules.spec warning: Could not canonicalize hostname: ymir Building target platforms: x86_64-pld-linux Building for target x86_64-pld-linux RPM build warnings: Could not canonicalize hostname: ymir checking BuildConflict-ing packages rpm: warning: Could not canonicalize hostname: ymir rpm: Building target platforms: x86_64-pld-linux rpm: Building for target x86_64-pld-linux rpm: rpm: RPM build warnings: rpm: Could not canonicalize hostname: ymir no BuildConflicts found checking BR rpm: warning: Could not canonicalize hostname: ymir rpm: Building target platforms: x86_64-pld-linux rpm: Building for target x86_64-pld-linux rpm: rpm: RPM build warnings: rpm: Could not canonicalize hostname: ymir no BR needed building RPM using: set -ex; : build-id: f5f81ac1-fe4e-484d-8515-e92350930b9d; TMPDIR=/tmp/B.rbg4g098/BUILD/tmp exec nice -n 0 rpmbuild -bb --define '__jobs 28' --define '_smp_mflags -j28' --define '_make_opts -Otarget' --define '_pld_builder 1' --define '_topdir /tmp/B.rbg4g098' --define '_specdir %{_topdir}' --define '_sourcedir %{_specdir}' --define '_rpmdir %{_topdir}/RPMS' --define '_builddir %{_topdir}/BUILD' --without userspace --target x86_64-pld-linux --define 'build_kernels 5.4,4.19,head,4.14,4.9,5.10,5.15' /tmp/B.rbg4g098/lttng-modules.spec + : build-id: f5f81ac1-fe4e-484d-8515-e92350930b9d + TMPDIR=/tmp/B.rbg4g098/BUILD/tmp + exec nice -n 0 rpmbuild -bb --define '__jobs 28' --define '_smp_mflags -j28' --define '_make_opts -Otarget' --define '_pld_builder 1' --define '_topdir /tmp/B.rbg4g098' --define '_specdir %{_topdir}' --define '_sourcedir %{_specdir}' --define '_rpmdir %{_topdir}/RPMS' --define '_builddir %{_topdir}/BUILD' --without userspace --target x86_64-pld-linux --define 'build_kernels 5.4,4.19,head,4.14,4.9,5.10,5.15' /tmp/B.rbg4g098/lttng-modules.spec warning: Could not canonicalize hostname: ymir Building target platforms: x86_64-pld-linux Building for target x86_64-pld-linux Executing(%prep): /bin/sh -e /tmp/B.rbg4g098/BUILD/tmp/rpm-tmp.TQLzbp + umask 022 + cd /tmp/B.rbg4g098/BUILD + cd /tmp/B.rbg4g098/BUILD + rm -rf lttng-modules-2.13.4 + /bin/mkdir -p lttng-modules-2.13.4 + cd lttng-modules-2.13.4 + /usr/bin/bzip2 -dc /tmp/B.rbg4g098/lttng-modules-2.13.4.tar.bz2 + /bin/tar -xof - + STATUS=0 + '[' 0 -ne 0 ']' + /bin/chmod -Rf a+rX,u+w,g-w,o-w . + cd lttng-modules-2.13.4 + echo 'Patch #0 (build.patch):' Patch #0 (build.patch): + </tmp/B.rbg4g098/build.patch + /usr/bin/patch -s -f -p1 '--fuzz=0' + echo 'Patch #1 (kernel-5.19.patch):' Patch #1 (kernel-5.19.patch): + </tmp/B.rbg4g098/kernel-5.19.patch + /usr/bin/patch -s -f -p1 '--fuzz=0' + echo 'Patch #2 (kernel-5.10.137.patch):' Patch #2 (kernel-5.10.137.patch): + </tmp/B.rbg4g098/kernel-5.10.137.patch + /usr/bin/patch -s -f -p1 '--fuzz=0' + RPM_EC=0 + jobs -p + exit 0 Executing(%build): /bin/sh -e /tmp/B.rbg4g098/BUILD/tmp/rpm-tmp.IdHx34 TMP=/home/users/builder/tmp HOME=/home/users/builder PATH=/home/users/builder/GNUstep/Tools:/bin:/usr/bin:/usr/local/bin:/home/users/builder/bin TMPDIR=/tmp/B.rbg4g098/BUILD/tmp + umask 022 + cd /tmp/B.rbg4g098/BUILD + cd lttng-modules-2.13.4 + cd lttng-modules-2.13.4 + /usr/bin/make -Otarget -j28 clean 'KERNELDIR=/usr/src/linux-5.4' /usr/bin/make -C /usr/src/linux-5.4 M=/tmp/B.rbg4g098/BUILD/lttng-modules-2.13.4/lttng-modules-2.13.4/src clean + /usr/bin/make -Otarget -j28 'KERNELDIR=/usr/src/linux-5.4' /usr/bin/make -C /usr/src/linux-5.4 M=/tmp/B.rbg4g098/BUILD/lttng-modules-2.13.4/lttng-modules-2.13.4/src \ CONFIG_LTTNG=m CONFIG_LTTNG_CLOCK_PLUGIN_TEST=m \ KCPPFLAGS='' \ modules CC [M] /tmp/B.rbg4g098/BUILD/lttng-modules-2.13.4/lttng-modules-2.13.4/src/lttng-string-utils.o CC [M] /tmp/B.rbg4g098/BUILD/lttng-modules-2.13.4/lttng-modules-2.13.4/src/lib/msgpack/msgpack.o CC [M] /tmp/B.rbg4g098/BUILD/lttng-modules-2.13.4/lttng-modules-2.13.4/src/lttng-context-tid.o CC [M] /tmp/B.rbg4g098/BUILD/lttng-modules-2.13.4/lttng-modules-2.13.4/src/lttng-context-prio.o CC [M] /tmp/B.rbg4g098/BUILD/lttng-modules-2.13.4/lttng-modules-2.13.4/src/lttng-clock.o CC [M] /tmp/B.rbg4g098/BUILD/lttng-modules-2.13.4/lttng-modules-2.13.4/src/lttng-context-vpid.o CC [M] /tmp/B.rbg4g098/BUILD/lttng-modules-2.13.4/lttng-modules-2.13.4/src/lttng-context-nice.o CC [M] /tmp/B.rbg4g098/BUILD/lttng-modules-2.13.4/lttng-modules-2.13.4/src/lttng-context-vtid.o CC [M] /tmp/B.rbg4g098/BUILD/lttng-modules-2.13.4/lttng-modules-2.13.4/src/lttng-context-ppid.o CC [M] /tmp/B.rbg4g098/BUILD/lttng-modules-2.13.4/lttng-modules-2.13.4/src/lttng-probes.o CC [M] /tmp/B.rbg4g098/BUILD/lttng-modules-2.13.4/lttng-modules-2.13.4/src/lttng-counter-client-percpu-32-modular.o CC [M] /tmp/B.rbg4g098/BUILD/lttng-modules-2.13.4/lttng-modules-2.13.4/src/lttng-context-vppid.o CC [M] /tmp/B.rbg4g098/BUILD/lttng-modules-2.13.4/lttng-modules-2.13.4/src/lttng-context-pid.o CC [M] /tmp/B.rbg4g098/BUILD/lttng-modules-2.13.4/lttng-modules-2.13.4/src/lttng-counter-client-percpu-64-modular.o CC [M] /tmp/B.rbg4g098/BUILD/lttng-modules-2.13.4/lttng-modules-2.13.4/src/lttng-ring-buffer-event-notifier-client.o CC [M] /tmp/B.rbg4g098/BUILD/lttng-modules-2.13.4/lttng-modules-2.13.4/src/lttng-context-procname.o CC [M] /tmp/B.rbg4g098/BUILD/lttng-modules-2.13.4/lttng-modules-2.13.4/src/lttng-context.o CC [M] /tmp/B.rbg4g098/BUILD/lttng-modules-2.13.4/lttng-modules-2.13.4/src/lttng-context-cpu-id.o CC [M] /tmp/B.rbg4g098/BUILD/lttng-modules-2.13.4/lttng-modules-2.13.4/src/lttng-ring-buffer-metadata-client.o CC [M] /tmp/B.rbg4g098/BUILD/lttng-modules-2.13.4/lttng-modules-2.13.4/src/tests/probes/lttng-test.o CC [M] /tmp/B.rbg4g098/BUILD/lttng-modules-2.13.4/lttng-modules-2.13.4/src/lttng-context-uid.o LD [M] /tmp/B.rbg4g098/BUILD/lttng-modules-2.13.4/lttng-modules-2.13.4/src/tests/lttng-test.o CC [M] /tmp/B.rbg4g098/BUILD/lttng-modules-2.13.4/lttng-modules-2.13.4/src/lttng-ring-buffer-metadata-mmap-client.o CC [M] /tmp/B.rbg4g098/BUILD/lttng-modules-2.13.4/lttng-modules-2.13.4/src/lib/../wrapper/splice.o CC [M] /tmp/B.rbg4g098/BUILD/lttng-modules-2.13.4/lttng-modules-2.13.4/src/lib/ringbuffer/ring_buffer_mmap.o CC [M] /tmp/B.rbg4g098/BUILD/lttng-modules-2.13.4/lttng-modules-2.13.4/src/lttng-ring-buffer-client-mmap-overwrite.o CC [M] /tmp/B.rbg4g098/BUILD/lttng-modules-2.13.4/lttng-modules-2.13.4/src/lttng-ring-buffer-client-overwrite.o CC [M] /tmp/B.rbg4g098/BUILD/lttng-modules-2.13.4/lttng-modules-2.13.4/src/lttng-ring-buffer-client-mmap-discard.o CC [M] /tmp/B.rbg4g098/BUILD/lttng-modules-2.13.4/lttng-modules-2.13.4/src/lib/prio_heap/lttng_prio_heap.o CC [M] /tmp/B.rbg4g098/BUILD/lttng-modules-2.13.4/lttng-modules-2.13.4/src/lttng-abi.o CC [M] /tmp/B.rbg4g098/BUILD/lttng-modules-2.13.4/lttng-modules-2.13.4/src/lttng-ring-buffer-client-discard.o CC [M] /tmp/B.rbg4g098/BUILD/lttng-modules-2.13.4/lttng-modules-2.13.4/src/lib/ringbuffer/ring_buffer_backend.o CC [M] /tmp/B.rbg4g098/BUILD/lttng-modules-2.13.4/lttng-modules-2.13.4/src/lib/ringbuffer/ring_buffer_splice.o CC [M] /tmp/B.rbg4g098/BUILD/lttng-modules-2.13.4/lttng-modules-2.13.4/src/tests/clock-plugin/lttng-clock-plugin-test.o LD [M] /tmp/B.rbg4g098/BUILD/lttng-modules-2.13.4/lttng-modules-2.13.4/src/tests/lttng-clock-plugin-test.o CC [M] /tmp/B.rbg4g098/BUILD/lttng-modules-2.13.4/lttng-modules-2.13.4/src/lib/ringbuffer/ring_buffer_vfs.o CC [M] /tmp/B.rbg4g098/BUILD/lttng-modules-2.13.4/lttng-modules-2.13.4/src/lib/ringbuffer/ring_buffer_iterator.o CC [M] /tmp/B.rbg4g098/BUILD/lttng-modules-2.13.4/lttng-modules-2.13.4/src/probes/lttng-probe-irq.o CC [M] /tmp/B.rbg4g098/BUILD/lttng-modules-2.13.4/lttng-modules-2.13.4/src/lib/counter/counter.o CC [M] /tmp/B.rbg4g098/BUILD/lttng-modules-2.13.4/lttng-modules-2.13.4/src/lttng-context-suid.o CC [M] /tmp/B.rbg4g098/BUILD/lttng-modules-2.13.4/lttng-modules-2.13.4/src/lttng-context-gid.o LD [M] /tmp/B.rbg4g098/BUILD/lttng-modules-2.13.4/lttng-modules-2.13.4/src/lib/lttng-counter.o CC [M] /tmp/B.rbg4g098/BUILD/lttng-modules-2.13.4/lttng-modules-2.13.4/src/lttng-context-euid.o CC [M] /tmp/B.rbg4g098/BUILD/lttng-modules-2.13.4/lttng-modules-2.13.4/src/lttng-context-sgid.o CC [M] /tmp/B.rbg4g098/BUILD/lttng-modules-2.13.4/lttng-modules-2.13.4/src/lttng-context-egid.o CC [M] /tmp/B.rbg4g098/BUILD/lttng-modules-2.13.4/lttng-modules-2.13.4/src/lttng-context-vuid.o CC [M] /tmp/B.rbg4g098/BUILD/lttng-modules-2.13.4/lttng-modules-2.13.4/src/lttng-context-veuid.o CC [M] /tmp/B.rbg4g098/BUILD/lttng-modules-2.13.4/lttng-modules-2.13.4/src/lttng-context-vgid.o CC [M] /tmp/B.rbg4g098/BUILD/lttng-modules-2.13.4/lttng-modules-2.13.4/src/lttng-context-vsuid.o CC [M] /tmp/B.rbg4g098/BUILD/lttng-modules-2.13.4/lttng-modules-2.13.4/src/probes/lttng-probe-timer.o CC [M] /tmp/B.rbg4g098/BUILD/lttng-modules-2.13.4/lttng-modules-2.13.4/src/probes/lttng-probe-kmem.o CC [M] /tmp/B.rbg4g098/BUILD/lttng-modules-2.13.4/lttng-modules-2.13.4/src/lib/ringbuffer/ring_buffer_frontend.o CC [M] /tmp/B.rbg4g098/BUILD/lttng-modules-2.13.4/lttng-modules-2.13.4/src/probes/lttng-probe-sched.o LD [M] /tmp/B.rbg4g098/BUILD/lttng-modules-2.13.4/lttng-modules-2.13.4/src/lib/lttng-lib-ring-buffer.o CC [M] /tmp/B.rbg4g098/BUILD/lttng-modules-2.13.4/lttng-modules-2.13.4/src/lttng-calibrate.o CC [M] /tmp/B.rbg4g098/BUILD/lttng-modules-2.13.4/lttng-modules-2.13.4/src/lttng-context-vsgid.o CC [M] /tmp/B.rbg4g098/BUILD/lttng-modules-2.13.4/lttng-modules-2.13.4/src/lttng-context-vegid.o CC [M] /tmp/B.rbg4g098/BUILD/lttng-modules-2.13.4/lttng-modules-2.13.4/src/lttng-context-interruptible.o CC [M] /tmp/B.rbg4g098/BUILD/lttng-modules-2.13.4/lttng-modules-2.13.4/src/lttng-events.o CC [M] /tmp/B.rbg4g098/BUILD/lttng-modules-2.13.4/lttng-modules-2.13.4/src/lttng-context-need-reschedule.o CC [M] /tmp/B.rbg4g098/BUILD/lttng-modules-2.13.4/lttng-modules-2.13.4/src/probes/lttng-probe-module.o CC [M] /tmp/B.rbg4g098/BUILD/lttng-modules-2.13.4/lttng-modules-2.13.4/src/lttng-context-hostname.o CC [M] /tmp/B.rbg4g098/BUILD/lttng-modules-2.13.4/lttng-modules-2.13.4/src/probes/lttng-probe-x86-exceptions.o CC [M] /tmp/B.rbg4g098/BUILD/lttng-modules-2.13.4/lttng-modules-2.13.4/src/lttng-tracker-id.o CC [M] /tmp/B.rbg4g098/BUILD/lttng-modules-2.13.4/lttng-modules-2.13.4/src/probes/lttng.o CC [M] /tmp/B.rbg4g098/BUILD/lttng-modules-2.13.4/lttng-modules-2.13.4/src/lttng-context-callstack.o CC [M] /tmp/B.rbg4g098/BUILD/lttng-modules-2.13.4/lttng-modules-2.13.4/src/probes/lttng-probe-9p.o CC [M] /tmp/B.rbg4g098/BUILD/lttng-modules-2.13.4/lttng-modules-2.13.4/src/probes/lttng-probe-x86-irq-vectors.o CC [M] /tmp/B.rbg4g098/BUILD/lttng-modules-2.13.4/lttng-modules-2.13.4/src/lttng-tp-mempool.o CC [M] /tmp/B.rbg4g098/BUILD/lttng-modules-2.13.4/lttng-modules-2.13.4/src/lttng-bytecode.o CC [M] /tmp/B.rbg4g098/BUILD/lttng-modules-2.13.4/lttng-modules-2.13.4/src/probes/lttng-probe-user.o CC [M] /tmp/B.rbg4g098/BUILD/lttng-modules-2.13.4/lttng-modules-2.13.4/src/probes/lttng-probe-power.o CC [M] /tmp/B.rbg4g098/BUILD/lttng-modules-2.13.4/lttng-modules-2.13.4/src/probes/lttng-probe-i2c.o CC [M] /tmp/B.rbg4g098/BUILD/lttng-modules-2.13.4/lttng-modules-2.13.4/src/lttng-event-notifier-notification.o CC [M] /tmp/B.rbg4g098/BUILD/lttng-modules-2.13.4/lttng-modules-2.13.4/src/probes/lttng-probe-signal.o CC [M] /tmp/B.rbg4g098/BUILD/lttng-modules-2.13.4/lttng-modules-2.13.4/src/lttng-bytecode-specialize.o CC [M] /tmp/B.rbg4g098/BUILD/lttng-modules-2.13.4/lttng-modules-2.13.4/src/lttng-tracepoint.o CC [M] /tmp/B.rbg4g098/BUILD/lttng-modules-2.13.4/lttng-modules-2.13.4/src/lttng-bytecode-validator.o CC [M] /tmp/B.rbg4g098/BUILD/lttng-modules-2.13.4/lttng-modules-2.13.4/src/probes/lttng-probe-kvm-x86-mmu.o CC [M] /tmp/B.rbg4g098/BUILD/lttng-modules-2.13.4/lttng-modules-2.13.4/src/lttng-context-cgroup-ns.o CC [M] /tmp/B.rbg4g098/BUILD/lttng-modules-2.13.4/lttng-modules-2.13.4/src/probes/lttng-probe-kvm.o CC [M] /tmp/B.rbg4g098/BUILD/lttng-modules-2.13.4/lttng-modules-2.13.4/src/lttng-syscalls-enum.o CC [M] /tmp/B.rbg4g098/BUILD/lttng-modules-2.13.4/lttng-modules-2.13.4/src/lttng-context-perf-counters.o CC [M] /tmp/B.rbg4g098/BUILD/lttng-modules-2.13.4/lttng-modules-2.13.4/src/probes/lttng-probe-napi.o CC [M] /tmp/B.rbg4g098/BUILD/lttng-modules-2.13.4/lttng-modules-2.13.4/src/lttng-bytecode-interpreter.o CC [M] /tmp/B.rbg4g098/BUILD/lttng-modules-2.13.4/lttng-modules-2.13.4/src/lttng-context-ipc-ns.o CC [M] /tmp/B.rbg4g098/BUILD/lttng-modules-2.13.4/lttng-modules-2.13.4/src/probes/lttng-probe-skb.o CC [M] /tmp/B.rbg4g098/BUILD/lttng-modules-2.13.4/lttng-modules-2.13.4/src/probes/lttng-probe-statedump.o CC [M] /tmp/B.rbg4g098/BUILD/lttng-modules-2.13.4/lttng-modules-2.13.4/src/lttng-context-pid-ns.o CC [M] /tmp/B.rbg4g098/BUILD/lttng-modules-2.13.4/lttng-modules-2.13.4/src/lttng-context-user-ns.o CC [M] /tmp/B.rbg4g098/BUILD/lttng-modules-2.13.4/lttng-modules-2.13.4/src/lttng-context-net-ns.o CC [M] /tmp/B.rbg4g098/BUILD/lttng-modules-2.13.4/lttng-modules-2.13.4/src/wrapper/trace-clock.o CC [M] /tmp/B.rbg4g098/BUILD/lttng-modules-2.13.4/lttng-modules-2.13.4/src/lttng-context-uts-ns.o CC [M] /tmp/B.rbg4g098/BUILD/lttng-modules-2.13.4/lttng-modules-2.13.4/src/lttng-context-mnt-ns.o CC [M] /tmp/B.rbg4g098/BUILD/lttng-modules-2.13.4/lttng-modules-2.13.4/src/probes/lttng-probe-gpio.o CC [M] /tmp/B.rbg4g098/BUILD/lttng-modules-2.13.4/lttng-modules-2.13.4/src/wrapper/random.o CC [M] /tmp/B.rbg4g098/BUILD/lttng-modules-2.13.4/lttng-modules-2.13.4/src/probes/lttng-probe-net.o CC [M] /tmp/B.rbg4g098/BUILD/lttng-modules-2.13.4/lttng-modules-2.13.4/src/wrapper/page_alloc.o CC [M] /tmp/B.rbg4g098/BUILD/lttng-modules-2.13.4/lttng-modules-2.13.4/src/probes/lttng-probe-sock.o CC [M] /tmp/B.rbg4g098/BUILD/lttng-modules-2.13.4/lttng-modules-2.13.4/src/probes/lttng-probe-jbd2.o CC [M] /tmp/B.rbg4g098/BUILD/lttng-modules-2.13.4/lttng-modules-2.13.4/src/lttng-syscalls.o CC [M] /tmp/B.rbg4g098/BUILD/lttng-modules-2.13.4/lttng-modules-2.13.4/src/probes/lttng-probe-udp.o CC [M] /tmp/B.rbg4g098/BUILD/lttng-modules-2.13.4/lttng-modules-2.13.4/src/probes/lttng-probe-regulator.o CC [M] /tmp/B.rbg4g098/BUILD/lttng-modules-2.13.4/lttng-modules-2.13.4/src/wrapper/irqdesc.o CC [M] /tmp/B.rbg4g098/BUILD/lttng-modules-2.13.4/lttng-modules-2.13.4/src/probes/lttng-probe-asoc.o CC [M] /tmp/B.rbg4g098/BUILD/lttng-modules-2.13.4/lttng-modules-2.13.4/src/wrapper/kallsyms.o CC [M] /tmp/B.rbg4g098/BUILD/lttng-modules-2.13.4/lttng-modules-2.13.4/src/wrapper/fdtable.o CC [M] /tmp/B.rbg4g098/BUILD/lttng-modules-2.13.4/lttng-modules-2.13.4/src/probes/lttng-probe-printk.o CC [M] /tmp/B.rbg4g098/BUILD/lttng-modules-2.13.4/lttng-modules-2.13.4/src/lttng-wrapper-impl.o LD [M] /tmp/B.rbg4g098/BUILD/lttng-modules-2.13.4/lttng-modules-2.13.4/src/lttng-wrapper.o CC [M] /tmp/B.rbg4g098/BUILD/lttng-modules-2.13.4/lttng-modules-2.13.4/src/probes/lttng-probe-compaction.o CC [M] /tmp/B.rbg4g098/BUILD/lttng-modules-2.13.4/lttng-modules-2.13.4/src/probes/lttng-probe-scsi.o CC [M] /tmp/B.rbg4g098/BUILD/lttng-modules-2.13.4/lttng-modules-2.13.4/src/probes/lttng-probe-v4l2.o CC [M] /tmp/B.rbg4g098/BUILD/lttng-modules-2.13.4/lttng-modules-2.13.4/src/probes/lttng-kprobes.o CC [M] /tmp/B.rbg4g098/BUILD/lttng-modules-2.13.4/lttng-modules-2.13.4/src/probes/lttng-probe-rcu.o CC [M] /tmp/B.rbg4g098/BUILD/lttng-modules-2.13.4/lttng-modules-2.13.4/src/probes/lttng-probe-block.o CC [M] /tmp/B.rbg4g098/BUILD/lttng-modules-2.13.4/lttng-modules-2.13.4/src/probes/lttng-kretprobes.o CC [M] /tmp/B.rbg4g098/BUILD/lttng-modules-2.13.4/lttng-modules-2.13.4/src/probes/lttng-probe-kvm-x86.o CC [M] /tmp/B.rbg4g098/BUILD/lttng-modules-2.13.4/lttng-modules-2.13.4/src/probes/lttng-probe-regmap.o CC [M] /tmp/B.rbg4g098/BUILD/lttng-modules-2.13.4/lttng-modules-2.13.4/src/probes/lttng-probe-workqueue.o CC [M] /tmp/B.rbg4g098/BUILD/lttng-modules-2.13.4/lttng-modules-2.13.4/src/probes/lttng-uprobes.o CC [M] /tmp/B.rbg4g098/BUILD/lttng-modules-2.13.4/lttng-modules-2.13.4/src/probes/lttng-probe-vmscan.o CC [M] /tmp/B.rbg4g098/BUILD/lttng-modules-2.13.4/lttng-modules-2.13.4/src/probes/lttng-probe-sunrpc.o CC [M] /tmp/B.rbg4g098/BUILD/lttng-modules-2.13.4/lttng-modules-2.13.4/src/lttng-statedump-impl.o LD [M] /tmp/B.rbg4g098/BUILD/lttng-modules-2.13.4/lttng-modules-2.13.4/src/lttng-statedump.o CC [M] /tmp/B.rbg4g098/BUILD/lttng-modules-2.13.4/lttng-modules-2.13.4/src/probes/lttng-probe-writeback.o CC [M] /tmp/B.rbg4g098/BUILD/lttng-modules-2.13.4/lttng-modules-2.13.4/src/probes/lttng-probe-btrfs.o CC [M] /tmp/B.rbg4g098/BUILD/lttng-modules-2.13.4/lttng-modules-2.13.4/src/probes/lttng-probe-ext4.o CC [M] /tmp/B.rbg4g098/BUILD/lttng-modules-2.13.4/lttng-modules-2.13.4/src/lttng-syscalls-exit-table.o CC [M] /tmp/B.rbg4g098/BUILD/lttng-modules-2.13.4/lttng-modules-2.13.4/src/lttng-syscalls-exit-compat-table.o CC [M] /tmp/B.rbg4g098/BUILD/lttng-modules-2.13.4/lttng-modules-2.13.4/src/lttng-syscalls-entry-compat-table.o CC [M] /tmp/B.rbg4g098/BUILD/lttng-modules-2.13.4/lttng-modules-2.13.4/src/lttng-syscalls-entry-table.o LD [M] /tmp/B.rbg4g098/BUILD/lttng-modules-2.13.4/lttng-modules-2.13.4/src/lttng-tracer.o Building modules, stage 2. MODPOST 57 modules CC [M] /tmp/B.rbg4g098/BUILD/lttng-modules-2.13.4/lttng-modules-2.13.4/src/lttng-clock.mod.o CC [M] /tmp/B.rbg4g098/BUILD/lttng-modules-2.13.4/lttng-modules-2.13.4/src/lttng-ring-buffer-client-discard.mod.o CC [M] /tmp/B.rbg4g098/BUILD/lttng-modules-2.13.4/lttng-modules-2.13.4/src/lttng-ring-buffer-client-mmap-discard.mod.o CC [M] /tmp/B.rbg4g098/BUILD/lttng-modules-2.13.4/lttng-modules-2.13.4/src/lttng-ring-buffer-client-overwrite.mod.o CC [M] /tmp/B.rbg4g098/BUILD/lttng-modules-2.13.4/lttng-modules-2.13.4/src/lttng-statedump.mod.o CC [M] /tmp/B.rbg4g098/BUILD/lttng-modules-2.13.4/lttng-modules-2.13.4/src/probes/lttng-kretprobes.mod.o CC [M] /tmp/B.rbg4g098/BUILD/lttng-modules-2.13.4/lttng-modules-2.13.4/src/probes/lttng-probe-block.mod.o CC [M] /tmp/B.rbg4g098/BUILD/lttng-modules-2.13.4/lttng-modules-2.13.4/src/lttng-tracer.mod.o CC [M] /tmp/B.rbg4g098/BUILD/lttng-modules-2.13.4/lttng-modules-2.13.4/src/lttng-ring-buffer-event-notifier-client.mod.o CC [M] /tmp/B.rbg4g098/BUILD/lttng-modules-2.13.4/lttng-modules-2.13.4/src/probes/lttng-probe-ext4.mod.o CC [M] /tmp/B.rbg4g098/BUILD/lttng-modules-2.13.4/lttng-modules-2.13.4/src/probes/lttng-probe-i2c.mod.o CC [M] /tmp/B.rbg4g098/BUILD/lttng-modules-2.13.4/lttng-modules-2.13.4/src/lttng-ring-buffer-client-mmap-overwrite.mod.o CC [M] /tmp/B.rbg4g098/BUILD/lttng-modules-2.13.4/lttng-modules-2.13.4/src/lttng-counter-client-percpu-32-modular.mod.o CC [M] /tmp/B.rbg4g098/BUILD/lttng-modules-2.13.4/lttng-modules-2.13.4/src/lib/lttng-counter.mod.o CC [M] /tmp/B.rbg4g098/BUILD/lttng-modules-2.13.4/lttng-modules-2.13.4/src/probes/lttng-probe-btrfs.mod.o CC [M] /tmp/B.rbg4g098/BUILD/lttng-modules-2.13.4/lttng-modules-2.13.4/src/lib/lttng-lib-ring-buffer.mod.o CC [M] /tmp/B.rbg4g098/BUILD/lttng-modules-2.13.4/lttng-modules-2.13.4/src/lttng-wrapper.mod.o CC [M] /tmp/B.rbg4g098/BUILD/lttng-modules-2.13.4/lttng-modules-2.13.4/src/lttng-counter-client-percpu-64-modular.mod.o CC [M] /tmp/B.rbg4g098/BUILD/lttng-modules-2.13.4/lttng-modules-2.13.4/src/lttng-ring-buffer-metadata-client.mod.o CC [M] /tmp/B.rbg4g098/BUILD/lttng-modules-2.13.4/lttng-modules-2.13.4/src/probes/lttng-kprobes.mod.o CC [M] /tmp/B.rbg4g098/BUILD/lttng-modules-2.13.4/lttng-modules-2.13.4/src/probes/lttng-probe-9p.mod.o CC [M] /tmp/B.rbg4g098/BUILD/lttng-modules-2.13.4/lttng-modules-2.13.4/src/lttng-ring-buffer-metadata-mmap-client.mod.o CC [M] /tmp/B.rbg4g098/BUILD/lttng-modules-2.13.4/lttng-modules-2.13.4/src/probes/lttng-probe-asoc.mod.o CC [M] /tmp/B.rbg4g098/BUILD/lttng-modules-2.13.4/lttng-modules-2.13.4/src/probes/lttng-probe-gpio.mod.o CC [M] /tmp/B.rbg4g098/BUILD/lttng-modules-2.13.4/lttng-modules-2.13.4/src/probes/lttng-probe-jbd2.mod.o CC [M] /tmp/B.rbg4g098/BUILD/lttng-modules-2.13.4/lttng-modules-2.13.4/src/probes/lttng-probe-kmem.mod.o CC [M] /tmp/B.rbg4g098/BUILD/lttng-modules-2.13.4/lttng-modules-2.13.4/src/probes/lttng-probe-irq.mod.o CC [M] /tmp/B.rbg4g098/BUILD/lttng-modules-2.13.4/lttng-modules-2.13.4/src/probes/lttng-probe-compaction.mod.o CC [M] /tmp/B.rbg4g098/BUILD/lttng-modules-2.13.4/lttng-modules-2.13.4/src/probes/lttng-probe-kvm-x86-mmu.mod.o CC [M] /tmp/B.rbg4g098/BUILD/lttng-modules-2.13.4/lttng-modules-2.13.4/src/probes/lttng-probe-printk.mod.o CC [M] /tmp/B.rbg4g098/BUILD/lttng-modules-2.13.4/lttng-modules-2.13.4/src/probes/lttng-probe-napi.mod.o CC [M] /tmp/B.rbg4g098/BUILD/lttng-modules-2.13.4/lttng-modules-2.13.4/src/probes/lttng-probe-kvm.mod.o LD [M] /tmp/B.rbg4g098/BUILD/lttng-modules-2.13.4/lttng-modules-2.13.4/src/lib/lttng-counter.ko LD [M] /tmp/B.rbg4g098/BUILD/lttng-modules-2.13.4/lttng-modules-2.13.4/src/lib/lttng-lib-ring-buffer.ko LD [M] /tmp/B.rbg4g098/BUILD/lttng-modules-2.13.4/lttng-modules-2.13.4/src/lttng-clock.ko CC [M] /tmp/B.rbg4g098/BUILD/lttng-modules-2.13.4/lttng-modules-2.13.4/src/probes/lttng-probe-module.mod.o LD [M] /tmp/B.rbg4g098/BUILD/lttng-modules-2.13.4/lttng-modules-2.13.4/src/lttng-counter-client-percpu-32-modular.ko CC [M] /tmp/B.rbg4g098/BUILD/lttng-modules-2.13.4/lttng-modules-2.13.4/src/probes/lttng-probe-regmap.mod.o LD [M] /tmp/B.rbg4g098/BUILD/lttng-modules-2.13.4/lttng-modules-2.13.4/src/lttng-counter-client-percpu-64-modular.ko CC [M] /tmp/B.rbg4g098/BUILD/lttng-modules-2.13.4/lttng-modules-2.13.4/src/probes/lttng-probe-kvm-x86.mod.o LD [M] /tmp/B.rbg4g098/BUILD/lttng-modules-2.13.4/lttng-modules-2.13.4/src/lttng-ring-buffer-client-discard.ko LD [M] /tmp/B.rbg4g098/BUILD/lttng-modules-2.13.4/lttng-modules-2.13.4/src/lttng-ring-buffer-client-mmap-discard.ko LD [M] /tmp/B.rbg4g098/BUILD/lttng-modules-2.13.4/lttng-modules-2.13.4/src/lttng-ring-buffer-client-mmap-overwrite.ko LD [M] /tmp/B.rbg4g098/BUILD/lttng-modules-2.13.4/lttng-modules-2.13.4/src/lttng-ring-buffer-client-overwrite.ko LD [M] /tmp/B.rbg4g098/BUILD/lttng-modules-2.13.4/lttng-modules-2.13.4/src/lttng-ring-buffer-event-notifier-client.ko LD [M] /tmp/B.rbg4g098/BUILD/lttng-modules-2.13.4/lttng-modules-2.13.4/src/lttng-ring-buffer-metadata-client.ko LD [M] /tmp/B.rbg4g098/BUILD/lttng-modules-2.13.4/lttng-modules-2.13.4/src/lttng-ring-buffer-metadata-mmap-client.ko LD [M] /tmp/B.rbg4g098/BUILD/lttng-modules-2.13.4/lttng-modules-2.13.4/src/lttng-statedump.ko LD [M] /tmp/B.rbg4g098/BUILD/lttng-modules-2.13.4/lttng-modules-2.13.4/src/lttng-tracer.ko LD [M] /tmp/B.rbg4g098/BUILD/lttng-modules-2.13.4/lttng-modules-2.13.4/src/lttng-wrapper.ko LD [M] /tmp/B.rbg4g098/BUILD/lttng-modules-2.13.4/lttng-modules-2.13.4/src/probes/lttng-kprobes.ko LD [M] /tmp/B.rbg4g098/BUILD/lttng-modules-2.13.4/lttng-modules-2.13.4/src/probes/lttng-kretprobes.ko LD [M] /tmp/B.rbg4g098/BUILD/lttng-modules-2.13.4/lttng-modules-2.13.4/src/probes/lttng-probe-9p.ko LD [M] /tmp/B.rbg4g098/BUILD/lttng-modules-2.13.4/lttng-modules-2.13.4/src/probes/lttng-probe-asoc.ko LD [M] /tmp/B.rbg4g098/BUILD/lttng-modules-2.13.4/lttng-modules-2.13.4/src/probes/lttng-probe-block.ko LD [M] /tmp/B.rbg4g098/BUILD/lttng-modules-2.13.4/lttng-modules-2.13.4/src/probes/lttng-probe-btrfs.ko LD [M] /tmp/B.rbg4g098/BUILD/lttng-modules-2.13.4/lttng-modules-2.13.4/src/probes/lttng-probe-compaction.ko LD [M] /tmp/B.rbg4g098/BUILD/lttng-modules-2.13.4/lttng-modules-2.13.4/src/probes/lttng-probe-ext4.ko LD [M] /tmp/B.rbg4g098/BUILD/lttng-modules-2.13.4/lttng-modules-2.13.4/src/probes/lttng-probe-gpio.ko LD [M] /tmp/B.rbg4g098/BUILD/lttng-modules-2.13.4/lttng-modules-2.13.4/src/probes/lttng-probe-i2c.ko CC [M] /tmp/B.rbg4g098/BUILD/lttng-modules-2.13.4/lttng-modules-2.13.4/src/probes/lttng-probe-scsi.mod.o LD [M] /tmp/B.rbg4g098/BUILD/lttng-modules-2.13.4/lttng-modules-2.13.4/src/probes/lttng-probe-irq.ko LD [M] /tmp/B.rbg4g098/BUILD/lttng-modules-2.13.4/lttng-modules-2.13.4/src/probes/lttng-probe-jbd2.ko LD [M] /tmp/B.rbg4g098/BUILD/lttng-modules-2.13.4/lttng-modules-2.13.4/src/probes/lttng-probe-kmem.ko LD [M] /tmp/B.rbg4g098/BUILD/lttng-modules-2.13.4/lttng-modules-2.13.4/src/probes/lttng-probe-kvm-x86-mmu.ko LD [M] /tmp/B.rbg4g098/BUILD/lttng-modules-2.13.4/lttng-modules-2.13.4/src/probes/lttng-probe-kvm-x86.ko LD [M] /tmp/B.rbg4g098/BUILD/lttng-modules-2.13.4/lttng-modules-2.13.4/src/probes/lttng-probe-kvm.ko LD [M] /tmp/B.rbg4g098/BUILD/lttng-modules-2.13.4/lttng-modules-2.13.4/src/probes/lttng-probe-module.ko LD [M] /tmp/B.rbg4g098/BUILD/lttng-modules-2.13.4/lttng-modules-2.13.4/src/probes/lttng-probe-napi.ko LD [M] /tmp/B.rbg4g098/BUILD/lttng-modules-2.13.4/lttng-modules-2.13.4/src/probes/lttng-probe-printk.ko LD [M] /tmp/B.rbg4g098/BUILD/lttng-modules-2.13.4/lttng-modules-2.13.4/src/probes/lttng-probe-regmap.ko LD [M] /tmp/B.rbg4g098/BUILD/lttng-modules-2.13.4/lttng-modules-2.13.4/src/probes/lttng-probe-scsi.ko CC [M] /tmp/B.rbg4g098/BUILD/lttng-modules-2.13.4/lttng-modules-2.13.4/src/probes/lttng-probe-skb.mod.o LD [M] /tmp/B.rbg4g098/BUILD/lttng-modules-2.13.4/lttng-modules-2.13.4/src/probes/lttng-probe-skb.ko CC [M] /tmp/B.rbg4g098/BUILD/lttng-modules-2.13.4/lttng-modules-2.13.4/src/probes/lttng-probe-net.mod.o CC [M] /tmp/B.rbg4g098/BUILD/lttng-modules-2.13.4/lttng-modules-2.13.4/src/probes/lttng-probe-sock.mod.o LD [M] /tmp/B.rbg4g098/BUILD/lttng-modules-2.13.4/lttng-modules-2.13.4/src/probes/lttng-probe-net.ko LD [M] /tmp/B.rbg4g098/BUILD/lttng-modules-2.13.4/lttng-modules-2.13.4/src/probes/lttng-probe-sock.ko CC [M] /tmp/B.rbg4g098/BUILD/lttng-modules-2.13.4/lttng-modules-2.13.4/src/probes/lttng-probe-rcu.mod.o LD [M] /tmp/B.rbg4g098/BUILD/lttng-modules-2.13.4/lttng-modules-2.13.4/src/probes/lttng-probe-rcu.ko CC [M] /tmp/B.rbg4g098/BUILD/lttng-modules-2.13.4/lttng-modules-2.13.4/src/probes/lttng-probe-regulator.mod.o CC [M] /tmp/B.rbg4g098/BUILD/lttng-modules-2.13.4/lttng-modules-2.13.4/src/probes/lttng-probe-power.mod.o LD [M] /tmp/B.rbg4g098/BUILD/lttng-modules-2.13.4/lttng-modules-2.13.4/src/probes/lttng-probe-power.ko LD [M] /tmp/B.rbg4g098/BUILD/lttng-modules-2.13.4/lttng-modules-2.13.4/src/probes/lttng-probe-regulator.ko CC [M] /tmp/B.rbg4g098/BUILD/lttng-modules-2.13.4/lttng-modules-2.13.4/src/probes/lttng-probe-sched.mod.o LD [M] /tmp/B.rbg4g098/BUILD/lttng-modules-2.13.4/lttng-modules-2.13.4/src/probes/lttng-probe-sched.ko CC [M] /tmp/B.rbg4g098/BUILD/lttng-modules-2.13.4/lttng-modules-2.13.4/src/probes/lttng-probe-x86-irq-vectors.mod.o LD [M] /tmp/B.rbg4g098/BUILD/lttng-modules-2.13.4/lttng-modules-2.13.4/src/probes/lttng-probe-x86-irq-vectors.ko CC [M] /tmp/B.rbg4g098/BUILD/lttng-modules-2.13.4/lttng-modules-2.13.4/src/probes/lttng-probe-signal.mod.o CC [M] /tmp/B.rbg4g098/BUILD/lttng-modules-2.13.4/lttng-modules-2.13.4/src/tests/lttng-clock-plugin-test.mod.o LD [M] /tmp/B.rbg4g098/BUILD/lttng-modules-2.13.4/lttng-modules-2.13.4/src/probes/lttng-probe-signal.ko CC [M] /tmp/B.rbg4g098/BUILD/lttng-modules-2.13.4/lttng-modules-2.13.4/src/probes/lttng-probe-sunrpc.mod.o LD [M] /tmp/B.rbg4g098/BUILD/lttng-modules-2.13.4/lttng-modules-2.13.4/src/tests/lttng-clock-plugin-test.ko LD [M] /tmp/B.rbg4g098/BUILD/lttng-modules-2.13.4/lttng-modules-2.13.4/src/probes/lttng-probe-sunrpc.ko CC [M] /tmp/B.rbg4g098/BUILD/lttng-modules-2.13.4/lttng-modules-2.13.4/src/probes/lttng-probe-v4l2.mod.o CC [M] /tmp/B.rbg4g098/BUILD/lttng-modules-2.13.4/lttng-modules-2.13.4/src/probes/lttng-probe-vmscan.mod.o LD [M] /tmp/B.rbg4g098/BUILD/lttng-modules-2.13.4/lttng-modules-2.13.4/src/probes/lttng-probe-v4l2.ko CC [M] /tmp/B.rbg4g098/BUILD/lttng-modules-2.13.4/lttng-modules-2.13.4/src/probes/lttng-probe-workqueue.mod.o LD [M] /tmp/B.rbg4g098/BUILD/lttng-modules-2.13.4/lttng-modules-2.13.4/src/probes/lttng-probe-vmscan.ko LD [M] /tmp/B.rbg4g098/BUILD/lttng-modules-2.13.4/lttng-modules-2.13.4/src/probes/lttng-probe-workqueue.ko CC [M] /tmp/B.rbg4g098/BUILD/lttng-modules-2.13.4/lttng-modules-2.13.4/src/probes/lttng-probe-writeback.mod.o LD [M] /tmp/B.rbg4g098/BUILD/lttng-modules-2.13.4/lttng-modules-2.13.4/src/probes/lttng-probe-writeback.ko CC [M] /tmp/B.rbg4g098/BUILD/lttng-modules-2.13.4/lttng-modules-2.13.4/src/probes/lttng-probe-statedump.mod.o LD [M] /tmp/B.rbg4g098/BUILD/lttng-modules-2.13.4/lttng-modules-2.13.4/src/probes/lttng-probe-statedump.ko CC [M] /tmp/B.rbg4g098/BUILD/lttng-modules-2.13.4/lttng-modules-2.13.4/src/probes/lttng-probe-timer.mod.o LD [M] /tmp/B.rbg4g098/BUILD/lttng-modules-2.13.4/lttng-modules-2.13.4/src/probes/lttng-probe-timer.ko CC [M] /tmp/B.rbg4g098/BUILD/lttng-modules-2.13.4/lttng-modules-2.13.4/src/probes/lttng-probe-x86-exceptions.mod.o LD [M] /tmp/B.rbg4g098/BUILD/lttng-modules-2.13.4/lttng-modules-2.13.4/src/probes/lttng-probe-x86-exceptions.ko CC [M] /tmp/B.rbg4g098/BUILD/lttng-modules-2.13.4/lttng-modules-2.13.4/src/probes/lttng-uprobes.mod.o LD [M] /tmp/B.rbg4g098/BUILD/lttng-modules-2.13.4/lttng-modules-2.13.4/src/probes/lttng-uprobes.ko CC [M] /tmp/B.rbg4g098/BUILD/lttng-modules-2.13.4/lttng-modules-2.13.4/src/probes/lttng-probe-udp.mod.o LD [M] /tmp/B.rbg4g098/BUILD/lttng-modules-2.13.4/lttng-modules-2.13.4/src/probes/lttng-probe-udp.ko CC [M] /tmp/B.rbg4g098/BUILD/lttng-modules-2.13.4/lttng-modules-2.13.4/src/tests/lttng-test.mod.o LD [M] /tmp/B.rbg4g098/BUILD/lttng-modules-2.13.4/lttng-modules-2.13.4/src/tests/lttng-test.ko + pwd + p=/tmp/B.rbg4g098/BUILD/lttng-modules-2.13.4/lttng-modules-2.13.4 + /usr/bin/make -Otarget -j28 modules_install 'INSTALL_MOD_PATH=/tmp/B.rbg4g098/BUILD/lttng-modules-2.13.4/lttng-modules-2.13.4/../installed' 'INSTALL_MOD_DIR=kernel/lttng' 'KERNELDIR=/usr/src/linux-5.4' /usr/bin/make -C /usr/src/linux-5.4 M=/tmp/B.rbg4g098/BUILD/lttng-modules-2.13.4/lttng-modules-2.13.4/src \ CONFIG_LTTNG=m CONFIG_LTTNG_CLOCK_PLUGIN_TEST=m \ KCPPFLAGS='' \ modules_install INSTALL /tmp/B.rbg4g098/BUILD/lttng-modules-2.13.4/lttng-modules-2.13.4/src/lib/lttng-counter.ko At main.c:160: - SSL error:FFFFFFFF80000002:system library::No such file or directory: crypto/bio/bss_file.c:67 - SSL error:10000080:BIO routines::no such file: crypto/bio/bss_file.c:75 sign-file: certs/signing_key.pem: No such file or directory INSTALL /tmp/B.rbg4g098/BUILD/lttng-modules-2.13.4/lttng-modules-2.13.4/src/lttng-clock.ko At main.c:160: - SSL error:FFFFFFFF80000002:system library::No such file or directory: crypto/bio/bss_file.c:67 - SSL error:10000080:BIO routines::no such file: crypto/bio/bss_file.c:75 sign-file: certs/signing_key.pem: No such file or directory INSTALL /tmp/B.rbg4g098/BUILD/lttng-modules-2.13.4/lttng-modules-2.13.4/src/lttng-wrapper.ko At main.c:160: - SSL error:FFFFFFFF80000002:system library::No such file or directory: crypto/bio/bss_file.c:67 - SSL error:10000080:BIO routines::no such file: crypto/bio/bss_file.c:75 sign-file: certs/signing_key.pem: No such file or directory INSTALL /tmp/B.rbg4g098/BUILD/lttng-modules-2.13.4/lttng-modules-2.13.4/src/lttng-counter-client-percpu-32-modular.ko At main.c:160: - SSL error:FFFFFFFF80000002:system library::No such file or directory: crypto/bio/bss_file.c:67 - SSL error:10000080:BIO routines::no such file: crypto/bio/bss_file.c:75 sign-file: certs/signing_key.pem: No such file or directory INSTALL /tmp/B.rbg4g098/BUILD/lttng-modules-2.13.4/lttng-modules-2.13.4/src/probes/lttng-kretprobes.ko At main.c:160: - SSL error:FFFFFFFF80000002:system library::No such file or directory: crypto/bio/bss_file.c:67 - SSL error:10000080:BIO routines::no such file: crypto/bio/bss_file.c:75 sign-file: certs/signing_key.pem: No such file or directory INSTALL /tmp/B.rbg4g098/BUILD/lttng-modules-2.13.4/lttng-modules-2.13.4/src/lttng-counter-client-percpu-64-modular.ko At main.c:160: - SSL error:FFFFFFFF80000002:system library::No such file or directory: crypto/bio/bss_file.c:67 - SSL error:10000080:BIO routines::no such file: crypto/bio/bss_file.c:75 sign-file: certs/signing_key.pem: No such file or directory INSTALL /tmp/B.rbg4g098/BUILD/lttng-modules-2.13.4/lttng-modules-2.13.4/src/lttng-ring-buffer-event-notifier-client.ko At main.c:160: - SSL error:FFFFFFFF80000002:system library::No such file or directory: crypto/bio/bss_file.c:67 - SSL error:10000080:BIO routines::no such file: crypto/bio/bss_file.c:75 sign-file: certs/signing_key.pem: No such file or directory INSTALL /tmp/B.rbg4g098/BUILD/lttng-modules-2.13.4/lttng-modules-2.13.4/src/probes/lttng-kprobes.ko At main.c:160: - SSL error:FFFFFFFF80000002:system library::No such file or directory: crypto/bio/bss_file.c:67 - SSL error:10000080:BIO routines::no such file: crypto/bio/bss_file.c:75 sign-file: certs/signing_key.pem: No such file or directory INSTALL /tmp/B.rbg4g098/BUILD/lttng-modules-2.13.4/lttng-modules-2.13.4/src/probes/lttng-probe-gpio.ko At main.c:160: - SSL error:FFFFFFFF80000002:system library::No such file or directory: crypto/bio/bss_file.c:67 - SSL error:10000080:BIO routines::no such file: crypto/bio/bss_file.c:75 sign-file: certs/signing_key.pem: No such file or directory INSTALL /tmp/B.rbg4g098/BUILD/lttng-modules-2.13.4/lttng-modules-2.13.4/src/lttng-ring-buffer-client-mmap-discard.ko At main.c:160: - SSL error:FFFFFFFF80000002:system library::No such file or directory: crypto/bio/bss_file.c:67 - SSL error:10000080:BIO routines::no such file: crypto/bio/bss_file.c:75 sign-file: certs/signing_key.pem: No such file or directory INSTALL /tmp/B.rbg4g098/BUILD/lttng-modules-2.13.4/lttng-modules-2.13.4/src/probes/lttng-probe-compaction.ko At main.c:160: - SSL error:FFFFFFFF80000002:system library::No such file or directory: crypto/bio/bss_file.c:67 - SSL error:10000080:BIO routines::no such file: crypto/bio/bss_file.c:75 sign-file: certs/signing_key.pem: No such file or directory INSTALL /tmp/B.rbg4g098/BUILD/lttng-modules-2.13.4/lttng-modules-2.13.4/src/lttng-ring-buffer-metadata-client.ko At main.c:160: - SSL error:FFFFFFFF80000002:system library::No such file or directory: crypto/bio/bss_file.c:67 - SSL error:10000080:BIO routines::no such file: crypto/bio/bss_file.c:75 sign-file: certs/signing_key.pem: No such file or directory INSTALL /tmp/B.rbg4g098/BUILD/lttng-modules-2.13.4/lttng-modules-2.13.4/src/lttng-ring-buffer-client-discard.ko At main.c:160: - SSL error:FFFFFFFF80000002:system library::No such file or directory: crypto/bio/bss_file.c:67 - SSL error:10000080:BIO routines::no such file: crypto/bio/bss_file.c:75 sign-file: certs/signing_key.pem: No such file or directory INSTALL /tmp/B.rbg4g098/BUILD/lttng-modules-2.13.4/lttng-modules-2.13.4/src/lttng-statedump.ko At main.c:160: - SSL error:FFFFFFFF80000002:system library::No such file or directory: crypto/bio/bss_file.c:67 - SSL error:10000080:BIO routines::no such file: crypto/bio/bss_file.c:75 sign-file: certs/signing_key.pem: No such file or directory INSTALL /tmp/B.rbg4g098/BUILD/lttng-modules-2.13.4/lttng-modules-2.13.4/src/lttng-ring-buffer-client-overwrite.ko At main.c:160: - SSL error:FFFFFFFF80000002:system library::No such file or directory: crypto/bio/bss_file.c:67 - SSL error:10000080:BIO routines::no such file: crypto/bio/bss_file.c:75 sign-file: certs/signing_key.pem: No such file or directory INSTALL /tmp/B.rbg4g098/BUILD/lttng-modules-2.13.4/lttng-modules-2.13.4/src/probes/lttng-probe-9p.ko At main.c:160: - SSL error:FFFFFFFF80000002:system library::No such file or directory: crypto/bio/bss_file.c:67 - SSL error:10000080:BIO routines::no such file: crypto/bio/bss_file.c:75 sign-file: certs/signing_key.pem: No such file or directory INSTALL /tmp/B.rbg4g098/BUILD/lttng-modules-2.13.4/lttng-modules-2.13.4/src/lttng-ring-buffer-client-mmap-overwrite.ko At main.c:160: - SSL error:FFFFFFFF80000002:system library::No such file or directory: crypto/bio/bss_file.c:67 - SSL error:10000080:BIO routines::no such file: crypto/bio/bss_file.c:75 sign-file: certs/signing_key.pem: No such file or directory INSTALL /tmp/B.rbg4g098/BUILD/lttng-modules-2.13.4/lttng-modules-2.13.4/src/probes/lttng-probe-irq.ko At main.c:160: - SSL error:FFFFFFFF80000002:system library::No such file or directory: crypto/bio/bss_file.c:67 - SSL error:10000080:BIO routines::no such file: crypto/bio/bss_file.c:75 sign-file: certs/signing_key.pem: No such file or directory INSTALL /tmp/B.rbg4g098/BUILD/lttng-modules-2.13.4/lttng-modules-2.13.4/src/lttng-ring-buffer-metadata-mmap-client.ko At main.c:160: - SSL error:FFFFFFFF80000002:system library::No such file or directory: crypto/bio/bss_file.c:67 - SSL error:10000080:BIO routines::no such file: crypto/bio/bss_file.c:75 sign-file: certs/signing_key.pem: No such file or directory INSTALL /tmp/B.rbg4g098/BUILD/lttng-modules-2.13.4/lttng-modules-2.13.4/src/probes/lttng-probe-i2c.ko At main.c:160: - SSL error:FFFFFFFF80000002:system library::No such file or directory: crypto/bio/bss_file.c:67 - SSL error:10000080:BIO routines::no such file: crypto/bio/bss_file.c:75 sign-file: certs/signing_key.pem: No such file or directory INSTALL /tmp/B.rbg4g098/BUILD/lttng-modules-2.13.4/lttng-modules-2.13.4/src/probes/lttng-probe-asoc.ko At main.c:160: - SSL error:FFFFFFFF80000002:system library::No such file or directory: crypto/bio/bss_file.c:67 - SSL error:10000080:BIO routines::no such file: crypto/bio/bss_file.c:75 sign-file: certs/signing_key.pem: No such file or directory INSTALL /tmp/B.rbg4g098/BUILD/lttng-modules-2.13.4/lttng-modules-2.13.4/src/probes/lttng-probe-printk.ko At main.c:160: - SSL error:FFFFFFFF80000002:system library::No such file or directory: crypto/bio/bss_file.c:67 - SSL error:10000080:BIO routines::no such file: crypto/bio/bss_file.c:75 sign-file: certs/signing_key.pem: No such file or directory INSTALL /tmp/B.rbg4g098/BUILD/lttng-modules-2.13.4/lttng-modules-2.13.4/src/probes/lttng-probe-napi.ko At main.c:160: - SSL error:FFFFFFFF80000002:system library::No such file or directory: crypto/bio/bss_file.c:67 - SSL error:10000080:BIO routines::no such file: crypto/bio/bss_file.c:75 sign-file: certs/signing_key.pem: No such file or directory INSTALL /tmp/B.rbg4g098/BUILD/lttng-modules-2.13.4/lttng-modules-2.13.4/src/probes/lttng-probe-jbd2.ko At main.c:160: - SSL error:FFFFFFFF80000002:system library::No such file or directory: crypto/bio/bss_file.c:67 - SSL error:10000080:BIO routines::no such file: crypto/bio/bss_file.c:75 sign-file: certs/signing_key.pem: No such file or directory INSTALL /tmp/B.rbg4g098/BUILD/lttng-modules-2.13.4/lttng-modules-2.13.4/src/probes/lttng-probe-rcu.ko At main.c:160: - SSL error:FFFFFFFF80000002:system library::No such file or directory: crypto/bio/bss_file.c:67 - SSL error:10000080:BIO routines::no such file: crypto/bio/bss_file.c:75 sign-file: certs/signing_key.pem: No such file or directory INSTALL /tmp/B.rbg4g098/BUILD/lttng-modules-2.13.4/lttng-modules-2.13.4/src/probes/lttng-probe-module.ko At main.c:160: - SSL error:FFFFFFFF80000002:system library::No such file or directory: crypto/bio/bss_file.c:67 - SSL error:10000080:BIO routines::no such file: crypto/bio/bss_file.c:75 sign-file: certs/signing_key.pem: No such file or directory INSTALL /tmp/B.rbg4g098/BUILD/lttng-modules-2.13.4/lttng-modules-2.13.4/src/probes/lttng-probe-kmem.ko At main.c:160: - SSL error:FFFFFFFF80000002:system library::No such file or directory: crypto/bio/bss_file.c:67 - SSL error:10000080:BIO routines::no such file: crypto/bio/bss_file.c:75 sign-file: certs/signing_key.pem: No such file or directory INSTALL /tmp/B.rbg4g098/BUILD/lttng-modules-2.13.4/lttng-modules-2.13.4/src/probes/lttng-probe-regulator.ko At main.c:160: - SSL error:FFFFFFFF80000002:system library::No such file or directory: crypto/bio/bss_file.c:67 - SSL error:10000080:BIO routines::no such file: crypto/bio/bss_file.c:75 sign-file: certs/signing_key.pem: No such file or directory INSTALL /tmp/B.rbg4g098/BUILD/lttng-modules-2.13.4/lttng-modules-2.13.4/src/probes/lttng-probe-net.ko At main.c:160: - SSL error:FFFFFFFF80000002:system library::No such file or directory: crypto/bio/bss_file.c:67 - SSL error:10000080:BIO routines::no such file: crypto/bio/bss_file.c:75 sign-file: certs/signing_key.pem: No such file or directory INSTALL /tmp/B.rbg4g098/BUILD/lttng-modules-2.13.4/lttng-modules-2.13.4/src/probes/lttng-probe-power.ko At main.c:160: - SSL error:FFFFFFFF80000002:system library::No such file or directory: crypto/bio/bss_file.c:67 - SSL error:10000080:BIO routines::no such file: crypto/bio/bss_file.c:75 sign-file: certs/signing_key.pem: No such file or directory INSTALL /tmp/B.rbg4g098/BUILD/lttng-modules-2.13.4/lttng-modules-2.13.4/src/probes/lttng-probe-block.ko At main.c:160: - SSL error:FFFFFFFF80000002:system library::No such file or directory: crypto/bio/bss_file.c:67 - SSL error:10000080:BIO routines::no such file: crypto/bio/bss_file.c:75 sign-file: certs/signing_key.pem: No such file or directory INSTALL /tmp/B.rbg4g098/BUILD/lttng-modules-2.13.4/lttng-modules-2.13.4/src/probes/lttng-probe-regmap.ko At main.c:160: - SSL error:FFFFFFFF80000002:system library::No such file or directory: crypto/bio/bss_file.c:67 - SSL error:10000080:BIO routines::no such file: crypto/bio/bss_file.c:75 sign-file: certs/signing_key.pem: No such file or directory INSTALL /tmp/B.rbg4g098/BUILD/lttng-modules-2.13.4/lttng-modules-2.13.4/src/probes/lttng-probe-sock.ko At main.c:160: - SSL error:FFFFFFFF80000002:system library::No such file or directory: crypto/bio/bss_file.c:67 - SSL error:10000080:BIO routines::no such file: crypto/bio/bss_file.c:75 sign-file: certs/signing_key.pem: No such file or directory INSTALL /tmp/B.rbg4g098/BUILD/lttng-modules-2.13.4/lttng-modules-2.13.4/src/probes/lttng-probe-signal.ko At main.c:160: - SSL error:FFFFFFFF80000002:system library::No such file or directory: crypto/bio/bss_file.c:67 - SSL error:10000080:BIO routines::no such file: crypto/bio/bss_file.c:75 sign-file: certs/signing_key.pem: No such file or directory INSTALL /tmp/B.rbg4g098/BUILD/lttng-modules-2.13.4/lttng-modules-2.13.4/src/probes/lttng-probe-kvm.ko At main.c:160: - SSL error:FFFFFFFF80000002:system library::No such file or directory: crypto/bio/bss_file.c:67 - SSL error:10000080:BIO routines::no such file: crypto/bio/bss_file.c:75 sign-file: certs/signing_key.pem: No such file or directory INSTALL /tmp/B.rbg4g098/BUILD/lttng-modules-2.13.4/lttng-modules-2.13.4/src/probes/lttng-probe-udp.ko At main.c:160: - SSL error:FFFFFFFF80000002:system library::No such file or directory: crypto/bio/bss_file.c:67 - SSL error:10000080:BIO routines::no such file: crypto/bio/bss_file.c:75 sign-file: certs/signing_key.pem: No such file or directory INSTALL /tmp/B.rbg4g098/BUILD/lttng-modules-2.13.4/lttng-modules-2.13.4/src/probes/lttng-probe-v4l2.ko At main.c:160: - SSL error:FFFFFFFF80000002:system library::No such file or directory: crypto/bio/bss_file.c:67 - SSL error:10000080:BIO routines::no such file: crypto/bio/bss_file.c:75 sign-file: certs/signing_key.pem: No such file or directory INSTALL /tmp/B.rbg4g098/BUILD/lttng-modules-2.13.4/lttng-modules-2.13.4/src/probes/lttng-probe-kvm-x86-mmu.ko At main.c:160: - SSL error:FFFFFFFF80000002:system library::No such file or directory: crypto/bio/bss_file.c:67 - SSL error:10000080:BIO routines::no such file: crypto/bio/bss_file.c:75 sign-file: certs/signing_key.pem: No such file or directory INSTALL /tmp/B.rbg4g098/BUILD/lttng-modules-2.13.4/lttng-modules-2.13.4/src/probes/lttng-probe-skb.ko At main.c:160: - SSL error:FFFFFFFF80000002:system library::No such file or directory: crypto/bio/bss_file.c:67 - SSL error:10000080:BIO routines::no such file: crypto/bio/bss_file.c:75 sign-file: certs/signing_key.pem: No such file or directory INSTALL /tmp/B.rbg4g098/BUILD/lttng-modules-2.13.4/lttng-modules-2.13.4/src/probes/lttng-probe-workqueue.ko At main.c:160: - SSL error:FFFFFFFF80000002:system library::No such file or directory: crypto/bio/bss_file.c:67 - SSL error:10000080:BIO routines::no such file: crypto/bio/bss_file.c:75 sign-file: certs/signing_key.pem: No such file or directory INSTALL /tmp/B.rbg4g098/BUILD/lttng-modules-2.13.4/lttng-modules-2.13.4/src/probes/lttng-probe-x86-exceptions.ko At main.c:160: - SSL error:FFFFFFFF80000002:system library::No such file or directory: crypto/bio/bss_file.c:67 - SSL error:10000080:BIO routines::no such file: crypto/bio/bss_file.c:75 sign-file: certs/signing_key.pem: No such file or directory INSTALL /tmp/B.rbg4g098/BUILD/lttng-modules-2.13.4/lttng-modules-2.13.4/src/tests/lttng-clock-plugin-test.ko At main.c:160: - SSL error:FFFFFFFF80000002:system library::No such file or directory: crypto/bio/bss_file.c:67 - SSL error:10000080:BIO routines::no such file: crypto/bio/bss_file.c:75 sign-file: certs/signing_key.pem: No such file or directory INSTALL /tmp/B.rbg4g098/BUILD/lttng-modules-2.13.4/lttng-modules-2.13.4/src/probes/lttng-probe-sunrpc.ko At main.c:160: - SSL error:FFFFFFFF80000002:system library::No such file or directory: crypto/bio/bss_file.c:67 - SSL error:10000080:BIO routines::no such file: crypto/bio/bss_file.c:75 sign-file: certs/signing_key.pem: No such file or directory INSTALL /tmp/B.rbg4g098/BUILD/lttng-modules-2.13.4/lttng-modules-2.13.4/src/probes/lttng-probe-x86-irq-vectors.ko At main.c:160: - SSL error:FFFFFFFF80000002:system library::No such file or directory: crypto/bio/bss_file.c:67 - SSL error:10000080:BIO routines::no such file: crypto/bio/bss_file.c:75 sign-file: certs/signing_key.pem: No such file or directory INSTALL /tmp/B.rbg4g098/BUILD/lttng-modules-2.13.4/lttng-modules-2.13.4/src/probes/lttng-probe-scsi.ko At main.c:160: - SSL error:FFFFFFFF80000002:system library::No such file or directory: crypto/bio/bss_file.c:67 - SSL error:10000080:BIO routines::no such file: crypto/bio/bss_file.c:75 sign-file: certs/signing_key.pem: No such file or directory INSTALL /tmp/B.rbg4g098/BUILD/lttng-modules-2.13.4/lttng-modules-2.13.4/src/probes/lttng-uprobes.ko At main.c:160: - SSL error:FFFFFFFF80000002:system library::No such file or directory: crypto/bio/bss_file.c:67 - SSL error:10000080:BIO routines::no such file: crypto/bio/bss_file.c:75 sign-file: certs/signing_key.pem: No such file or directory INSTALL /tmp/B.rbg4g098/BUILD/lttng-modules-2.13.4/lttng-modules-2.13.4/src/probes/lttng-probe-timer.ko At main.c:160: - SSL error:FFFFFFFF80000002:system library::No such file or directory: crypto/bio/bss_file.c:67 - SSL error:10000080:BIO routines::no such file: crypto/bio/bss_file.c:75 sign-file: certs/signing_key.pem: No such file or directory INSTALL /tmp/B.rbg4g098/BUILD/lttng-modules-2.13.4/lttng-modules-2.13.4/src/probes/lttng-probe-sched.ko At main.c:160: - SSL error:FFFFFFFF80000002:system library::No such file or directory: crypto/bio/bss_file.c:67 - SSL error:10000080:BIO routines::no such file: crypto/bio/bss_file.c:75 sign-file: certs/signing_key.pem: No such file or directory INSTALL /tmp/B.rbg4g098/BUILD/lttng-modules-2.13.4/lttng-modules-2.13.4/src/tests/lttng-test.ko At main.c:160: - SSL error:FFFFFFFF80000002:system library::No such file or directory: crypto/bio/bss_file.c:67 - SSL error:10000080:BIO routines::no such file: crypto/bio/bss_file.c:75 sign-file: certs/signing_key.pem: No such file or directory INSTALL /tmp/B.rbg4g098/BUILD/lttng-modules-2.13.4/lttng-modules-2.13.4/src/probes/lttng-probe-vmscan.ko At main.c:160: - SSL error:FFFFFFFF80000002:system library::No such file or directory: crypto/bio/bss_file.c:67 - SSL error:10000080:BIO routines::no such file: crypto/bio/bss_file.c:75 sign-file: certs/signing_key.pem: No such file or directory INSTALL /tmp/B.rbg4g098/BUILD/lttng-modules-2.13.4/lttng-modules-2.13.4/src/probes/lttng-probe-statedump.ko At main.c:160: - SSL error:FFFFFFFF80000002:system library::No such file or directory: crypto/bio/bss_file.c:67 - SSL error:10000080:BIO routines::no such file: crypto/bio/bss_file.c:75 sign-file: certs/signing_key.pem: No such file or directory INSTALL /tmp/B.rbg4g098/BUILD/lttng-modules-2.13.4/lttng-modules-2.13.4/src/probes/lttng-probe-btrfs.ko At main.c:160: - SSL error:FFFFFFFF80000002:system library::No such file or directory: crypto/bio/bss_file.c:67 - SSL error:10000080:BIO routines::no such file: crypto/bio/bss_file.c:75 sign-file: certs/signing_key.pem: No such file or directory INSTALL /tmp/B.rbg4g098/BUILD/lttng-modules-2.13.4/lttng-modules-2.13.4/src/probes/lttng-probe-kvm-x86.ko At main.c:160: - SSL error:FFFFFFFF80000002:system library::No such file or directory: crypto/bio/bss_file.c:67 - SSL error:10000080:BIO routines::no such file: crypto/bio/bss_file.c:75 sign-file: certs/signing_key.pem: No such file or directory INSTALL /tmp/B.rbg4g098/BUILD/lttng-modules-2.13.4/lttng-modules-2.13.4/src/lib/lttng-lib-ring-buffer.ko At main.c:160: - SSL error:FFFFFFFF80000002:system library::No such file or directory: crypto/bio/bss_file.c:67 - SSL error:10000080:BIO routines::no such file: crypto/bio/bss_file.c:75 sign-file: certs/signing_key.pem: No such file or directory INSTALL /tmp/B.rbg4g098/BUILD/lttng-modules-2.13.4/lttng-modules-2.13.4/src/probes/lttng-probe-writeback.ko At main.c:160: - SSL error:FFFFFFFF80000002:system library::No such file or directory: crypto/bio/bss_file.c:67 - SSL error:10000080:BIO routines::no such file: crypto/bio/bss_file.c:75 sign-file: certs/signing_key.pem: No such file or directory INSTALL /tmp/B.rbg4g098/BUILD/lttng-modules-2.13.4/lttng-modules-2.13.4/src/probes/lttng-probe-ext4.ko At main.c:160: - SSL error:FFFFFFFF80000002:system library::No such file or directory: crypto/bio/bss_file.c:67 - SSL error:10000080:BIO routines::no such file: crypto/bio/bss_file.c:75 sign-file: certs/signing_key.pem: No such file or directory INSTALL /tmp/B.rbg4g098/BUILD/lttng-modules-2.13.4/lttng-modules-2.13.4/src/lttng-tracer.ko At main.c:160: - SSL error:FFFFFFFF80000002:system library::No such file or directory: crypto/bio/bss_file.c:67 - SSL error:10000080:BIO routines::no such file: crypto/bio/bss_file.c:75 sign-file: certs/signing_key.pem: No such file or directory make[1]: Entering directory '/usr/src/linux-5.4-5.4.220' DEPMOD 5.4.220-1 Warning: modules_install: missing 'System.map' file. Skipping depmod. make[1]: Leaving directory '/usr/src/linux-5.4-5.4.220' + /usr/bin/make -Otarget -j28 clean 'KERNELDIR=/usr/src/linux-4.19' /usr/bin/make -C /usr/src/linux-4.19 M=/tmp/B.rbg4g098/BUILD/lttng-modules-2.13.4/lttng-modules-2.13.4/src clean make[1]: Entering directory '/usr/src/linux-4.19-4.19.262' CLEAN /tmp/B.rbg4g098/BUILD/lttng-modules-2.13.4/lttng-modules-2.13.4/src/Module.symvers make[1]: Leaving directory '/usr/src/linux-4.19-4.19.262' + /usr/bin/make -Otarget -j28 'KERNELDIR=/usr/src/linux-4.19' /usr/bin/make -C /usr/src/linux-4.19 M=/tmp/B.rbg4g098/BUILD/lttng-modules-2.13.4/lttng-modules-2.13.4/src \ CONFIG_LTTNG=m CONFIG_LTTNG_CLOCK_PLUGIN_TEST=m \ KCPPFLAGS='' \ modules CC [M] /tmp/B.rbg4g098/BUILD/lttng-modules-2.13.4/lttng-modules-2.13.4/src/lttng-string-utils.o CC [M] /tmp/B.rbg4g098/BUILD/lttng-modules-2.13.4/lttng-modules-2.13.4/src/lib/msgpack/msgpack.o CC [M] /tmp/B.rbg4g098/BUILD/lttng-modules-2.13.4/lttng-modules-2.13.4/src/lttng-clock.o CC [M] /tmp/B.rbg4g098/BUILD/lttng-modules-2.13.4/lttng-modules-2.13.4/src/lttng-context-vpid.o CC [M] /tmp/B.rbg4g098/BUILD/lttng-modules-2.13.4/lttng-modules-2.13.4/src/lttng-context-pid.o CC [M] /tmp/B.rbg4g098/BUILD/lttng-modules-2.13.4/lttng-modules-2.13.4/src/lttng-context-procname.o CC [M] /tmp/B.rbg4g098/BUILD/lttng-modules-2.13.4/lttng-modules-2.13.4/src/lttng-context-prio.o CC [M] /tmp/B.rbg4g098/BUILD/lttng-modules-2.13.4/lttng-modules-2.13.4/src/lttng-context-nice.o CC [M] /tmp/B.rbg4g098/BUILD/lttng-modules-2.13.4/lttng-modules-2.13.4/src/lttng-context-vtid.o CC [M] /tmp/B.rbg4g098/BUILD/lttng-modules-2.13.4/lttng-modules-2.13.4/src/lttng-context-tid.o CC [M] /tmp/B.rbg4g098/BUILD/lttng-modules-2.13.4/lttng-modules-2.13.4/src/lttng-context-ppid.o CC [M] /tmp/B.rbg4g098/BUILD/lttng-modules-2.13.4/lttng-modules-2.13.4/src/lttng-probes.o CC [M] /tmp/B.rbg4g098/BUILD/lttng-modules-2.13.4/lttng-modules-2.13.4/src/lttng-context.o CC [M] /tmp/B.rbg4g098/BUILD/lttng-modules-2.13.4/lttng-modules-2.13.4/src/lttng-context-vppid.o CC [M] /tmp/B.rbg4g098/BUILD/lttng-modules-2.13.4/lttng-modules-2.13.4/src/lttng-counter-client-percpu-64-modular.o CC [M] /tmp/B.rbg4g098/BUILD/lttng-modules-2.13.4/lttng-modules-2.13.4/src/lttng-counter-client-percpu-32-modular.o CC [M] /tmp/B.rbg4g098/BUILD/lttng-modules-2.13.4/lttng-modules-2.13.4/src/lttng-context-cpu-id.o CC [M] /tmp/B.rbg4g098/BUILD/lttng-modules-2.13.4/lttng-modules-2.13.4/src/lttng-ring-buffer-event-notifier-client.o CC [M] /tmp/B.rbg4g098/BUILD/lttng-modules-2.13.4/lttng-modules-2.13.4/src/lttng-ring-buffer-metadata-client.o CC [M] /tmp/B.rbg4g098/BUILD/lttng-modules-2.13.4/lttng-modules-2.13.4/src/lttng-context-uid.o CC [M] /tmp/B.rbg4g098/BUILD/lttng-modules-2.13.4/lttng-modules-2.13.4/src/lttng-ring-buffer-metadata-mmap-client.o CC [M] /tmp/B.rbg4g098/BUILD/lttng-modules-2.13.4/lttng-modules-2.13.4/src/lttng-ring-buffer-client-overwrite.o CC [M] /tmp/B.rbg4g098/BUILD/lttng-modules-2.13.4/lttng-modules-2.13.4/src/lttng-ring-buffer-client-mmap-overwrite.o CC [M] /tmp/B.rbg4g098/BUILD/lttng-modules-2.13.4/lttng-modules-2.13.4/src/tests/probes/lttng-test.o CC [M] /tmp/B.rbg4g098/BUILD/lttng-modules-2.13.4/lttng-modules-2.13.4/src/lttng-ring-buffer-client-discard.o CC [M] /tmp/B.rbg4g098/BUILD/lttng-modules-2.13.4/lttng-modules-2.13.4/src/lib/../wrapper/splice.o CC [M] /tmp/B.rbg4g098/BUILD/lttng-modules-2.13.4/lttng-modules-2.13.4/src/lttng-ring-buffer-client-mmap-discard.o CC [M] /tmp/B.rbg4g098/BUILD/lttng-modules-2.13.4/lttng-modules-2.13.4/src/tests/clock-plugin/lttng-clock-plugin-test.o LD [M] /tmp/B.rbg4g098/BUILD/lttng-modules-2.13.4/lttng-modules-2.13.4/src/tests/lttng-test.o CC [M] /tmp/B.rbg4g098/BUILD/lttng-modules-2.13.4/lttng-modules-2.13.4/src/lttng-context-euid.o LD [M] /tmp/B.rbg4g098/BUILD/lttng-modules-2.13.4/lttng-modules-2.13.4/src/tests/lttng-clock-plugin-test.o CC [M] /tmp/B.rbg4g098/BUILD/lttng-modules-2.13.4/lttng-modules-2.13.4/src/lib/ringbuffer/ring_buffer_splice.o CC [M] /tmp/B.rbg4g098/BUILD/lttng-modules-2.13.4/lttng-modules-2.13.4/src/lib/ringbuffer/ring_buffer_vfs.o CC [M] /tmp/B.rbg4g098/BUILD/lttng-modules-2.13.4/lttng-modules-2.13.4/src/lib/prio_heap/lttng_prio_heap.o CC [M] /tmp/B.rbg4g098/BUILD/lttng-modules-2.13.4/lttng-modules-2.13.4/src/lib/ringbuffer/ring_buffer_backend.o CC [M] /tmp/B.rbg4g098/BUILD/lttng-modules-2.13.4/lttng-modules-2.13.4/src/lib/ringbuffer/ring_buffer_mmap.o CC [M] /tmp/B.rbg4g098/BUILD/lttng-modules-2.13.4/lttng-modules-2.13.4/src/lttng-context-suid.o CC [M] /tmp/B.rbg4g098/BUILD/lttng-modules-2.13.4/lttng-modules-2.13.4/src/lttng-abi.o CC [M] /tmp/B.rbg4g098/BUILD/lttng-modules-2.13.4/lttng-modules-2.13.4/src/lib/ringbuffer/ring_buffer_iterator.o CC [M] /tmp/B.rbg4g098/BUILD/lttng-modules-2.13.4/lttng-modules-2.13.4/src/probes/lttng-probe-irq.o CC [M] /tmp/B.rbg4g098/BUILD/lttng-modules-2.13.4/lttng-modules-2.13.4/src/lttng-context-vuid.o CC [M] /tmp/B.rbg4g098/BUILD/lttng-modules-2.13.4/lttng-modules-2.13.4/src/probes/lttng-probe-sched.o CC [M] /tmp/B.rbg4g098/BUILD/lttng-modules-2.13.4/lttng-modules-2.13.4/src/lttng-context-gid.o CC [M] /tmp/B.rbg4g098/BUILD/lttng-modules-2.13.4/lttng-modules-2.13.4/src/probes/lttng-probe-module.o CC [M] /tmp/B.rbg4g098/BUILD/lttng-modules-2.13.4/lttng-modules-2.13.4/src/lttng-context-vsuid.o CC [M] /tmp/B.rbg4g098/BUILD/lttng-modules-2.13.4/lttng-modules-2.13.4/src/probes/lttng-probe-kmem.o CC [M] /tmp/B.rbg4g098/BUILD/lttng-modules-2.13.4/lttng-modules-2.13.4/src/lttng-context-vgid.o CC [M] /tmp/B.rbg4g098/BUILD/lttng-modules-2.13.4/lttng-modules-2.13.4/src/lttng-context-sgid.o CC [M] /tmp/B.rbg4g098/BUILD/lttng-modules-2.13.4/lttng-modules-2.13.4/src/probes/lttng-probe-9p.o CC [M] /tmp/B.rbg4g098/BUILD/lttng-modules-2.13.4/lttng-modules-2.13.4/src/lttng-context-vsgid.o CC [M] /tmp/B.rbg4g098/BUILD/lttng-modules-2.13.4/lttng-modules-2.13.4/src/lib/ringbuffer/ring_buffer_frontend.o CC [M] /tmp/B.rbg4g098/BUILD/lttng-modules-2.13.4/lttng-modules-2.13.4/src/lttng-context-interruptible.o CC [M] /tmp/B.rbg4g098/BUILD/lttng-modules-2.13.4/lttng-modules-2.13.4/src/lttng-context-egid.o CC [M] /tmp/B.rbg4g098/BUILD/lttng-modules-2.13.4/lttng-modules-2.13.4/src/lttng-calibrate.o CC [M] /tmp/B.rbg4g098/BUILD/lttng-modules-2.13.4/lttng-modules-2.13.4/src/lib/counter/counter.o CC [M] /tmp/B.rbg4g098/BUILD/lttng-modules-2.13.4/lttng-modules-2.13.4/src/probes/lttng-probe-power.o LD [M] /tmp/B.rbg4g098/BUILD/lttng-modules-2.13.4/lttng-modules-2.13.4/src/lib/lttng-lib-ring-buffer.o CC [M] /tmp/B.rbg4g098/BUILD/lttng-modules-2.13.4/lttng-modules-2.13.4/src/lttng-context-veuid.o LD [M] /tmp/B.rbg4g098/BUILD/lttng-modules-2.13.4/lttng-modules-2.13.4/src/lib/lttng-counter.o CC [M] /tmp/B.rbg4g098/BUILD/lttng-modules-2.13.4/lttng-modules-2.13.4/src/probes/lttng-probe-timer.o CC [M] /tmp/B.rbg4g098/BUILD/lttng-modules-2.13.4/lttng-modules-2.13.4/src/lttng-context-vegid.o CC [M] /tmp/B.rbg4g098/BUILD/lttng-modules-2.13.4/lttng-modules-2.13.4/src/lttng-context-need-reschedule.o CC [M] /tmp/B.rbg4g098/BUILD/lttng-modules-2.13.4/lttng-modules-2.13.4/src/probes/lttng-probe-x86-irq-vectors.o CC [M] /tmp/B.rbg4g098/BUILD/lttng-modules-2.13.4/lttng-modules-2.13.4/src/lttng-events.o CC [M] /tmp/B.rbg4g098/BUILD/lttng-modules-2.13.4/lttng-modules-2.13.4/src/lttng-context-hostname.o CC [M] /tmp/B.rbg4g098/BUILD/lttng-modules-2.13.4/lttng-modules-2.13.4/src/probes/lttng-probe-i2c.o CC [M] /tmp/B.rbg4g098/BUILD/lttng-modules-2.13.4/lttng-modules-2.13.4/src/probes/lttng.o CC [M] /tmp/B.rbg4g098/BUILD/lttng-modules-2.13.4/lttng-modules-2.13.4/src/probes/lttng-probe-signal.o CC [M] /tmp/B.rbg4g098/BUILD/lttng-modules-2.13.4/lttng-modules-2.13.4/src/probes/lttng-probe-x86-exceptions.o CC [M] /tmp/B.rbg4g098/BUILD/lttng-modules-2.13.4/lttng-modules-2.13.4/src/probes/lttng-probe-user.o CC [M] /tmp/B.rbg4g098/BUILD/lttng-modules-2.13.4/lttng-modules-2.13.4/src/lttng-tp-mempool.o CC [M] /tmp/B.rbg4g098/BUILD/lttng-modules-2.13.4/lttng-modules-2.13.4/src/lttng-context-callstack.o CC [M] /tmp/B.rbg4g098/BUILD/lttng-modules-2.13.4/lttng-modules-2.13.4/src/probes/lttng-probe-napi.o CC [M] /tmp/B.rbg4g098/BUILD/lttng-modules-2.13.4/lttng-modules-2.13.4/src/lttng-tracker-id.o CC [M] /tmp/B.rbg4g098/BUILD/lttng-modules-2.13.4/lttng-modules-2.13.4/src/lttng-bytecode.o CC [M] /tmp/B.rbg4g098/BUILD/lttng-modules-2.13.4/lttng-modules-2.13.4/src/probes/lttng-probe-skb.o CC [M] /tmp/B.rbg4g098/BUILD/lttng-modules-2.13.4/lttng-modules-2.13.4/src/probes/lttng-probe-gpio.o CC [M] /tmp/B.rbg4g098/BUILD/lttng-modules-2.13.4/lttng-modules-2.13.4/src/probes/lttng-probe-kvm-x86-mmu.o CC [M] /tmp/B.rbg4g098/BUILD/lttng-modules-2.13.4/lttng-modules-2.13.4/src/probes/lttng-probe-net.o CC [M] /tmp/B.rbg4g098/BUILD/lttng-modules-2.13.4/lttng-modules-2.13.4/src/lttng-bytecode-specialize.o CC [M] /tmp/B.rbg4g098/BUILD/lttng-modules-2.13.4/lttng-modules-2.13.4/src/probes/lttng-probe-regulator.o CC [M] /tmp/B.rbg4g098/BUILD/lttng-modules-2.13.4/lttng-modules-2.13.4/src/probes/lttng-probe-scsi.o CC [M] /tmp/B.rbg4g098/BUILD/lttng-modules-2.13.4/lttng-modules-2.13.4/src/probes/lttng-probe-kvm.o CC [M] /tmp/B.rbg4g098/BUILD/lttng-modules-2.13.4/lttng-modules-2.13.4/src/lttng-bytecode-validator.o CC [M] /tmp/B.rbg4g098/BUILD/lttng-modules-2.13.4/lttng-modules-2.13.4/src/probes/lttng-probe-udp.o CC [M] /tmp/B.rbg4g098/BUILD/lttng-modules-2.13.4/lttng-modules-2.13.4/src/probes/lttng-probe-statedump.o CC [M] /tmp/B.rbg4g098/BUILD/lttng-modules-2.13.4/lttng-modules-2.13.4/src/probes/lttng-probe-sock.o CC [M] /tmp/B.rbg4g098/BUILD/lttng-modules-2.13.4/lttng-modules-2.13.4/src/lttng-event-notifier-notification.o CC [M] /tmp/B.rbg4g098/BUILD/lttng-modules-2.13.4/lttng-modules-2.13.4/src/lttng-bytecode-interpreter.o CC [M] /tmp/B.rbg4g098/BUILD/lttng-modules-2.13.4/lttng-modules-2.13.4/src/probes/lttng-probe-rcu.o CC [M] /tmp/B.rbg4g098/BUILD/lttng-modules-2.13.4/lttng-modules-2.13.4/src/probes/lttng-probe-asoc.o CC [M] /tmp/B.rbg4g098/BUILD/lttng-modules-2.13.4/lttng-modules-2.13.4/src/probes/lttng-probe-printk.o CC [M] /tmp/B.rbg4g098/BUILD/lttng-modules-2.13.4/lttng-modules-2.13.4/src/probes/lttng-probe-jbd2.o CC [M] /tmp/B.rbg4g098/BUILD/lttng-modules-2.13.4/lttng-modules-2.13.4/src/probes/lttng-probe-compaction.o CC [M] /tmp/B.rbg4g098/BUILD/lttng-modules-2.13.4/lttng-modules-2.13.4/src/probes/lttng-probe-vmscan.o CC [M] /tmp/B.rbg4g098/BUILD/lttng-modules-2.13.4/lttng-modules-2.13.4/src/probes/lttng-probe-workqueue.o CC [M] /tmp/B.rbg4g098/BUILD/lttng-modules-2.13.4/lttng-modules-2.13.4/src/probes/lttng-kprobes.o CC [M] /tmp/B.rbg4g098/BUILD/lttng-modules-2.13.4/lttng-modules-2.13.4/src/probes/lttng-probe-regmap.o CC [M] /tmp/B.rbg4g098/BUILD/lttng-modules-2.13.4/lttng-modules-2.13.4/src/probes/lttng-probe-v4l2.o CC [M] /tmp/B.rbg4g098/BUILD/lttng-modules-2.13.4/lttng-modules-2.13.4/src/lttng-context-mnt-ns.o CC [M] /tmp/B.rbg4g098/BUILD/lttng-modules-2.13.4/lttng-modules-2.13.4/src/probes/lttng-uprobes.o CC [M] /tmp/B.rbg4g098/BUILD/lttng-modules-2.13.4/lttng-modules-2.13.4/src/lttng-syscalls-enum.o CC [M] /tmp/B.rbg4g098/BUILD/lttng-modules-2.13.4/lttng-modules-2.13.4/src/probes/lttng-kretprobes.o CC [M] /tmp/B.rbg4g098/BUILD/lttng-modules-2.13.4/lttng-modules-2.13.4/src/lttng-context-ipc-ns.o CC [M] /tmp/B.rbg4g098/BUILD/lttng-modules-2.13.4/lttng-modules-2.13.4/src/lttng-context-pid-ns.o CC [M] /tmp/B.rbg4g098/BUILD/lttng-modules-2.13.4/lttng-modules-2.13.4/src/lttng-tracepoint.o CC [M] /tmp/B.rbg4g098/BUILD/lttng-modules-2.13.4/lttng-modules-2.13.4/src/lttng-context-net-ns.o CC [M] /tmp/B.rbg4g098/BUILD/lttng-modules-2.13.4/lttng-modules-2.13.4/src/wrapper/trace-clock.o CC [M] /tmp/B.rbg4g098/BUILD/lttng-modules-2.13.4/lttng-modules-2.13.4/src/lttng-context-cgroup-ns.o CC [M] /tmp/B.rbg4g098/BUILD/lttng-modules-2.13.4/lttng-modules-2.13.4/src/wrapper/irqdesc.o CC [M] /tmp/B.rbg4g098/BUILD/lttng-modules-2.13.4/lttng-modules-2.13.4/src/probes/lttng-probe-block.o CC [M] /tmp/B.rbg4g098/BUILD/lttng-modules-2.13.4/lttng-modules-2.13.4/src/lttng-context-user-ns.o CC [M] /tmp/B.rbg4g098/BUILD/lttng-modules-2.13.4/lttng-modules-2.13.4/src/lttng-context-perf-counters.o CC [M] /tmp/B.rbg4g098/BUILD/lttng-modules-2.13.4/lttng-modules-2.13.4/src/wrapper/page_alloc.o CC [M] /tmp/B.rbg4g098/BUILD/lttng-modules-2.13.4/lttng-modules-2.13.4/src/probes/lttng-probe-sunrpc.o CC [M] /tmp/B.rbg4g098/BUILD/lttng-modules-2.13.4/lttng-modules-2.13.4/src/wrapper/random.o CC [M] /tmp/B.rbg4g098/BUILD/lttng-modules-2.13.4/lttng-modules-2.13.4/src/wrapper/fdtable.o CC [M] /tmp/B.rbg4g098/BUILD/lttng-modules-2.13.4/lttng-modules-2.13.4/src/wrapper/kallsyms.o CC [M] /tmp/B.rbg4g098/BUILD/lttng-modules-2.13.4/lttng-modules-2.13.4/src/lttng-context-uts-ns.o CC [M] /tmp/B.rbg4g098/BUILD/lttng-modules-2.13.4/lttng-modules-2.13.4/src/lttng-wrapper-impl.o LD [M] /tmp/B.rbg4g098/BUILD/lttng-modules-2.13.4/lttng-modules-2.13.4/src/lttng-wrapper.o CC [M] /tmp/B.rbg4g098/BUILD/lttng-modules-2.13.4/lttng-modules-2.13.4/src/probes/lttng-probe-kvm-x86.o CC [M] /tmp/B.rbg4g098/BUILD/lttng-modules-2.13.4/lttng-modules-2.13.4/src/lttng-syscalls.o CC [M] /tmp/B.rbg4g098/BUILD/lttng-modules-2.13.4/lttng-modules-2.13.4/src/lttng-statedump-impl.o LD [M] /tmp/B.rbg4g098/BUILD/lttng-modules-2.13.4/lttng-modules-2.13.4/src/lttng-statedump.o CC [M] /tmp/B.rbg4g098/BUILD/lttng-modules-2.13.4/lttng-modules-2.13.4/src/probes/lttng-probe-btrfs.o CC [M] /tmp/B.rbg4g098/BUILD/lttng-modules-2.13.4/lttng-modules-2.13.4/src/probes/lttng-probe-writeback.o CC [M] /tmp/B.rbg4g098/BUILD/lttng-modules-2.13.4/lttng-modules-2.13.4/src/probes/lttng-probe-ext4.o CC [M] /tmp/B.rbg4g098/BUILD/lttng-modules-2.13.4/lttng-modules-2.13.4/src/lttng-syscalls-entry-table.o CC [M] /tmp/B.rbg4g098/BUILD/lttng-modules-2.13.4/lttng-modules-2.13.4/src/lttng-syscalls-exit-table.o CC [M] /tmp/B.rbg4g098/BUILD/lttng-modules-2.13.4/lttng-modules-2.13.4/src/lttng-syscalls-exit-compat-table.o CC [M] /tmp/B.rbg4g098/BUILD/lttng-modules-2.13.4/lttng-modules-2.13.4/src/lttng-syscalls-entry-compat-table.o LD [M] /tmp/B.rbg4g098/BUILD/lttng-modules-2.13.4/lttng-modules-2.13.4/src/lttng-tracer.o make[1]: Entering directory '/usr/src/linux-4.19-4.19.262' Building modules, stage 2. make[1]: Leaving directory '/usr/src/linux-4.19-4.19.262' MODPOST 57 modules CC /tmp/B.rbg4g098/BUILD/lttng-modules-2.13.4/lttng-modules-2.13.4/src/lttng-counter-client-percpu-32-modular.mod.o CC /tmp/B.rbg4g098/BUILD/lttng-modules-2.13.4/lttng-modules-2.13.4/src/lib/lttng-counter.mod.o CC /tmp/B.rbg4g098/BUILD/lttng-modules-2.13.4/lttng-modules-2.13.4/src/lttng-ring-buffer-client-mmap-overwrite.mod.o CC /tmp/B.rbg4g098/BUILD/lttng-modules-2.13.4/lttng-modules-2.13.4/src/probes/lttng-probe-ext4.mod.o CC /tmp/B.rbg4g098/BUILD/lttng-modules-2.13.4/lttng-modules-2.13.4/src/lttng-ring-buffer-client-overwrite.mod.o CC /tmp/B.rbg4g098/BUILD/lttng-modules-2.13.4/lttng-modules-2.13.4/src/lttng-ring-buffer-client-discard.mod.o CC /tmp/B.rbg4g098/BUILD/lttng-modules-2.13.4/lttng-modules-2.13.4/src/lttng-ring-buffer-metadata-client.mod.o CC /tmp/B.rbg4g098/BUILD/lttng-modules-2.13.4/lttng-modules-2.13.4/src/probes/lttng-probe-asoc.mod.o CC /tmp/B.rbg4g098/BUILD/lttng-modules-2.13.4/lttng-modules-2.13.4/src/probes/lttng-probe-jbd2.mod.o CC /tmp/B.rbg4g098/BUILD/lttng-modules-2.13.4/lttng-modules-2.13.4/src/lttng-ring-buffer-event-notifier-client.mod.o CC /tmp/B.rbg4g098/BUILD/lttng-modules-2.13.4/lttng-modules-2.13.4/src/lttng-tracer.mod.o CC /tmp/B.rbg4g098/BUILD/lttng-modules-2.13.4/lttng-modules-2.13.4/src/probes/lttng-probe-compaction.mod.o CC /tmp/B.rbg4g098/BUILD/lttng-modules-2.13.4/lttng-modules-2.13.4/src/lttng-ring-buffer-metadata-mmap-client.mod.o CC /tmp/B.rbg4g098/BUILD/lttng-modules-2.13.4/lttng-modules-2.13.4/src/probes/lttng-kretprobes.mod.o CC /tmp/B.rbg4g098/BUILD/lttng-modules-2.13.4/lttng-modules-2.13.4/src/probes/lttng-probe-i2c.mod.o CC /tmp/B.rbg4g098/BUILD/lttng-modules-2.13.4/lttng-modules-2.13.4/src/probes/lttng-probe-kmem.mod.o CC /tmp/B.rbg4g098/BUILD/lttng-modules-2.13.4/lttng-modules-2.13.4/src/probes/lttng-kprobes.mod.o CC /tmp/B.rbg4g098/BUILD/lttng-modules-2.13.4/lttng-modules-2.13.4/src/lttng-clock.mod.o CC /tmp/B.rbg4g098/BUILD/lttng-modules-2.13.4/lttng-modules-2.13.4/src/probes/lttng-probe-block.mod.o CC /tmp/B.rbg4g098/BUILD/lttng-modules-2.13.4/lttng-modules-2.13.4/src/lttng-wrapper.mod.o CC /tmp/B.rbg4g098/BUILD/lttng-modules-2.13.4/lttng-modules-2.13.4/src/lttng-counter-client-percpu-64-modular.mod.o CC /tmp/B.rbg4g098/BUILD/lttng-modules-2.13.4/lttng-modules-2.13.4/src/lttng-statedump.mod.o CC /tmp/B.rbg4g098/BUILD/lttng-modules-2.13.4/lttng-modules-2.13.4/src/lttng-ring-buffer-client-mmap-discard.mod.o CC /tmp/B.rbg4g098/BUILD/lttng-modules-2.13.4/lttng-modules-2.13.4/src/lib/lttng-lib-ring-buffer.mod.o CC /tmp/B.rbg4g098/BUILD/lttng-modules-2.13.4/lttng-modules-2.13.4/src/probes/lttng-probe-irq.mod.o CC /tmp/B.rbg4g098/BUILD/lttng-modules-2.13.4/lttng-modules-2.13.4/src/probes/lttng-probe-btrfs.mod.o CC /tmp/B.rbg4g098/BUILD/lttng-modules-2.13.4/lttng-modules-2.13.4/src/probes/lttng-probe-9p.mod.o CC /tmp/B.rbg4g098/BUILD/lttng-modules-2.13.4/lttng-modules-2.13.4/src/probes/lttng-probe-gpio.mod.o CC /tmp/B.rbg4g098/BUILD/lttng-modules-2.13.4/lttng-modules-2.13.4/src/probes/lttng-probe-kvm.mod.o CC /tmp/B.rbg4g098/BUILD/lttng-modules-2.13.4/lttng-modules-2.13.4/src/probes/lttng-probe-napi.mod.o LD [M] /tmp/B.rbg4g098/BUILD/lttng-modules-2.13.4/lttng-modules-2.13.4/src/lib/lttng-counter.ko CC /tmp/B.rbg4g098/BUILD/lttng-modules-2.13.4/lttng-modules-2.13.4/src/probes/lttng-probe-module.mod.o LD [M] /tmp/B.rbg4g098/BUILD/lttng-modules-2.13.4/lttng-modules-2.13.4/src/lib/lttng-lib-ring-buffer.ko CC /tmp/B.rbg4g098/BUILD/lttng-modules-2.13.4/lttng-modules-2.13.4/src/probes/lttng-probe-power.mod.o LD [M] /tmp/B.rbg4g098/BUILD/lttng-modules-2.13.4/lttng-modules-2.13.4/src/lttng-clock.ko LD [M] /tmp/B.rbg4g098/BUILD/lttng-modules-2.13.4/lttng-modules-2.13.4/src/lttng-counter-client-percpu-32-modular.ko LD [M] /tmp/B.rbg4g098/BUILD/lttng-modules-2.13.4/lttng-modules-2.13.4/src/lttng-counter-client-percpu-64-modular.ko CC /tmp/B.rbg4g098/BUILD/lttng-modules-2.13.4/lttng-modules-2.13.4/src/probes/lttng-probe-regmap.mod.o CC /tmp/B.rbg4g098/BUILD/lttng-modules-2.13.4/lttng-modules-2.13.4/src/probes/lttng-probe-signal.mod.o LD [M] /tmp/B.rbg4g098/BUILD/lttng-modules-2.13.4/lttng-modules-2.13.4/src/lttng-ring-buffer-client-discard.ko LD [M] /tmp/B.rbg4g098/BUILD/lttng-modules-2.13.4/lttng-modules-2.13.4/src/lttng-ring-buffer-client-mmap-discard.ko CC /tmp/B.rbg4g098/BUILD/lttng-modules-2.13.4/lttng-modules-2.13.4/src/probes/lttng-probe-kvm-x86-mmu.mod.o CC /tmp/B.rbg4g098/BUILD/lttng-modules-2.13.4/lttng-modules-2.13.4/src/probes/lttng-probe-statedump.mod.o LD [M] /tmp/B.rbg4g098/BUILD/lttng-modules-2.13.4/lttng-modules-2.13.4/src/lttng-ring-buffer-client-mmap-overwrite.ko LD [M] /tmp/B.rbg4g098/BUILD/lttng-modules-2.13.4/lttng-modules-2.13.4/src/lttng-ring-buffer-client-overwrite.ko LD [M] /tmp/B.rbg4g098/BUILD/lttng-modules-2.13.4/lttng-modules-2.13.4/src/lttng-ring-buffer-event-notifier-client.ko LD [M] /tmp/B.rbg4g098/BUILD/lttng-modules-2.13.4/lttng-modules-2.13.4/src/lttng-ring-buffer-metadata-client.ko LD [M] /tmp/B.rbg4g098/BUILD/lttng-modules-2.13.4/lttng-modules-2.13.4/src/lttng-ring-buffer-metadata-mmap-client.ko LD [M] /tmp/B.rbg4g098/BUILD/lttng-modules-2.13.4/lttng-modules-2.13.4/src/lttng-statedump.ko LD [M] /tmp/B.rbg4g098/BUILD/lttng-modules-2.13.4/lttng-modules-2.13.4/src/lttng-tracer.ko LD [M] /tmp/B.rbg4g098/BUILD/lttng-modules-2.13.4/lttng-modules-2.13.4/src/lttng-wrapper.ko LD [M] /tmp/B.rbg4g098/BUILD/lttng-modules-2.13.4/lttng-modules-2.13.4/src/probes/lttng-kprobes.ko CC /tmp/B.rbg4g098/BUILD/lttng-modules-2.13.4/lttng-modules-2.13.4/src/probes/lttng-probe-skb.mod.o LD [M] /tmp/B.rbg4g098/BUILD/lttng-modules-2.13.4/lttng-modules-2.13.4/src/probes/lttng-kretprobes.ko CC /tmp/B.rbg4g098/BUILD/lttng-modules-2.13.4/lttng-modules-2.13.4/src/probes/lttng-probe-regulator.mod.o LD [M] /tmp/B.rbg4g098/BUILD/lttng-modules-2.13.4/lttng-modules-2.13.4/src/probes/lttng-probe-9p.ko LD [M] /tmp/B.rbg4g098/BUILD/lttng-modules-2.13.4/lttng-modules-2.13.4/src/probes/lttng-probe-asoc.ko LD [M] /tmp/B.rbg4g098/BUILD/lttng-modules-2.13.4/lttng-modules-2.13.4/src/probes/lttng-probe-block.ko LD [M] /tmp/B.rbg4g098/BUILD/lttng-modules-2.13.4/lttng-modules-2.13.4/src/probes/lttng-probe-btrfs.ko LD [M] /tmp/B.rbg4g098/BUILD/lttng-modules-2.13.4/lttng-modules-2.13.4/src/probes/lttng-probe-compaction.ko LD [M] /tmp/B.rbg4g098/BUILD/lttng-modules-2.13.4/lttng-modules-2.13.4/src/probes/lttng-probe-ext4.ko LD [M] /tmp/B.rbg4g098/BUILD/lttng-modules-2.13.4/lttng-modules-2.13.4/src/probes/lttng-probe-gpio.ko LD [M] /tmp/B.rbg4g098/BUILD/lttng-modules-2.13.4/lttng-modules-2.13.4/src/probes/lttng-probe-i2c.ko LD [M] /tmp/B.rbg4g098/BUILD/lttng-modules-2.13.4/lttng-modules-2.13.4/src/probes/lttng-probe-irq.ko LD [M] /tmp/B.rbg4g098/BUILD/lttng-modules-2.13.4/lttng-modules-2.13.4/src/probes/lttng-probe-jbd2.ko LD [M] /tmp/B.rbg4g098/BUILD/lttng-modules-2.13.4/lttng-modules-2.13.4/src/probes/lttng-probe-kmem.ko LD [M] /tmp/B.rbg4g098/BUILD/lttng-modules-2.13.4/lttng-modules-2.13.4/src/probes/lttng-probe-kvm-x86-mmu.ko LD [M] /tmp/B.rbg4g098/BUILD/lttng-modules-2.13.4/lttng-modules-2.13.4/src/probes/lttng-probe-kvm.ko LD [M] /tmp/B.rbg4g098/BUILD/lttng-modules-2.13.4/lttng-modules-2.13.4/src/probes/lttng-probe-module.ko LD [M] /tmp/B.rbg4g098/BUILD/lttng-modules-2.13.4/lttng-modules-2.13.4/src/probes/lttng-probe-napi.ko LD [M] /tmp/B.rbg4g098/BUILD/lttng-modules-2.13.4/lttng-modules-2.13.4/src/probes/lttng-probe-power.ko LD [M] /tmp/B.rbg4g098/BUILD/lttng-modules-2.13.4/lttng-modules-2.13.4/src/probes/lttng-probe-regmap.ko LD [M] /tmp/B.rbg4g098/BUILD/lttng-modules-2.13.4/lttng-modules-2.13.4/src/probes/lttng-probe-regulator.ko LD [M] /tmp/B.rbg4g098/BUILD/lttng-modules-2.13.4/lttng-modules-2.13.4/src/probes/lttng-probe-signal.ko LD [M] /tmp/B.rbg4g098/BUILD/lttng-modules-2.13.4/lttng-modules-2.13.4/src/probes/lttng-probe-skb.ko CC /tmp/B.rbg4g098/BUILD/lttng-modules-2.13.4/lttng-modules-2.13.4/src/probes/lttng-probe-rcu.mod.o LD [M] /tmp/B.rbg4g098/BUILD/lttng-modules-2.13.4/lttng-modules-2.13.4/src/probes/lttng-probe-statedump.ko LD [M] /tmp/B.rbg4g098/BUILD/lttng-modules-2.13.4/lttng-modules-2.13.4/src/probes/lttng-probe-rcu.ko CC /tmp/B.rbg4g098/BUILD/lttng-modules-2.13.4/lttng-modules-2.13.4/src/probes/lttng-probe-udp.mod.o LD [M] /tmp/B.rbg4g098/BUILD/lttng-modules-2.13.4/lttng-modules-2.13.4/src/probes/lttng-probe-udp.ko CC /tmp/B.rbg4g098/BUILD/lttng-modules-2.13.4/lttng-modules-2.13.4/src/probes/lttng-probe-printk.mod.o CC /tmp/B.rbg4g098/BUILD/lttng-modules-2.13.4/lttng-modules-2.13.4/src/probes/lttng-probe-kvm-x86.mod.o CC /tmp/B.rbg4g098/BUILD/lttng-modules-2.13.4/lttng-modules-2.13.4/src/probes/lttng-probe-sunrpc.mod.o LD [M] /tmp/B.rbg4g098/BUILD/lttng-modules-2.13.4/lttng-modules-2.13.4/src/probes/lttng-probe-kvm-x86.ko LD [M] /tmp/B.rbg4g098/BUILD/lttng-modules-2.13.4/lttng-modules-2.13.4/src/probes/lttng-probe-printk.ko CC /tmp/B.rbg4g098/BUILD/lttng-modules-2.13.4/lttng-modules-2.13.4/src/probes/lttng-probe-workqueue.mod.o LD [M] /tmp/B.rbg4g098/BUILD/lttng-modules-2.13.4/lttng-modules-2.13.4/src/probes/lttng-probe-sunrpc.ko CC /tmp/B.rbg4g098/BUILD/lttng-modules-2.13.4/lttng-modules-2.13.4/src/probes/lttng-probe-vmscan.mod.o LD [M] /tmp/B.rbg4g098/BUILD/lttng-modules-2.13.4/lttng-modules-2.13.4/src/probes/lttng-probe-workqueue.ko CC /tmp/B.rbg4g098/BUILD/lttng-modules-2.13.4/lttng-modules-2.13.4/src/probes/lttng-probe-net.mod.o LD [M] /tmp/B.rbg4g098/BUILD/lttng-modules-2.13.4/lttng-modules-2.13.4/src/probes/lttng-probe-vmscan.ko LD [M] /tmp/B.rbg4g098/BUILD/lttng-modules-2.13.4/lttng-modules-2.13.4/src/probes/lttng-probe-net.ko CC /tmp/B.rbg4g098/BUILD/lttng-modules-2.13.4/lttng-modules-2.13.4/src/probes/lttng-probe-x86-exceptions.mod.o CC /tmp/B.rbg4g098/BUILD/lttng-modules-2.13.4/lttng-modules-2.13.4/src/probes/lttng-probe-x86-irq-vectors.mod.o CC /tmp/B.rbg4g098/BUILD/lttng-modules-2.13.4/lttng-modules-2.13.4/src/probes/lttng-probe-sock.mod.o LD [M] /tmp/B.rbg4g098/BUILD/lttng-modules-2.13.4/lttng-modules-2.13.4/src/probes/lttng-probe-x86-exceptions.ko CC /tmp/B.rbg4g098/BUILD/lttng-modules-2.13.4/lttng-modules-2.13.4/src/probes/lttng-uprobes.mod.o LD [M] /tmp/B.rbg4g098/BUILD/lttng-modules-2.13.4/lttng-modules-2.13.4/src/probes/lttng-probe-sock.ko CC /tmp/B.rbg4g098/BUILD/lttng-modules-2.13.4/lttng-modules-2.13.4/src/probes/lttng-probe-sched.mod.o LD [M] /tmp/B.rbg4g098/BUILD/lttng-modules-2.13.4/lttng-modules-2.13.4/src/probes/lttng-probe-x86-irq-vectors.ko LD [M] /tmp/B.rbg4g098/BUILD/lttng-modules-2.13.4/lttng-modules-2.13.4/src/probes/lttng-uprobes.ko CC /tmp/B.rbg4g098/BUILD/lttng-modules-2.13.4/lttng-modules-2.13.4/src/probes/lttng-probe-scsi.mod.o LD [M] /tmp/B.rbg4g098/BUILD/lttng-modules-2.13.4/lttng-modules-2.13.4/src/probes/lttng-probe-sched.ko LD [M] /tmp/B.rbg4g098/BUILD/lttng-modules-2.13.4/lttng-modules-2.13.4/src/probes/lttng-probe-scsi.ko CC /tmp/B.rbg4g098/BUILD/lttng-modules-2.13.4/lttng-modules-2.13.4/src/probes/lttng-probe-v4l2.mod.o LD [M] /tmp/B.rbg4g098/BUILD/lttng-modules-2.13.4/lttng-modules-2.13.4/src/probes/lttng-probe-v4l2.ko CC /tmp/B.rbg4g098/BUILD/lttng-modules-2.13.4/lttng-modules-2.13.4/src/tests/lttng-clock-plugin-test.mod.o CC /tmp/B.rbg4g098/BUILD/lttng-modules-2.13.4/lttng-modules-2.13.4/src/probes/lttng-probe-timer.mod.o LD [M] /tmp/B.rbg4g098/BUILD/lttng-modules-2.13.4/lttng-modules-2.13.4/src/probes/lttng-probe-timer.ko CC /tmp/B.rbg4g098/BUILD/lttng-modules-2.13.4/lttng-modules-2.13.4/src/probes/lttng-probe-writeback.mod.o LD [M] /tmp/B.rbg4g098/BUILD/lttng-modules-2.13.4/lttng-modules-2.13.4/src/tests/lttng-clock-plugin-test.ko LD [M] /tmp/B.rbg4g098/BUILD/lttng-modules-2.13.4/lttng-modules-2.13.4/src/probes/lttng-probe-writeback.ko CC /tmp/B.rbg4g098/BUILD/lttng-modules-2.13.4/lttng-modules-2.13.4/src/tests/lttng-test.mod.o LD [M] /tmp/B.rbg4g098/BUILD/lttng-modules-2.13.4/lttng-modules-2.13.4/src/tests/lttng-test.ko + pwd + p=/tmp/B.rbg4g098/BUILD/lttng-modules-2.13.4/lttng-modules-2.13.4 + /usr/bin/make -Otarget -j28 modules_install 'INSTALL_MOD_PATH=/tmp/B.rbg4g098/BUILD/lttng-modules-2.13.4/lttng-modules-2.13.4/../installed' 'INSTALL_MOD_DIR=kernel/lttng' 'KERNELDIR=/usr/src/linux-4.19' /usr/bin/make -C /usr/src/linux-4.19 M=/tmp/B.rbg4g098/BUILD/lttng-modules-2.13.4/lttng-modules-2.13.4/src \ CONFIG_LTTNG=m CONFIG_LTTNG_CLOCK_PLUGIN_TEST=m \ KCPPFLAGS='' \ modules_install INSTALL /tmp/B.rbg4g098/BUILD/lttng-modules-2.13.4/lttng-modules-2.13.4/src/lttng-clock.ko INSTALL /tmp/B.rbg4g098/BUILD/lttng-modules-2.13.4/lttng-modules-2.13.4/src/lttng-counter-client-percpu-32-modular.ko INSTALL /tmp/B.rbg4g098/BUILD/lttng-modules-2.13.4/lttng-modules-2.13.4/src/lttng-counter-client-percpu-64-modular.ko INSTALL /tmp/B.rbg4g098/BUILD/lttng-modules-2.13.4/lttng-modules-2.13.4/src/probes/lttng-kprobes.ko INSTALL /tmp/B.rbg4g098/BUILD/lttng-modules-2.13.4/lttng-modules-2.13.4/src/probes/lttng-kretprobes.ko INSTALL /tmp/B.rbg4g098/BUILD/lttng-modules-2.13.4/lttng-modules-2.13.4/src/lttng-ring-buffer-event-notifier-client.ko INSTALL /tmp/B.rbg4g098/BUILD/lttng-modules-2.13.4/lttng-modules-2.13.4/src/probes/lttng-probe-compaction.ko INSTALL /tmp/B.rbg4g098/BUILD/lttng-modules-2.13.4/lttng-modules-2.13.4/src/lib/lttng-counter.ko INSTALL /tmp/B.rbg4g098/BUILD/lttng-modules-2.13.4/lttng-modules-2.13.4/src/lttng-ring-buffer-metadata-mmap-client.ko INSTALL /tmp/B.rbg4g098/BUILD/lttng-modules-2.13.4/lttng-modules-2.13.4/src/lttng-ring-buffer-metadata-client.ko INSTALL /tmp/B.rbg4g098/BUILD/lttng-modules-2.13.4/lttng-modules-2.13.4/src/lttng-wrapper.ko INSTALL /tmp/B.rbg4g098/BUILD/lttng-modules-2.13.4/lttng-modules-2.13.4/src/lttng-ring-buffer-client-mmap-discard.ko INSTALL /tmp/B.rbg4g098/BUILD/lttng-modules-2.13.4/lttng-modules-2.13.4/src/probes/lttng-probe-gpio.ko INSTALL /tmp/B.rbg4g098/BUILD/lttng-modules-2.13.4/lttng-modules-2.13.4/src/lttng-ring-buffer-client-overwrite.ko INSTALL /tmp/B.rbg4g098/BUILD/lttng-modules-2.13.4/lttng-modules-2.13.4/src/lttng-ring-buffer-client-mmap-overwrite.ko INSTALL /tmp/B.rbg4g098/BUILD/lttng-modules-2.13.4/lttng-modules-2.13.4/src/probes/lttng-probe-9p.ko INSTALL /tmp/B.rbg4g098/BUILD/lttng-modules-2.13.4/lttng-modules-2.13.4/src/probes/lttng-probe-irq.ko INSTALL /tmp/B.rbg4g098/BUILD/lttng-modules-2.13.4/lttng-modules-2.13.4/src/lttng-statedump.ko INSTALL /tmp/B.rbg4g098/BUILD/lttng-modules-2.13.4/lttng-modules-2.13.4/src/probes/lttng-probe-i2c.ko INSTALL /tmp/B.rbg4g098/BUILD/lttng-modules-2.13.4/lttng-modules-2.13.4/src/lttng-ring-buffer-client-discard.ko INSTALL /tmp/B.rbg4g098/BUILD/lttng-modules-2.13.4/lttng-modules-2.13.4/src/probes/lttng-probe-kmem.ko INSTALL /tmp/B.rbg4g098/BUILD/lttng-modules-2.13.4/lttng-modules-2.13.4/src/probes/lttng-probe-asoc.ko INSTALL /tmp/B.rbg4g098/BUILD/lttng-modules-2.13.4/lttng-modules-2.13.4/src/probes/lttng-probe-jbd2.ko INSTALL /tmp/B.rbg4g098/BUILD/lttng-modules-2.13.4/lttng-modules-2.13.4/src/probes/lttng-probe-kvm.ko INSTALL /tmp/B.rbg4g098/BUILD/lttng-modules-2.13.4/lttng-modules-2.13.4/src/probes/lttng-probe-module.ko INSTALL /tmp/B.rbg4g098/BUILD/lttng-modules-2.13.4/lttng-modules-2.13.4/src/probes/lttng-probe-napi.ko INSTALL /tmp/B.rbg4g098/BUILD/lttng-modules-2.13.4/lttng-modules-2.13.4/src/probes/lttng-probe-net.ko INSTALL /tmp/B.rbg4g098/BUILD/lttng-modules-2.13.4/lttng-modules-2.13.4/src/probes/lttng-probe-power.ko INSTALL /tmp/B.rbg4g098/BUILD/lttng-modules-2.13.4/lttng-modules-2.13.4/src/probes/lttng-probe-printk.ko INSTALL /tmp/B.rbg4g098/BUILD/lttng-modules-2.13.4/lttng-modules-2.13.4/src/probes/lttng-probe-rcu.ko INSTALL /tmp/B.rbg4g098/BUILD/lttng-modules-2.13.4/lttng-modules-2.13.4/src/probes/lttng-probe-regmap.ko INSTALL /tmp/B.rbg4g098/BUILD/lttng-modules-2.13.4/lttng-modules-2.13.4/src/probes/lttng-probe-regulator.ko INSTALL /tmp/B.rbg4g098/BUILD/lttng-modules-2.13.4/lttng-modules-2.13.4/src/probes/lttng-probe-signal.ko INSTALL /tmp/B.rbg4g098/BUILD/lttng-modules-2.13.4/lttng-modules-2.13.4/src/probes/lttng-probe-skb.ko INSTALL /tmp/B.rbg4g098/BUILD/lttng-modules-2.13.4/lttng-modules-2.13.4/src/probes/lttng-probe-sock.ko INSTALL /tmp/B.rbg4g098/BUILD/lttng-modules-2.13.4/lttng-modules-2.13.4/src/probes/lttng-probe-udp.ko INSTALL /tmp/B.rbg4g098/BUILD/lttng-modules-2.13.4/lttng-modules-2.13.4/src/probes/lttng-probe-kvm-x86-mmu.ko INSTALL /tmp/B.rbg4g098/BUILD/lttng-modules-2.13.4/lttng-modules-2.13.4/src/probes/lttng-probe-scsi.ko INSTALL /tmp/B.rbg4g098/BUILD/lttng-modules-2.13.4/lttng-modules-2.13.4/src/probes/lttng-probe-block.ko INSTALL /tmp/B.rbg4g098/BUILD/lttng-modules-2.13.4/lttng-modules-2.13.4/src/probes/lttng-probe-sunrpc.ko INSTALL /tmp/B.rbg4g098/BUILD/lttng-modules-2.13.4/lttng-modules-2.13.4/src/probes/lttng-probe-sched.ko INSTALL /tmp/B.rbg4g098/BUILD/lttng-modules-2.13.4/lttng-modules-2.13.4/src/tests/lttng-clock-plugin-test.ko INSTALL /tmp/B.rbg4g098/BUILD/lttng-modules-2.13.4/lttng-modules-2.13.4/src/probes/lttng-uprobes.ko INSTALL /tmp/B.rbg4g098/BUILD/lttng-modules-2.13.4/lttng-modules-2.13.4/src/probes/lttng-probe-v4l2.ko INSTALL /tmp/B.rbg4g098/BUILD/lttng-modules-2.13.4/lttng-modules-2.13.4/src/probes/lttng-probe-btrfs.ko INSTALL /tmp/B.rbg4g098/BUILD/lttng-modules-2.13.4/lttng-modules-2.13.4/src/probes/lttng-probe-workqueue.ko INSTALL /tmp/B.rbg4g098/BUILD/lttng-modules-2.13.4/lttng-modules-2.13.4/src/probes/lttng-probe-x86-exceptions.ko INSTALL /tmp/B.rbg4g098/BUILD/lttng-modules-2.13.4/lttng-modules-2.13.4/src/probes/lttng-probe-x86-irq-vectors.ko INSTALL /tmp/B.rbg4g098/BUILD/lttng-modules-2.13.4/lttng-modules-2.13.4/src/lib/lttng-lib-ring-buffer.ko INSTALL /tmp/B.rbg4g098/BUILD/lttng-modules-2.13.4/lttng-modules-2.13.4/src/probes/lttng-probe-kvm-x86.ko INSTALL /tmp/B.rbg4g098/BUILD/lttng-modules-2.13.4/lttng-modules-2.13.4/src/probes/lttng-probe-statedump.ko INSTALL /tmp/B.rbg4g098/BUILD/lttng-modules-2.13.4/lttng-modules-2.13.4/src/probes/lttng-probe-timer.ko INSTALL /tmp/B.rbg4g098/BUILD/lttng-modules-2.13.4/lttng-modules-2.13.4/src/probes/lttng-probe-vmscan.ko INSTALL /tmp/B.rbg4g098/BUILD/lttng-modules-2.13.4/lttng-modules-2.13.4/src/tests/lttng-test.ko INSTALL /tmp/B.rbg4g098/BUILD/lttng-modules-2.13.4/lttng-modules-2.13.4/src/probes/lttng-probe-writeback.ko INSTALL /tmp/B.rbg4g098/BUILD/lttng-modules-2.13.4/lttng-modules-2.13.4/src/probes/lttng-probe-ext4.ko INSTALL /tmp/B.rbg4g098/BUILD/lttng-modules-2.13.4/lttng-modules-2.13.4/src/lttng-tracer.ko make[1]: Entering directory '/usr/src/linux-4.19-4.19.262' DEPMOD 4.19.262-1 Warning: modules_install: missing 'System.map' file. Skipping depmod. make[1]: Leaving directory '/usr/src/linux-4.19-4.19.262' + /usr/bin/make -Otarget -j28 clean 'KERNELDIR=/usr/src/linux' /usr/bin/make -C /usr/src/linux M=/tmp/B.rbg4g098/BUILD/lttng-modules-2.13.4/lttng-modules-2.13.4/src clean make[1]: Entering directory '/usr/src/linux-6.0.5' CLEAN /tmp/B.rbg4g098/BUILD/lttng-modules-2.13.4/lttng-modules-2.13.4/src/Module.symvers make[1]: Leaving directory '/usr/src/linux-6.0.5' + /usr/bin/make -Otarget -j28 'KERNELDIR=/usr/src/linux' /usr/bin/make -C /usr/src/linux M=/tmp/B.rbg4g098/BUILD/lttng-modules-2.13.4/lttng-modules-2.13.4/src \ CONFIG_LTTNG=m CONFIG_LTTNG_CLOCK_PLUGIN_TEST=m \ KCPPFLAGS='' \ modules make[1]: Entering directory '/usr/src/linux-6.0.5' warning: the compiler differs from the one used to build the kernel The kernel was built by: x86_64-pld-linux-gcc (PLD-Linux) 12.2.0 20220819 (release) You are using: gcc (PLD-Linux) 12.2.0 20220819 (release) make[1]: Leaving directory '/usr/src/linux-6.0.5' CC [M] /tmp/B.rbg4g098/BUILD/lttng-modules-2.13.4/lttng-modules-2.13.4/src/lttng-string-utils.o CC [M] /tmp/B.rbg4g098/BUILD/lttng-modules-2.13.4/lttng-modules-2.13.4/src/lib/msgpack/msgpack.o CC [M] /tmp/B.rbg4g098/BUILD/lttng-modules-2.13.4/lttng-modules-2.13.4/src/lttng-ring-buffer-event-notifier-client.o CC [M] /tmp/B.rbg4g098/BUILD/lttng-modules-2.13.4/lttng-modules-2.13.4/src/lttng-context-pid.o CC [M] /tmp/B.rbg4g098/BUILD/lttng-modules-2.13.4/lttng-modules-2.13.4/src/lttng-context-vpid.o CC [M] /tmp/B.rbg4g098/BUILD/lttng-modules-2.13.4/lttng-modules-2.13.4/src/lttng-context-vtid.o CC [M] /tmp/B.rbg4g098/BUILD/lttng-modules-2.13.4/lttng-modules-2.13.4/src/lttng-ring-buffer-metadata-client.o CC [M] /tmp/B.rbg4g098/BUILD/lttng-modules-2.13.4/lttng-modules-2.13.4/src/lttng-context-tid.o CC [M] /tmp/B.rbg4g098/BUILD/lttng-modules-2.13.4/lttng-modules-2.13.4/src/lttng-context-procname.o CC [M] /tmp/B.rbg4g098/BUILD/lttng-modules-2.13.4/lttng-modules-2.13.4/src/lttng-counter-client-percpu-32-modular.o CC [M] /tmp/B.rbg4g098/BUILD/lttng-modules-2.13.4/lttng-modules-2.13.4/src/lttng-context-cpu-id.o CC [M] /tmp/B.rbg4g098/BUILD/lttng-modules-2.13.4/lttng-modules-2.13.4/src/lttng-context-nice.o CC [M] /tmp/B.rbg4g098/BUILD/lttng-modules-2.13.4/lttng-modules-2.13.4/src/lttng-counter-client-percpu-64-modular.o CC [M] /tmp/B.rbg4g098/BUILD/lttng-modules-2.13.4/lttng-modules-2.13.4/src/lttng-context-prio.o CC [M] /tmp/B.rbg4g098/BUILD/lttng-modules-2.13.4/lttng-modules-2.13.4/src/lttng-clock.o CC [M] /tmp/B.rbg4g098/BUILD/lttng-modules-2.13.4/lttng-modules-2.13.4/src/lttng-ring-buffer-client-overwrite.o CC [M] /tmp/B.rbg4g098/BUILD/lttng-modules-2.13.4/lttng-modules-2.13.4/src/lttng-ring-buffer-client-mmap-overwrite.o CC [M] /tmp/B.rbg4g098/BUILD/lttng-modules-2.13.4/lttng-modules-2.13.4/src/lttng-ring-buffer-metadata-mmap-client.o CC [M] /tmp/B.rbg4g098/BUILD/lttng-modules-2.13.4/lttng-modules-2.13.4/src/lttng-probes.o CC [M] /tmp/B.rbg4g098/BUILD/lttng-modules-2.13.4/lttng-modules-2.13.4/src/tests/probes/lttng-test.o CC [M] /tmp/B.rbg4g098/BUILD/lttng-modules-2.13.4/lttng-modules-2.13.4/src/lttng-context.o LD [M] /tmp/B.rbg4g098/BUILD/lttng-modules-2.13.4/lttng-modules-2.13.4/src/tests/lttng-test.o CC [M] /tmp/B.rbg4g098/BUILD/lttng-modules-2.13.4/lttng-modules-2.13.4/src/lttng-context-ppid.o CC [M] /tmp/B.rbg4g098/BUILD/lttng-modules-2.13.4/lttng-modules-2.13.4/src/lttng-context-vppid.o CC [M] /tmp/B.rbg4g098/BUILD/lttng-modules-2.13.4/lttng-modules-2.13.4/src/lttng-ring-buffer-client-mmap-discard.o CC [M] /tmp/B.rbg4g098/BUILD/lttng-modules-2.13.4/lttng-modules-2.13.4/src/lttng-ring-buffer-client-discard.o CC [M] /tmp/B.rbg4g098/BUILD/lttng-modules-2.13.4/lttng-modules-2.13.4/src/lib/ringbuffer/ring_buffer_backend.o CC [M] /tmp/B.rbg4g098/BUILD/lttng-modules-2.13.4/lttng-modules-2.13.4/src/lib/../wrapper/splice.o CC [M] /tmp/B.rbg4g098/BUILD/lttng-modules-2.13.4/lttng-modules-2.13.4/src/lttng-abi.o CC [M] /tmp/B.rbg4g098/BUILD/lttng-modules-2.13.4/lttng-modules-2.13.4/src/probes/lttng-probe-irq.o CC [M] /tmp/B.rbg4g098/BUILD/lttng-modules-2.13.4/lttng-modules-2.13.4/src/tests/clock-plugin/lttng-clock-plugin-test.o LD [M] /tmp/B.rbg4g098/BUILD/lttng-modules-2.13.4/lttng-modules-2.13.4/src/tests/lttng-clock-plugin-test.o CC [M] /tmp/B.rbg4g098/BUILD/lttng-modules-2.13.4/lttng-modules-2.13.4/src/probes/lttng-probe-kmem.o In file included from /tmp/B.rbg4g098/BUILD/lttng-modules-2.13.4/lttng-modules-2.13.4/src/probes/../../include/lttng/define_trace.h:87, from /tmp/B.rbg4g098/BUILD/lttng-modules-2.13.4/lttng-modules-2.13.4/src/probes/../../include/instrumentation/events/kmem.h:412, from /tmp/B.rbg4g098/BUILD/lttng-modules-2.13.4/lttng-modules-2.13.4/src/probes/lttng-probe-kmem.c:35: /tmp/B.rbg4g098/BUILD/lttng-modules-2.13.4/lttng-modules-2.13.4/src/probes/../../include/lttng/tracepoint-event-impl.h:133:6: error: conflicting types for 'trace_kmalloc'; have 'void(long unsigned int, const void *, size_t, size_t, gfp_t)' {aka 'void(long unsigned int, const void *, long unsigned int, long unsigned int, unsigned int)'} 133 | void trace_##_name(_proto); | ^~~~~~ /tmp/B.rbg4g098/BUILD/lttng-modules-2.13.4/lttng-modules-2.13.4/src/probes/../../include/instrumentation/events/kmem.h:31:1: note: in expansion of macro 'LTTNG_TRACEPOINT_EVENT_INSTANCE_MAP' 31 | LTTNG_TRACEPOINT_EVENT_INSTANCE_MAP(kmem_alloc, kmalloc, | ^~~~~~~~~~~~~~~~~~~~~~~~~~~~~~~~~~~ In file included from ./include/trace/events/kmem.h:9, from /tmp/B.rbg4g098/BUILD/lttng-modules-2.13.4/lttng-modules-2.13.4/src/probes/lttng-probe-kmem.c:24: ./include/linux/tracepoint.h:245:28: note: previous definition of 'trace_kmalloc' with type 'void(long unsigned int, const void *, struct kmem_cache *, size_t, size_t, gfp_t)' {aka 'void(long unsigned int, const void *, struct kmem_cache *, long unsigned int, long unsigned int, unsigned int)'} 245 | static inline void trace_##name(proto) \ | ^~~~~~ ./include/linux/tracepoint.h:419:9: note: in expansion of macro '__DECLARE_TRACE' 419 | __DECLARE_TRACE(name, PARAMS(proto), PARAMS(args), \ | ^~~~~~~~~~~~~~~ ./include/linux/tracepoint.h:542:9: note: in expansion of macro 'DECLARE_TRACE' 542 | DECLARE_TRACE(name, PARAMS(proto), PARAMS(args)) | ^~~~~~~~~~~~~ ./include/trace/events/kmem.h:52:1: note: in expansion of macro 'DEFINE_EVENT' 52 | DEFINE_EVENT(kmem_alloc, kmalloc, | ^~~~~~~~~~~~ /tmp/B.rbg4g098/BUILD/lttng-modules-2.13.4/lttng-modules-2.13.4/src/probes/../../include/lttng/tracepoint-event-impl.h:133:6: error: conflicting types for 'trace_kmem_cache_alloc'; have 'void(long unsigned int, const void *, size_t, size_t, gfp_t)' {aka 'void(long unsigned int, const void *, long unsigned int, long unsigned int, unsigned int)'} 133 | void trace_##_name(_proto); | ^~~~~~ /tmp/B.rbg4g098/BUILD/lttng-modules-2.13.4/lttng-modules-2.13.4/src/probes/../../include/lttng/tracepoint-event-impl.h:98:9: note: in expansion of macro 'LTTNG_TRACEPOINT_EVENT_INSTANCE_MAP' 98 | LTTNG_TRACEPOINT_EVENT_INSTANCE_MAP(template, name, name, PARAMS(proto), PARAMS(args)) | ^~~~~~~~~~~~~~~~~~~~~~~~~~~~~~~~~~~ /tmp/B.rbg4g098/BUILD/lttng-modules-2.13.4/lttng-modules-2.13.4/src/probes/../../include/instrumentation/events/kmem.h:41:1: note: in expansion of macro 'LTTNG_TRACEPOINT_EVENT_INSTANCE' 41 | LTTNG_TRACEPOINT_EVENT_INSTANCE(kmem_alloc, kmem_cache_alloc, | ^~~~~~~~~~~~~~~~~~~~~~~~~~~~~~~ ./include/linux/tracepoint.h:245:28: note: previous definition of 'trace_kmem_cache_alloc' with type 'void(long unsigned int, const void *, struct kmem_cache *, size_t, size_t, gfp_t)' {aka 'void(long unsigned int, const void *, struct kmem_cache *, long unsigned int, long unsigned int, unsigned int)'} 245 | static inline void trace_##name(proto) \ | ^~~~~~ ./include/linux/tracepoint.h:419:9: note: in expansion of macro '__DECLARE_TRACE' 419 | __DECLARE_TRACE(name, PARAMS(proto), PARAMS(args), \ | ^~~~~~~~~~~~~~~ ./include/linux/tracepoint.h:542:9: note: in expansion of macro 'DECLARE_TRACE' 542 | DECLARE_TRACE(name, PARAMS(proto), PARAMS(args)) | ^~~~~~~~~~~~~ ./include/trace/events/kmem.h:60:1: note: in expansion of macro 'DEFINE_EVENT' 60 | DEFINE_EVENT(kmem_alloc, kmem_cache_alloc, | ^~~~~~~~~~~~ /tmp/B.rbg4g098/BUILD/lttng-modules-2.13.4/lttng-modules-2.13.4/src/probes/../../include/lttng/tracepoint-event-impl.h:133:6: error: conflicting types for 'trace_kmalloc_node'; have 'void(long unsigned int, const void *, size_t, size_t, gfp_t, int)' {aka 'void(long unsigned int, const void *, long unsigned int, long unsigned int, unsigned int, int)'} 133 | void trace_##_name(_proto); | ^~~~~~ /tmp/B.rbg4g098/BUILD/lttng-modules-2.13.4/lttng-modules-2.13.4/src/probes/../../include/instrumentation/events/kmem.h:70:1: note: in expansion of macro 'LTTNG_TRACEPOINT_EVENT_INSTANCE_MAP' 70 | LTTNG_TRACEPOINT_EVENT_INSTANCE_MAP(kmem_alloc_node, kmalloc_node, | ^~~~~~~~~~~~~~~~~~~~~~~~~~~~~~~~~~~ ./include/linux/tracepoint.h:245:28: note: previous definition of 'trace_kmalloc_node' with type 'void(long unsigned int, const void *, struct kmem_cache *, size_t, size_t, gfp_t, int)' {aka 'void(long unsigned int, const void *, struct kmem_cache *, long unsigned int, long unsigned int, unsigned int, int)'} 245 | static inline void trace_##name(proto) \ | ^~~~~~ ./include/linux/tracepoint.h:419:9: note: in expansion of macro '__DECLARE_TRACE' 419 | __DECLARE_TRACE(name, PARAMS(proto), PARAMS(args), \ | ^~~~~~~~~~~~~~~ ./include/linux/tracepoint.h:542:9: note: in expansion of macro 'DECLARE_TRACE' 542 | DECLARE_TRACE(name, PARAMS(proto), PARAMS(args)) | ^~~~~~~~~~~~~ ./include/trace/events/kmem.h:112:1: note: in expansion of macro 'DEFINE_EVENT' 112 | DEFINE_EVENT(kmem_alloc_node, kmalloc_node, | ^~~~~~~~~~~~ /tmp/B.rbg4g098/BUILD/lttng-modules-2.13.4/lttng-modules-2.13.4/src/probes/../../include/lttng/tracepoint-event-impl.h:133:6: error: conflicting types for 'trace_kmem_cache_alloc_node'; have 'void(long unsigned int, const void *, size_t, size_t, gfp_t, int)' {aka 'void(long unsigned int, const void *, long unsigned int, long unsigned int, unsigned int, int)'} 133 | void trace_##_name(_proto); | ^~~~~~ /tmp/B.rbg4g098/BUILD/lttng-modules-2.13.4/lttng-modules-2.13.4/src/probes/../../include/lttng/tracepoint-event-impl.h:98:9: note: in expansion of macro 'LTTNG_TRACEPOINT_EVENT_INSTANCE_MAP' 98 | LTTNG_TRACEPOINT_EVENT_INSTANCE_MAP(template, name, name, PARAMS(proto), PARAMS(args)) | ^~~~~~~~~~~~~~~~~~~~~~~~~~~~~~~~~~~ /tmp/B.rbg4g098/BUILD/lttng-modules-2.13.4/lttng-modules-2.13.4/src/probes/../../include/instrumentation/events/kmem.h:81:1: note: in expansion of macro 'LTTNG_TRACEPOINT_EVENT_INSTANCE' 81 | LTTNG_TRACEPOINT_EVENT_INSTANCE(kmem_alloc_node, kmem_cache_alloc_node, | ^~~~~~~~~~~~~~~~~~~~~~~~~~~~~~~ ./include/linux/tracepoint.h:245:28: note: previous definition of 'trace_kmem_cache_alloc_node' with type 'void(long unsigned int, const void *, struct kmem_cache *, size_t, size_t, gfp_t, int)' {aka 'void(long unsigned int, const void *, struct kmem_cache *, long unsigned int, long unsigned int, unsigned int, int)'} 245 | static inline void trace_##name(proto) \ | ^~~~~~ ./include/linux/tracepoint.h:419:9: note: in expansion of macro '__DECLARE_TRACE' 419 | __DECLARE_TRACE(name, PARAMS(proto), PARAMS(args), \ | ^~~~~~~~~~~~~~~ ./include/linux/tracepoint.h:542:9: note: in expansion of macro 'DECLARE_TRACE' 542 | DECLARE_TRACE(name, PARAMS(proto), PARAMS(args)) | ^~~~~~~~~~~~~ ./include/trace/events/kmem.h:121:1: note: in expansion of macro 'DEFINE_EVENT' 121 | DEFINE_EVENT(kmem_alloc_node, kmem_cache_alloc_node, | ^~~~~~~~~~~~ make[3]: *** [scripts/Makefile.build:249: /tmp/B.rbg4g098/BUILD/lttng-modules-2.13.4/lttng-modules-2.13.4/src/probes/lttng-probe-kmem.o] Error 1 make[3]: *** Waiting for unfinished jobs.... CC [M] /tmp/B.rbg4g098/BUILD/lttng-modules-2.13.4/lttng-modules-2.13.4/src/lib/ringbuffer/ring_buffer_splice.o CC [M] /tmp/B.rbg4g098/BUILD/lttng-modules-2.13.4/lttng-modules-2.13.4/src/lib/prio_heap/lttng_prio_heap.o CC [M] /tmp/B.rbg4g098/BUILD/lttng-modules-2.13.4/lttng-modules-2.13.4/src/probes/lttng-probe-x86-irq-vectors.o CC [M] /tmp/B.rbg4g098/BUILD/lttng-modules-2.13.4/lttng-modules-2.13.4/src/lttng-context-uid.o CC [M] /tmp/B.rbg4g098/BUILD/lttng-modules-2.13.4/lttng-modules-2.13.4/src/probes/lttng-probe-9p.o CC [M] /tmp/B.rbg4g098/BUILD/lttng-modules-2.13.4/lttng-modules-2.13.4/src/lib/ringbuffer/ring_buffer_vfs.o CC [M] /tmp/B.rbg4g098/BUILD/lttng-modules-2.13.4/lttng-modules-2.13.4/src/lttng-context-euid.o CC [M] /tmp/B.rbg4g098/BUILD/lttng-modules-2.13.4/lttng-modules-2.13.4/src/probes/lttng-probe-i2c.o CC [M] /tmp/B.rbg4g098/BUILD/lttng-modules-2.13.4/lttng-modules-2.13.4/src/probes/lttng-probe-module.o CC [M] /tmp/B.rbg4g098/BUILD/lttng-modules-2.13.4/lttng-modules-2.13.4/src/lib/ringbuffer/ring_buffer_iterator.o CC [M] /tmp/B.rbg4g098/BUILD/lttng-modules-2.13.4/lttng-modules-2.13.4/src/probes/lttng-probe-power.o CC [M] /tmp/B.rbg4g098/BUILD/lttng-modules-2.13.4/lttng-modules-2.13.4/src/probes/lttng-probe-sched.o CC [M] /tmp/B.rbg4g098/BUILD/lttng-modules-2.13.4/lttng-modules-2.13.4/src/lttng-context-suid.o CC [M] /tmp/B.rbg4g098/BUILD/lttng-modules-2.13.4/lttng-modules-2.13.4/src/lib/ringbuffer/ring_buffer_mmap.o CC [M] /tmp/B.rbg4g098/BUILD/lttng-modules-2.13.4/lttng-modules-2.13.4/src/lib/ringbuffer/ring_buffer_frontend.o CC [M] /tmp/B.rbg4g098/BUILD/lttng-modules-2.13.4/lttng-modules-2.13.4/src/probes/lttng-probe-x86-exceptions.o LD [M] /tmp/B.rbg4g098/BUILD/lttng-modules-2.13.4/lttng-modules-2.13.4/src/lib/lttng-lib-ring-buffer.o CC [M] /tmp/B.rbg4g098/BUILD/lttng-modules-2.13.4/lttng-modules-2.13.4/src/probes/lttng-probe-timer.o CC [M] /tmp/B.rbg4g098/BUILD/lttng-modules-2.13.4/lttng-modules-2.13.4/src/probes/lttng-probe-signal.o CC [M] /tmp/B.rbg4g098/BUILD/lttng-modules-2.13.4/lttng-modules-2.13.4/src/lttng-context-gid.o CC [M] /tmp/B.rbg4g098/BUILD/lttng-modules-2.13.4/lttng-modules-2.13.4/src/probes/lttng-probe-kvm.o CC [M] /tmp/B.rbg4g098/BUILD/lttng-modules-2.13.4/lttng-modules-2.13.4/src/lttng-events.o CC [M] /tmp/B.rbg4g098/BUILD/lttng-modules-2.13.4/lttng-modules-2.13.4/src/lttng-calibrate.o CC [M] /tmp/B.rbg4g098/BUILD/lttng-modules-2.13.4/lttng-modules-2.13.4/src/lttng-context-egid.o CC [M] /tmp/B.rbg4g098/BUILD/lttng-modules-2.13.4/lttng-modules-2.13.4/src/probes/lttng.o CC [M] /tmp/B.rbg4g098/BUILD/lttng-modules-2.13.4/lttng-modules-2.13.4/src/lttng-context-vuid.o CC [M] /tmp/B.rbg4g098/BUILD/lttng-modules-2.13.4/lttng-modules-2.13.4/src/lttng-context-sgid.o CC [M] /tmp/B.rbg4g098/BUILD/lttng-modules-2.13.4/lttng-modules-2.13.4/src/probes/lttng-probe-kvm-x86-mmu.o CC [M] /tmp/B.rbg4g098/BUILD/lttng-modules-2.13.4/lttng-modules-2.13.4/src/lttng-context-veuid.o CC [M] /tmp/B.rbg4g098/BUILD/lttng-modules-2.13.4/lttng-modules-2.13.4/src/lttng-bytecode.o CC [M] /tmp/B.rbg4g098/BUILD/lttng-modules-2.13.4/lttng-modules-2.13.4/src/lttng-tp-mempool.o CC [M] /tmp/B.rbg4g098/BUILD/lttng-modules-2.13.4/lttng-modules-2.13.4/src/lttng-context-vsuid.o CC [M] /tmp/B.rbg4g098/BUILD/lttng-modules-2.13.4/lttng-modules-2.13.4/src/lttng-context-need-reschedule.o CC [M] /tmp/B.rbg4g098/BUILD/lttng-modules-2.13.4/lttng-modules-2.13.4/src/lttng-context-vgid.o CC [M] /tmp/B.rbg4g098/BUILD/lttng-modules-2.13.4/lttng-modules-2.13.4/src/lttng-context-vsgid.o CC [M] /tmp/B.rbg4g098/BUILD/lttng-modules-2.13.4/lttng-modules-2.13.4/src/lttng-context-hostname.o CC [M] /tmp/B.rbg4g098/BUILD/lttng-modules-2.13.4/lttng-modules-2.13.4/src/lib/counter/counter.o CC [M] /tmp/B.rbg4g098/BUILD/lttng-modules-2.13.4/lttng-modules-2.13.4/src/lttng-context-vegid.o CC [M] /tmp/B.rbg4g098/BUILD/lttng-modules-2.13.4/lttng-modules-2.13.4/src/lttng-context-callstack.o LD [M] /tmp/B.rbg4g098/BUILD/lttng-modules-2.13.4/lttng-modules-2.13.4/src/lib/lttng-counter.o CC [M] /tmp/B.rbg4g098/BUILD/lttng-modules-2.13.4/lttng-modules-2.13.4/src/probes/lttng-probe-user.o CC [M] /tmp/B.rbg4g098/BUILD/lttng-modules-2.13.4/lttng-modules-2.13.4/src/lttng-context-interruptible.o CC [M] /tmp/B.rbg4g098/BUILD/lttng-modules-2.13.4/lttng-modules-2.13.4/src/lttng-tracker-id.o CC [M] /tmp/B.rbg4g098/BUILD/lttng-modules-2.13.4/lttng-modules-2.13.4/src/probes/lttng-probe-statedump.o CC [M] /tmp/B.rbg4g098/BUILD/lttng-modules-2.13.4/lttng-modules-2.13.4/src/lttng-bytecode-specialize.o CC [M] /tmp/B.rbg4g098/BUILD/lttng-modules-2.13.4/lttng-modules-2.13.4/src/lttng-event-notifier-notification.o CC [M] /tmp/B.rbg4g098/BUILD/lttng-modules-2.13.4/lttng-modules-2.13.4/src/lttng-tracepoint.o CC [M] /tmp/B.rbg4g098/BUILD/lttng-modules-2.13.4/lttng-modules-2.13.4/src/lttng-bytecode-interpreter.o CC [M] /tmp/B.rbg4g098/BUILD/lttng-modules-2.13.4/lttng-modules-2.13.4/src/lttng-bytecode-validator.o CC [M] /tmp/B.rbg4g098/BUILD/lttng-modules-2.13.4/lttng-modules-2.13.4/src/lttng-syscalls-enum.o CC [M] /tmp/B.rbg4g098/BUILD/lttng-modules-2.13.4/lttng-modules-2.13.4/src/lttng-context-perf-counters.o CC [M] /tmp/B.rbg4g098/BUILD/lttng-modules-2.13.4/lttng-modules-2.13.4/src/probes/lttng-probe-block.o CC [M] /tmp/B.rbg4g098/BUILD/lttng-modules-2.13.4/lttng-modules-2.13.4/src/wrapper/trace-clock.o CC [M] /tmp/B.rbg4g098/BUILD/lttng-modules-2.13.4/lttng-modules-2.13.4/src/wrapper/fdtable.o CC [M] /tmp/B.rbg4g098/BUILD/lttng-modules-2.13.4/lttng-modules-2.13.4/src/wrapper/page_alloc.o CC [M] /tmp/B.rbg4g098/BUILD/lttng-modules-2.13.4/lttng-modules-2.13.4/src/lttng-wrapper-impl.o CC [M] /tmp/B.rbg4g098/BUILD/lttng-modules-2.13.4/lttng-modules-2.13.4/src/probes/lttng-probe-kvm-x86.o make[2]: *** [scripts/Makefile.build:465: /tmp/B.rbg4g098/BUILD/lttng-modules-2.13.4/lttng-modules-2.13.4/src/probes] Error 2 make[2]: *** Waiting for unfinished jobs.... CC [M] /tmp/B.rbg4g098/BUILD/lttng-modules-2.13.4/lttng-modules-2.13.4/src/lttng-context-uts-ns.o CC [M] /tmp/B.rbg4g098/BUILD/lttng-modules-2.13.4/lttng-modules-2.13.4/src/lttng-context-ipc-ns.o CC [M] /tmp/B.rbg4g098/BUILD/lttng-modules-2.13.4/lttng-modules-2.13.4/src/lttng-context-time-ns.o CC [M] /tmp/B.rbg4g098/BUILD/lttng-modules-2.13.4/lttng-modules-2.13.4/src/wrapper/random.o CC [M] /tmp/B.rbg4g098/BUILD/lttng-modules-2.13.4/lttng-modules-2.13.4/src/lttng-context-pid-ns.o CC [M] /tmp/B.rbg4g098/BUILD/lttng-modules-2.13.4/lttng-modules-2.13.4/src/lttng-context-user-ns.o CC [M] /tmp/B.rbg4g098/BUILD/lttng-modules-2.13.4/lttng-modules-2.13.4/src/lttng-context-cgroup-ns.o CC [M] /tmp/B.rbg4g098/BUILD/lttng-modules-2.13.4/lttng-modules-2.13.4/src/lttng-context-mnt-ns.o CC [M] /tmp/B.rbg4g098/BUILD/lttng-modules-2.13.4/lttng-modules-2.13.4/src/wrapper/kallsyms.o CC [M] /tmp/B.rbg4g098/BUILD/lttng-modules-2.13.4/lttng-modules-2.13.4/src/wrapper/irqdesc.o CC [M] /tmp/B.rbg4g098/BUILD/lttng-modules-2.13.4/lttng-modules-2.13.4/src/lttng-context-net-ns.o CC [M] /tmp/B.rbg4g098/BUILD/lttng-modules-2.13.4/lttng-modules-2.13.4/src/lttng-syscalls.o CC [M] /tmp/B.rbg4g098/BUILD/lttng-modules-2.13.4/lttng-modules-2.13.4/src/lttng-statedump-impl.o /tmp/B.rbg4g098/BUILD/lttng-modules-2.13.4/lttng-modules-2.13.4/src/lttng-statedump-impl.c: In function 'lttng_get_part_name': /tmp/B.rbg4g098/BUILD/lttng-modules-2.13.4/lttng-modules-2.13.4/src/lttng-statedump-impl.c:209:13: error: implicit declaration of function 'bdevname'; did you mean 'dev_name'? [-Werror=implicit-function-declaration] 209 | p = bdevname(part, name_buf); | ^~~~~~~~ | dev_name /tmp/B.rbg4g098/BUILD/lttng-modules-2.13.4/lttng-modules-2.13.4/src/lttng-statedump-impl.c:209:11: warning: assignment to 'const char *' from 'int' makes pointer from integer without a cast [-Wint-conversion] 209 | p = bdevname(part, name_buf); | ^ cc1: some warnings being treated as errors make[2]: *** [scripts/Makefile.build:249: /tmp/B.rbg4g098/BUILD/lttng-modules-2.13.4/lttng-modules-2.13.4/src/lttng-statedump-impl.o] Error 1 CC [M] /tmp/B.rbg4g098/BUILD/lttng-modules-2.13.4/lttng-modules-2.13.4/src/lttng-syscalls-exit-table.o CC [M] /tmp/B.rbg4g098/BUILD/lttng-modules-2.13.4/lttng-modules-2.13.4/src/lttng-syscalls-exit-compat-table.o CC [M] /tmp/B.rbg4g098/BUILD/lttng-modules-2.13.4/lttng-modules-2.13.4/src/lttng-syscalls-entry-compat-table.o CC [M] /tmp/B.rbg4g098/BUILD/lttng-modules-2.13.4/lttng-modules-2.13.4/src/lttng-syscalls-entry-table.o make[1]: *** [Makefile:1852: /tmp/B.rbg4g098/BUILD/lttng-modules-2.13.4/lttng-modules-2.13.4/src] Error 2 make: *** [Makefile:31: modules] Error 2 error: Bad exit status from /tmp/B.rbg4g098/BUILD/tmp/rpm-tmp.IdHx34 (%build) RPM build warnings: Could not canonicalize hostname: ymir RPM build errors: Bad exit status from /tmp/B.rbg4g098/BUILD/tmp/rpm-tmp.IdHx34 (%build) ended at: Fri Oct 28 16:33:18 2022, done in 0:01:35.912009 error: No files produced. + chmod -R u+rwX /tmp/B.rbg4g098/BUILD + rm -rf /tmp/B.rbg4g098/tmp /tmp/B.rbg4g098/BUILD + rm -rf /tmp/B.rbg4g098 Begin-PLD-Builder-Info Build-Time: user:606.21s sys:96.48s real:116.99s (faults io:146 non-io:15092051) End-PLD-Builder-Info
[Back to list of logs] [View rpm -qa of builder]