FailedOk

th/SRPMS[OK]
th/x32[OK]
th/i686[OK]
th/x86_64[OK]

ac/SRPMS[OK]
ac/i386[OK]
ac/i586[OK]
ac/i686[OK]
ac/alpha[OK]
ac/amd64[OK]
ac/athlon[OK]
ac/ppc[OK]
ac/sparc[OK]
ac/sparc64[OK]

Advanced Search
main()
Powered by PLD Linux
(c) 2002-2022 PLD Team
$Revision: 1.37 $
Powered by Real Computer.
Your IP: 3.238.98.39

mame 4c59571c-1911-4ebd-b80d-6d317b622b9a

Status:Failed
Source URL:https://buildlogs.pld-linux.org/pld/th/x86_64/FAIL/mame,4c59571c-1911-4ebd-b80d-6d317b622b9a.bz2
text/plain URL:View!
full text:View!
rpm -qa of builder:View!
Date:2022/09/11 20:54:33
Runtime:0:01:32.679475

Toc:

  • error 1
  • ../../../../../src/emu/input.h:411:49: error: 'void* memcpy(void*, const void*, size_t)' writing to an object of non-trivially copyable type 'class input_code'; use copy-assignment or copy-initialization instead [-Werror=class-memaccess]
  • error 2
  • make[2]: *** [precompile.make:294: ../../../../linux_gcc/obj/x64/Release/emu.h.gch] Error 1
  • error 3
  • make[1]: *** [Makefile:52: precompile] Error 2
  • error 4
  • error: Bad exit status from /tmp/B.t6ty_sgd/BUILD/tmp/rpm-tmp.CkciB2 (%build)
  • error 5
  • RPM build errors:
  • error 6
  • error: No files produced.

Content:

Generating ../build/projects/sdl/mame/gmake-linux/northstar.make...
Generating ../build/projects/sdl/mame/gmake-linux/novag.make...
Generating ../build/projects/sdl/mame/gmake-linux/olivetti.make...
Generating ../build/projects/sdl/mame/gmake-linux/ns.make...
Generating ../build/projects/sdl/mame/gmake-linux/omnibyte.make...
Generating ../build/projects/sdl/mame/gmake-linux/orion.make...
Generating ../build/projects/sdl/mame/gmake-linux/osborne.make...
Generating ../build/projects/sdl/mame/gmake-linux/osi.make...
Generating ../build/projects/sdl/mame/gmake-linux/palm.make...
Generating ../build/projects/sdl/mame/gmake-linux/pitronic.make...
Generating ../build/projects/sdl/mame/gmake-linux/pc.make...
Generating ../build/projects/sdl/mame/gmake-linux/pdp1.make...
Generating ../build/projects/sdl/mame/gmake-linux/pel.make...
Generating ../build/projects/sdl/mame/gmake-linux/philips.make...
Generating ../build/projects/sdl/mame/gmake-linux/poly88.make...
Generating ../build/projects/sdl/mame/gmake-linux/prodigy.make...
Generating ../build/projects/sdl/mame/gmake-linux/psion.make...
Generating ../build/projects/sdl/mame/gmake-linux/radio.make...
Generating ../build/projects/sdl/mame/gmake-linux/rca.make...
Generating ../build/projects/sdl/mame/gmake-linux/regnecentralen.make...
Generating ../build/projects/sdl/mame/gmake-linux/ritam.make...
Generating ../build/projects/sdl/mame/gmake-linux/rm.make...
Generating ../build/projects/sdl/mame/gmake-linux/robotron.make...
Generating ../build/projects/sdl/mame/gmake-linux/roland.make...
Generating ../build/projects/sdl/mame/gmake-linux/rolm.make...
Generating ../build/projects/sdl/mame/gmake-linux/rockwell.make...
Generating ../build/projects/sdl/mame/gmake-linux/saturn.make...
Generating ../build/projects/sdl/mame/gmake-linux/sage.make...
Generating ../build/projects/sdl/mame/gmake-linux/samcoupe.make...
Generating ../build/projects/sdl/mame/gmake-linux/samsung.make...
Generating ../build/projects/sdl/mame/gmake-linux/sanyo.make...
Generating ../build/projects/sdl/mame/gmake-linux/sequential.make...
Generating ../build/projects/sdl/mame/gmake-linux/sgi.make...
Generating ../build/projects/sdl/mame/gmake-linux/sharp.make...
Generating ../build/projects/sdl/mame/gmake-linux/sinclair.make...
Generating ../build/projects/sdl/mame/gmake-linux/siemens.make...
Generating ../build/projects/sdl/mame/gmake-linux/slicer.make...
Generating ../build/projects/sdl/mame/gmake-linux/sord.make...
Generating ../build/projects/sdl/mame/gmake-linux/special.make...
Generating ../build/projects/sdl/mame/gmake-linux/sun.make...
Generating ../build/projects/sdl/mame/gmake-linux/svi.make...
Generating ../build/projects/sdl/mame/gmake-linux/svision.make...
Generating ../build/projects/sdl/mame/gmake-linux/swtpc09.make...
Generating ../build/projects/sdl/mame/gmake-linux/synertec.make...
Generating ../build/projects/sdl/mame/gmake-linux/ta.make...
Generating ../build/projects/sdl/mame/gmake-linux/tandberg.make...
Generating ../build/projects/sdl/mame/gmake-linux/tangerin.make...
Generating ../build/projects/sdl/mame/gmake-linux/tatung.make...
Generating ../build/projects/sdl/mame/gmake-linux/teamconc.make...
Generating ../build/projects/sdl/mame/gmake-linux/tektroni.make...
Generating ../build/projects/sdl/mame/gmake-linux/telenova.make...
Generating ../build/projects/sdl/mame/gmake-linux/telercas.make...
Generating ../build/projects/sdl/mame/gmake-linux/televideo.make...
Generating ../build/projects/sdl/mame/gmake-linux/tem.make...
Generating ../build/projects/sdl/mame/gmake-linux/tesla.make...
Generating ../build/projects/sdl/mame/gmake-linux/test.make...
Generating ../build/projects/sdl/mame/gmake-linux/thomson.make...
Generating ../build/projects/sdl/mame/gmake-linux/ti.make...
Generating ../build/projects/sdl/mame/gmake-linux/tiger.make...
Generating ../build/projects/sdl/mame/gmake-linux/tigertel.make...
Generating ../build/projects/sdl/mame/gmake-linux/tiki.make...
Generating ../build/projects/sdl/mame/gmake-linux/tomy.make...
Generating ../build/projects/sdl/mame/gmake-linux/toshiba.make...
Generating ../build/projects/sdl/mame/gmake-linux/trainer.make...
Generating ../build/projects/sdl/mame/gmake-linux/trs.make...
Generating ../build/projects/sdl/mame/gmake-linux/ultimachine.make...
Generating ../build/projects/sdl/mame/gmake-linux/ultratec.make...
Generating ../build/projects/sdl/mame/gmake-linux/unicard.make...
Generating ../build/projects/sdl/mame/gmake-linux/unisonic.make...
Generating ../build/projects/sdl/mame/gmake-linux/unisys.make...
Generating ../build/projects/sdl/mame/gmake-linux/usp.make...
Generating ../build/projects/sdl/mame/gmake-linux/veb.make...
Generating ../build/projects/sdl/mame/gmake-linux/verifone.make...
Generating ../build/projects/sdl/mame/gmake-linux/vidbrain.make...
Generating ../build/projects/sdl/mame/gmake-linux/videoton.make...
Generating ../build/projects/sdl/mame/gmake-linux/visual.make...
Generating ../build/projects/sdl/mame/gmake-linux/votrax.make...
Generating ../build/projects/sdl/mame/gmake-linux/vtech.make...
Generating ../build/projects/sdl/mame/gmake-linux/wang.make...
Generating ../build/projects/sdl/mame/gmake-linux/wavemate.make...
Generating ../build/projects/sdl/mame/gmake-linux/xerox.make...
Generating ../build/projects/sdl/mame/gmake-linux/xussrpc.make...
Generating ../build/projects/sdl/mame/gmake-linux/yamaha.make...
Generating ../build/projects/sdl/mame/gmake-linux/zenith.make...
Generating ../build/projects/sdl/mame/gmake-linux/zpa.make...
Generating ../build/projects/sdl/mame/gmake-linux/zvt.make...
Generating ../build/projects/sdl/mame/gmake-linux/skeleton.make...
Generating ../build/projects/sdl/mame/gmake-linux/virtual.make...
Generating ../build/projects/sdl/mame/gmake-linux/mame.make...
Done. Generated 310/310 projects.
/usr/bin/make -R verbose=1 -C build/projects/sdl/mame/gmake-linux config=release64 precompile
mkdir -p "../../../../linux_gcc/obj/x64/Release"
mkdir -p "../../../../linux_gcc/obj/x64/Release/src/emu/drivers"
Creating ../../../../linux_gcc/bin/x64/Release
mkdir -p "../../../../linux_gcc/bin/x64/Release"
Precompiling src/emu/emu.h...
x86_64-pld-linux-g++    -MMD -MP -MP -DPTR64=1 -DNDEBUG -DCRLF=2 -DLSB_FIRST -DXMD_H -DFLAC__NO_DLL -DNATIVE_DRC=drcbe_x64 -DLUA_COMPAT_ALL -DLUA_COMPAT_5_1 -DLUA_COMPAT_5_2 -I../../../../../src/osd -I../../../../../src/emu -I../../../../../src/lib/util  -m64 -pipe -Wno-deprecated-declarations -Werror -O3 -fno-strict-aliasing -O2 -fwrapv -pipe -Wformat -Werror=format-security -gdwarf-4 -fno-debug-types-section -fvar-tracking-assignments -g2 -Wp,-D_FORTIFY_SOURCE=2 -fstack-protector-strong --param=ssp-buffer-size=4 -Werror=trampolines -fPIC -march=x86-64 -mtune=generic -gdwarf-4 -fno-debug-types-section -fvar-tracking-assignments -g2  -I/usr/include/lua5.3 -Wno-unknown-pragmas -Wall -Wcast-align -Wundef -Wformat-security -Wwrite-strings -Wno-sign-compare -Wno-conversion -Wno-unused-result -Wno-array-bounds -m64 -x c++ -std=c++14 -Woverloaded-virtual -Wsuggest-override -flifetime-dse=1 -x c++-header -DPTR64=1 -DNDEBUG -DCRLF=2 -DLSB_FIRST -DXMD_H -DFLAC__NO_DLL -DNATIVE_DRC=drcbe_x64 -DLUA_COMPAT_ALL -DLUA_COMPAT_5_1 -DLUA_COMPAT_5_2 -I../../../../../src/osd -I../../../../../src/emu -I../../../../../src/lib/util -o "../../../../linux_gcc/obj/x64/Release/emu.h.gch" -c "../../../../../src/emu/emu.h"
In file included from ../../../../../src/emu/emu.h:61:
../../../../../src/emu/input.h: In copy constructor 'input_seq::input_seq(const input_seq&)':
../../../../../src/emu/input.h:411:49: error: 'void* memcpy(void*, const void*, size_t)' writing to an object of non-trivially copyable type 'class input_code'; use copy-assignment or copy-initialization instead [-Werror=class-memaccess]
  411 |         input_seq(const input_seq &rhs) { memcpy(m_code, rhs.m_code, sizeof(m_code)); }
      |                                           ~~~~~~^~~~~~~~~~~~~~~~~~~~~~~~~~~~~~~~~~~~
../../../../../src/emu/input.h:361:7: note: 'class input_code' declared here
  361 | class input_code
      |       ^~~~~~~~~~
cc1plus: all warnings being treated as errors
make[2]: *** [precompile.make:294: ../../../../linux_gcc/obj/x64/Release/emu.h.gch] Error 1
make[1]: *** [Makefile:52: precompile] Error 2
make: *** [makefile:1231: linux_x64] Error 2
error: Bad exit status from /tmp/B.t6ty_sgd/BUILD/tmp/rpm-tmp.CkciB2 (%build)

RPM build warnings:
    line 31: It's not recommended to have unversioned Obsoletes: Obsoletes:	sdlhazemd
    line 32: It's not recommended to have unversioned Obsoletes: Obsoletes:	sdlmame
    line 33: It's not recommended to have unversioned Obsoletes: Obsoletes:	xmame
    line 34: It's not recommended to have unversioned Obsoletes: Obsoletes:	xmame-SDL
    line 35: It's not recommended to have unversioned Obsoletes: Obsoletes:	xmame-qtmame
    line 36: It's not recommended to have unversioned Obsoletes: Obsoletes:	xmame-svgalib
    line 37: It's not recommended to have unversioned Obsoletes: Obsoletes:	xmame-x11
    line 38: It's not recommended to have unversioned Obsoletes: Obsoletes:	xmame-xmess-SDL
    line 39: It's not recommended to have unversioned Obsoletes: Obsoletes:	xmame-xmess-svgalib
    line 40: It's not recommended to have unversioned Obsoletes: Obsoletes:	xmame-xmess-x11
    Could not canonicalize hostname: ymir

RPM build errors:
    Bad exit status from /tmp/B.t6ty_sgd/BUILD/tmp/rpm-tmp.CkciB2 (%build)
ended at: Sun Sep 11 20:54:31 2022, done in 0:01:32.679475
error: No files produced.
+ chmod -R u+rwX /tmp/B.t6ty_sgd/BUILD
+ rm -rf /tmp/B.t6ty_sgd/tmp /tmp/B.t6ty_sgd/BUILD
+ rm -rf /tmp/B.t6ty_sgd
Begin-PLD-Builder-Info
Build-Time: user:308.55s sys:23.67s real:101.88s (faults io:436 non-io:2828194)

End-PLD-Builder-Info
[Back to list of logs] [View rpm -qa of builder]