FailedOk

th/SRPMS[OK]
th/x32[OK]
th/i686[OK]
th/x86_64[OK]

ac/SRPMS[OK]
ac/i386[OK]
ac/i586[OK]
ac/i686[OK]
ac/alpha[OK]
ac/amd64[OK]
ac/athlon[OK]
ac/ppc[OK]
ac/sparc[OK]
ac/sparc64[OK]

Advanced Search
main()
Powered by PLD Linux
(c) 2002-2022 PLD Team
$Revision: 1.37 $
Powered by Paranoid Android.
Your IP: 3.238.98.39

minidlna 70b2bd0f-5fed-4100-b363-2c8b102dd8cf

Status:Failed
Source URL:https://buildlogs.pld-linux.org/pld/th/x86_64/FAIL/minidlna,70b2bd0f-5fed-4100-b363-2c8b102dd8cf.bz2
text/plain URL:View!
full text:View!
rpm -qa of builder:View!
Date:2022/09/11 20:54:58
Runtime:0:00:19.059402

Toc:

  • error 1
  • collect2: error: ld returned 1 exit status
  • error 2
  • make[2]: *** [Makefile:574: minidlnad] Error 1
  • error 3
  • make[1]: *** [Makefile:646: all-recursive] Error 1
  • error 4
  • error: Bad exit status from /tmp/B.gu3u158d/BUILD/tmp/rpm-tmp.bSu4ep (%build)
  • error 5
  • RPM build errors:
  • error 6
  • error: No files produced.

Content:

metadata.c:701:25: warning: 'codec' is deprecated [-Wdeprecated-declarations]
  701 |                         ac = ctx->streams[audio_stream]->codec;
      |                         ^~
/usr/include/libavformat/avformat.h:888:21: note: declared here
  888 |     AVCodecContext *codec;
      |                     ^~~~~
metadata.c:704:17: warning: 'codec' is deprecated [-Wdeprecated-declarations]
  704 |                 else if( ctx->streams[i]->codec->codec_type == AVMEDIA_TYPE_VIDEO &&
      |                 ^~~~
/usr/include/libavformat/avformat.h:888:21: note: declared here
  888 |     AVCodecContext *codec;
      |                     ^~~~~
metadata.c:709:25: warning: 'codec' is deprecated [-Wdeprecated-declarations]
  709 |                         vc = ctx->streams[video_stream]->codec;
      |                         ^~
/usr/include/libavformat/avformat.h:888:21: note: declared here
  888 |     AVCodecContext *codec;
      |                     ^~~~~
In file included from metadata.c:45:
metadata.c:765:86: warning: format '%d' expects argument of type 'int', but argument 7 has type 'int64_t' {aka 'long int'} [-Wformat=]
  765 |                                                         DPRINTF(E_DEBUG, L_METADATA, "Unhandled AAC: %d channels, %d bitrate\n",
      |                                                                                      ^~~~~~~~~~~~~~~~~~~~~~~~~~~~~~~~~~~~~~~~~~
  766 |                                                                 ac->channels,
  767 |                                                                 ac->bit_rate);
      |                                                                 ~~~~~~~~~~~~          
      |                                                                   |
      |                                                                   int64_t {aka long int}
log.h:52:97: note: in definition of macro 'DPRINTF'
   52 | #define DPRINTF(level, facility, fmt, arg...) do { log_err(level, facility, __FILE__, __LINE__, fmt, ##arg); } while (0)
      |                                                                                                 ^~~
metadata.c:765:116: note: format string is defined here
  765 |                                                         DPRINTF(E_DEBUG, L_METADATA, "Unhandled AAC: %d channels, %d bitrate\n",
      |                                                                                                                   ~^
      |                                                                                                                    |
      |                                                                                                                    int
      |                                                                                                                   %ld
metadata.c:1028:94: warning: format '%d' expects argument of type 'int', but argument 9 has type 'int64_t' {aka 'long int'} [-Wformat=]
 1028 |                                                                 DPRINTF(E_DEBUG, L_METADATA, "Unsupported h.264 video profile! [%s, %dx%d, %dbps : %s]\n",
      |                                                                                              ^~~~~~~~~~~~~~~~~~~~~~~~~~~~~~~~~~~~~~~~~~~~~~~~~~~~~~~~~~~~
 1029 |                                                                         m.dlna_pn, vc->width, vc->height, vc->bit_rate, basepath);
      |                                                                                                           ~~~~~~~~~~~~
      |                                                                                                             |
      |                                                                                                             int64_t {aka long int}
log.h:52:97: note: in definition of macro 'DPRINTF'
   52 | #define DPRINTF(level, facility, fmt, arg...) do { log_err(level, facility, __FILE__, __LINE__, fmt, ##arg); } while (0)
      |                                                                                                 ^~~
metadata.c:1028:141: note: format string is defined here
 1028 |                                                                 DPRINTF(E_DEBUG, L_METADATA, "Unsupported h.264 video profile! [%s, %dx%d, %dbps : %s]\n",
      |                                                                                                                                            ~^
      |                                                                                                                                             |
      |                                                                                                                                             int
      |                                                                                                                                            %ld
metadata.c:1045:94: warning: format '%d' expects argument of type 'int', but argument 6 has type 'int64_t' {aka 'long int'} [-Wformat=]
 1045 |                                                                 DPRINTF(E_DEBUG, L_METADATA, "Unsupported h.264 HP video profile! [%dbps, %d audio : %s]\n",
      |                                                                                              ^~~~~~~~~~~~~~~~~~~~~~~~~~~~~~~~~~~~~~~~~~~~~~~~~~~~~~~~~~~~~~
 1046 |                                                                         vc->bit_rate, audio_profile, basepath);
      |                                                                         ~~~~~~~~~~~~          
      |                                                                           |
      |                                                                           int64_t {aka long int}
log.h:52:97: note: in definition of macro 'DPRINTF'
   52 | #define DPRINTF(level, facility, fmt, arg...) do { log_err(level, facility, __FILE__, __LINE__, fmt, ##arg); } while (0)
      |                                                                                                 ^~~
metadata.c:1045:133: note: format string is defined here
 1045 |                                                                 DPRINTF(E_DEBUG, L_METADATA, "Unsupported h.264 HP video profile! [%dbps, %d audio : %s]\n",
      |                                                                                                                                    ~^
      |                                                                                                                                     |
      |                                                                                                                                     int
      |                                                                                                                                    %ld
metadata.c:1299:86: warning: format '%d' expects argument of type 'int', but argument 8 has type 'int64_t' {aka 'long int'} [-Wformat=]
 1299 |                                                         DPRINTF(E_DEBUG, L_METADATA, "Unsupported h.264 video profile! [%dx%d, %dbps]\n",
      |                                                                                      ^~~~~~~~~~~~~~~~~~~~~~~~~~~~~~~~~~~~~~~~~~~~~~~~~~~
......
 1302 |                                                                 ctx->bit_rate);
      |                                                                 ~~~~~~~~~~~~~         
      |                                                                    |
      |                                                                    int64_t {aka long int}
log.h:52:97: note: in definition of macro 'DPRINTF'
   52 | #define DPRINTF(level, facility, fmt, arg...) do { log_err(level, facility, __FILE__, __LINE__, fmt, ##arg); } while (0)
      |                                                                                                 ^~~
metadata.c:1299:129: note: format string is defined here
 1299 |                                                         DPRINTF(E_DEBUG, L_METADATA, "Unsupported h.264 video profile! [%dx%d, %dbps]\n",
      |                                                                                                                                ~^
      |                                                                                                                                 |
      |                                                                                                                                 int
      |                                                                                                                                %ld
In file included from metadata.c:43:
utils.h: In function 'check_for_captions':
utils.h:56:9: warning: '__builtin_strncpy' specified bound 4096 equals destination size [-Wstringop-truncation]
   56 |         strncpy(dst, src, len);
      |         ^
make[2]: Leaving directory '/tmp/B.gu3u158d/BUILD/minidlna-1.1.5'
make[2]: Entering directory '/tmp/B.gu3u158d/BUILD/minidlna-1.1.5'
depbase=`echo tagutils/tagutils.o | sed 's|[^/]*$|.deps/&|;s|\.o$||'`;\
x86_64-pld-linux-gcc -DHAVE_CONFIG_H -I.    -Wall -D_LARGEFILE_SOURCE -D_FILE_OFFSET_BITS=64  -O2 -fwrapv -pipe -Wformat -Werror=format-security -gdwarf-4 -fno-debug-types-section -fvar-tracking-assignments -g2 -Wp,-D_FORTIFY_SOURCE=2 -fstack-protector-strong --param=ssp-buffer-size=4 -Werror=trampolines -fPIC -march=x86-64 -mtune=generic -gdwarf-4 -fno-debug-types-section -fvar-tracking-assignments -g2  -MT tagutils/tagutils.o -MD -MP -MF $depbase.Tpo -c -o tagutils/tagutils.o tagutils/tagutils.c &&\
mv -f $depbase.Tpo $depbase.Po
make[2]: Leaving directory '/tmp/B.gu3u158d/BUILD/minidlna-1.1.5'
make[2]: Entering directory '/tmp/B.gu3u158d/BUILD/minidlna-1.1.5'
x86_64-pld-linux-gcc -Wall -D_LARGEFILE_SOURCE -D_FILE_OFFSET_BITS=64  -O2 -fwrapv -pipe -Wformat -Werror=format-security -gdwarf-4 -fno-debug-types-section -fvar-tracking-assignments -g2 -Wp,-D_FORTIFY_SOURCE=2 -fstack-protector-strong --param=ssp-buffer-size=4 -Werror=trampolines -fPIC -march=x86-64 -mtune=generic -gdwarf-4 -fno-debug-types-section -fvar-tracking-assignments -g2   -Wl,--as-needed -Wl,--no-copy-dt-needed-entries -Wl,-z,relro -Wl,-z,combreloc  -o minidlnad minidlna.o upnphttp.o upnpdescgen.o upnpsoap.o upnpreplyparse.o minixml.o clients.o getifaddr.o process.o upnpglobalvars.o options.o minissdp.o uuid.o upnpevents.o sql.o utils.o metadata.o scanner.o inotify.o tivo_utils.o tivo_beacon.o tivo_commands.o playlist.o image_utils.o albumart.o log.o containers.o tagutils/tagutils.o -ljpeg -lid3tag -lsqlite3 -lavformat -lavutil -lexif -lFLAC  -logg -lvorbis -lpthread 
/usr/bin/ld: image_utils.o:/tmp/B.gu3u158d/BUILD/minidlna-1.1.5/image_utils.c:193: multiple definition of `setjmp_buffer'; metadata.o:/tmp/B.gu3u158d/BUILD/minidlna-1.1.5/metadata.c:481: first defined here
collect2: error: ld returned 1 exit status
make[2]: *** [Makefile:574: minidlnad] Error 1
make[2]: Leaving directory '/tmp/B.gu3u158d/BUILD/minidlna-1.1.5'
make[1]: *** [Makefile:646: all-recursive] Error 1
make: *** [Makefile:466: all] Error 2
error: Bad exit status from /tmp/B.gu3u158d/BUILD/tmp/rpm-tmp.bSu4ep (%build)

RPM build warnings:
    Could not canonicalize hostname: ymir

RPM build errors:
    Bad exit status from /tmp/B.gu3u158d/BUILD/tmp/rpm-tmp.bSu4ep (%build)
ended at: Sun Sep 11 20:54:57 2022, done in 0:00:19.059402
error: No files produced.
+ chmod -R u+rwX /tmp/B.gu3u158d/BUILD
+ rm -rf /tmp/B.gu3u158d/tmp /tmp/B.gu3u158d/BUILD
+ rm -rf /tmp/B.gu3u158d
Begin-PLD-Builder-Info
Build-Time: user:23.22s sys:6.08s real:21.05s (faults io:5 non-io:1363274)

End-PLD-Builder-Info
[Back to list of logs] [View rpm -qa of builder]