FailedOk

th/SRPMS[OK]
th/x32[OK]
th/i686[OK]
th/x86_64[OK]

ac/SRPMS[OK]
ac/i386[OK]
ac/i586[OK]
ac/i686[OK]
ac/alpha[OK]
ac/amd64[OK]
ac/athlon[OK]
ac/ppc[OK]
ac/sparc[OK]
ac/sparc64[OK]

Advanced Search
main()
Powered by PLD Linux
(c) 2002-2021 PLD Team
$Revision: 1.37 $
Powered by Microsoft Windows 2003.
Your IP: 54.80.173.217

openchange bc3909a2-f82a-439a-a955-400b33e254b3

Status:Failed
Source URL:https://buildlogs.pld-linux.org/pld/th/x86_64/FAIL/openchange,bc3909a2-f82a-439a-a955-400b33e254b3.bz2
text/plain URL:View!
full text:View!
rpm -qa of builder:View!
Date:2021/11/14 18:42:30
Runtime:0:00:16.050050

Toc:

  • error 1
  • exchange.idl:4200: error: EcDoRpc: [out] argument 'size' is not a pointer or array, skip client functions
  • error 2
  • libmapi/IProfAdmin.c:756:49: error: 'CRED_AUTO_USE_KERBEROS' undeclared (first use in this function)
  • error 3
  • libmapi/IProfAdmin.c:780:35: error: 'CRED_MUST_USE_KERBEROS' undeclared (first use in this function)
  • error 4
  • libmapi/IProfAdmin.c:782:35: error: 'CRED_DONT_USE_KERBEROS' undeclared (first use in this function)
  • error 5
  • libmapi/IProfAdmin.c:797:17: error: too few arguments to function 'cli_credentials_set_kerberos_state'
  • error 6
  • error: Bad exit status from /tmp/B.84f1oybb/BUILD/tmp/rpm-tmp.2QEXG0 (%build)
  • error 7
  • RPM build errors:
  • error 8
  • error: No files produced.

Content:

	     - rpcextract:		yes

	   * Unit and functional testing
	     - mapitest:		no
	     - mapitest (subunit):      yes
	     - openchange-testsuite:    no
	     - coverage tests:		no

	   * OpenChange Documentation:	yes

	   * OpenChange Bindings:
	     - Qt4:			yes

	   * Installation prefix:	/usr

===============================================================


+ /usr/bin/make -Otarget -j9
Creating the gen_ndr directory
mkdir -p gen_ndr
libmapi/conf/mparse.pl --parser=mapicodes --outputdir=libmapi/ libmapi/conf/mapi-codes
Parsing libmapi/conf/mapi-codes
Generating libmapi/mapicode.c
Generating mapicodes_enum.h
Generating exchange.h
/usr/bin/pidl --outputdir=gen_ndr --header -- exchange.idl
Compiling exchange.idl
exchange.idl:1444: warning: subcontext() is deprecated. Use represent_as() or transmit_as() instead
exchange.idl:1510: warning: subcontext() is deprecated. Use represent_as() or transmit_as() instead
exchange.idl:1536: warning: subcontext() is deprecated. Use represent_as() or transmit_as() instead
exchange.idl:1550: warning: subcontext() is deprecated. Use represent_as() or transmit_as() instead
exchange.idl:1806: warning: subcontext() is deprecated. Use represent_as() or transmit_as() instead
exchange.idl:2461: warning: subcontext() is deprecated. Use represent_as() or transmit_as() instead
exchange.idl:2467: warning: subcontext() is deprecated. Use represent_as() or transmit_as() instead
exchange.idl:2510: warning: subcontext() is deprecated. Use represent_as() or transmit_as() instead
exchange.idl:2983: warning: subcontext() is deprecated. Use represent_as() or transmit_as() instead
exchange.idl:3551: warning: subcontext() is deprecated. Use represent_as() or transmit_as() instead
exchange.idl:3613: warning: subcontext() is deprecated. Use represent_as() or transmit_as() instead
exchange.idl:3688: warning: subcontext() is deprecated. Use represent_as() or transmit_as() instead
exchange.idl:4202: warning: subcontext() is deprecated. Use represent_as() or transmit_as() instead
exchange.idl:4203: warning: subcontext() is deprecated. Use represent_as() or transmit_as() instead
exchange.idl:4645: warning: subcontext() is deprecated. Use represent_as() or transmit_as() instead
exchange.idl:4200: warning: [out] argument `size' not a pointer
exchange.idl:4201: warning: [out] argument `offset' not a pointer
Generating gen_ndr/ndr_exchange.h
/usr/bin/pidl --outputdir=gen_ndr --ndr-parser -- exchange.idl
Compiling exchange.idl
exchange.idl:1444: warning: subcontext() is deprecated. Use represent_as() or transmit_as() instead
exchange.idl:1510: warning: subcontext() is deprecated. Use represent_as() or transmit_as() instead
exchange.idl:1536: warning: subcontext() is deprecated. Use represent_as() or transmit_as() instead
exchange.idl:1550: warning: subcontext() is deprecated. Use represent_as() or transmit_as() instead
exchange.idl:1806: warning: subcontext() is deprecated. Use represent_as() or transmit_as() instead
exchange.idl:2461: warning: subcontext() is deprecated. Use represent_as() or transmit_as() instead
exchange.idl:2467: warning: subcontext() is deprecated. Use represent_as() or transmit_as() instead
exchange.idl:2510: warning: subcontext() is deprecated. Use represent_as() or transmit_as() instead
exchange.idl:2983: warning: subcontext() is deprecated. Use represent_as() or transmit_as() instead
exchange.idl:3551: warning: subcontext() is deprecated. Use represent_as() or transmit_as() instead
exchange.idl:3613: warning: subcontext() is deprecated. Use represent_as() or transmit_as() instead
exchange.idl:3688: warning: subcontext() is deprecated. Use represent_as() or transmit_as() instead
exchange.idl:4202: warning: subcontext() is deprecated. Use represent_as() or transmit_as() instead
exchange.idl:4203: warning: subcontext() is deprecated. Use represent_as() or transmit_as() instead
exchange.idl:4645: warning: subcontext() is deprecated. Use represent_as() or transmit_as() instead
exchange.idl:4200: warning: [out] argument `size' not a pointer
exchange.idl:4201: warning: [out] argument `offset' not a pointer
Generating property.h
/usr/bin/pidl --outputdir=gen_ndr --header -- property.idl
Compiling property.idl
Generating gen_ndr/ndr_property.h
/usr/bin/pidl --outputdir=gen_ndr --ndr-parser -- property.idl
Compiling property.idl
Generating asyncemsmdb.h
/usr/bin/pidl --outputdir=gen_ndr --header -- asyncemsmdb.idl
Compiling asyncemsmdb.idl
Generating gen_ndr/ndr_asyncemsmdb.h
/usr/bin/pidl --outputdir=gen_ndr --ndr-parser -- asyncemsmdb.idl
Compiling asyncemsmdb.idl
fatal: not a git repository (or any of the parent directories): .git
./script/mkversion.sh: 'libmapi/version.h' created for OpenChange libmapi("2.3 (Vulcan)")
Generating gen_ndr/ndr_exchange_c.h
/usr/bin/pidl --outputdir=gen_ndr --client -- exchange.idl
Compiling exchange.idl
exchange.idl:1444: warning: subcontext() is deprecated. Use represent_as() or transmit_as() instead
exchange.idl:1510: warning: subcontext() is deprecated. Use represent_as() or transmit_as() instead
exchange.idl:1536: warning: subcontext() is deprecated. Use represent_as() or transmit_as() instead
exchange.idl:1550: warning: subcontext() is deprecated. Use represent_as() or transmit_as() instead
exchange.idl:1806: warning: subcontext() is deprecated. Use represent_as() or transmit_as() instead
exchange.idl:2461: warning: subcontext() is deprecated. Use represent_as() or transmit_as() instead
exchange.idl:2467: warning: subcontext() is deprecated. Use represent_as() or transmit_as() instead
exchange.idl:2510: warning: subcontext() is deprecated. Use represent_as() or transmit_as() instead
exchange.idl:2983: warning: subcontext() is deprecated. Use represent_as() or transmit_as() instead
exchange.idl:3551: warning: subcontext() is deprecated. Use represent_as() or transmit_as() instead
exchange.idl:3613: warning: subcontext() is deprecated. Use represent_as() or transmit_as() instead
exchange.idl:3688: warning: subcontext() is deprecated. Use represent_as() or transmit_as() instead
exchange.idl:4202: warning: subcontext() is deprecated. Use represent_as() or transmit_as() instead
exchange.idl:4203: warning: subcontext() is deprecated. Use represent_as() or transmit_as() instead
exchange.idl:4645: warning: subcontext() is deprecated. Use represent_as() or transmit_as() instead
exchange.idl:4200: warning: [out] argument `size' not a pointer
exchange.idl:4201: warning: [out] argument `offset' not a pointer
exchange.idl:4200: error: EcDoRpc: [out] argument 'size' is not a pointer or array, skip client functions
Generating gen_ndr/ndr_asyncemsmdb_c.h
/usr/bin/pidl --outputdir=gen_ndr --client -- asyncemsmdb.idl
Compiling asyncemsmdb.idl
Compiling libmapi/emsmdb.c with -fPIC
x86_64-pld-linux-gcc -I/usr/include/python2.7 -I/usr/include/python2.7 -fno-strict-aliasing -O2 -fwrapv -pipe -Wformat -Werror=format-security -gdwarf-4 -fno-debug-types-section -fvar-tracking-assignments -g2 -Wp,-D_FORTIFY_SOURCE=2 -fstack-protector-strong --param=ssp-buffer-size=4 -Werror=trampolines -fPIC -march=x86-64 -mtune=generic -gdwarf-4 -fno-debug-types-section -fvar-tracking-assignments -g2 -DNDEBUG -O2 -fwrapv -pipe -Wformat -Werror=format-security -gdwarf-4 -fno-debug-types-section -fvar-tracking-assignments -g2 -Wp,-D_FORTIFY_SOURCE=2 -fstack-protector-strong --param=ssp-buffer-size=4 -Werror=trampolines -fPIC -march=x86-64 -mtune=generic -gdwarf-4 -fno-debug-types-section -fvar-tracking-assignments -g2 -I. -O2 -fwrapv -pipe -Wformat -Werror=format-security -gdwarf-4 -fno-debug-types-section -fvar-tracking-assignments -g2 -Wp,-D_FORTIFY_SOURCE=2 -fstack-protector-strong --param=ssp-buffer-size=4 -Werror=trampolines -fPIC -march=x86-64 -mtune=generic -gdwarf-4 -fno-debug-types-section -fvar-tracking-assignments -g2  -DHAVE_LITTLE_ENDIAN -Wall -fstrict-aliasing -Wp,-D_FORTIFY_SOURCE=2 -Wmissing-prototypes -Wstrict-prototypes -Wpointer-sign -DENABLE_ASSERTS -DDEFAULT_LDIF=\"/usr/share/openchange/setup/profiles\" -DMAPISTORE_LDIF=\"/usr/share/openchange/setup/mapistore\" -DOPENCHANGEDB_DATA_DIR=\"/usr/share/openchange/setup/openchangedb\" -DMAPISTORE_BACKEND_INSTALLDIR=\"/usr/lib64/mapistore_backends\" -DLZXPRESS_DATADIR=\"/usr/share/openchange/mapitest/lzxpress\" -DLZFU_DATADIR=\"/usr/share/openchange/mapitest/lzfu\" -DHAVE_ICAL_0_46=1 -DHAVE_IMMEDIATE_STRUCTURES=1 -D_GNU_SOURCE=1 -DHAVE_IMMEDIATE_STRUCTURES=1 -I/usr/include/samba-4.0      -fPIC -c libmapi/emsmdb.c -o libmapi/emsmdb.po
Compiling libmapi/async_emsmdb.c with -fPIC
x86_64-pld-linux-gcc -I/usr/include/python2.7 -I/usr/include/python2.7 -fno-strict-aliasing -O2 -fwrapv -pipe -Wformat -Werror=format-security -gdwarf-4 -fno-debug-types-section -fvar-tracking-assignments -g2 -Wp,-D_FORTIFY_SOURCE=2 -fstack-protector-strong --param=ssp-buffer-size=4 -Werror=trampolines -fPIC -march=x86-64 -mtune=generic -gdwarf-4 -fno-debug-types-section -fvar-tracking-assignments -g2 -DNDEBUG -O2 -fwrapv -pipe -Wformat -Werror=format-security -gdwarf-4 -fno-debug-types-section -fvar-tracking-assignments -g2 -Wp,-D_FORTIFY_SOURCE=2 -fstack-protector-strong --param=ssp-buffer-size=4 -Werror=trampolines -fPIC -march=x86-64 -mtune=generic -gdwarf-4 -fno-debug-types-section -fvar-tracking-assignments -g2 -I. -O2 -fwrapv -pipe -Wformat -Werror=format-security -gdwarf-4 -fno-debug-types-section -fvar-tracking-assignments -g2 -Wp,-D_FORTIFY_SOURCE=2 -fstack-protector-strong --param=ssp-buffer-size=4 -Werror=trampolines -fPIC -march=x86-64 -mtune=generic -gdwarf-4 -fno-debug-types-section -fvar-tracking-assignments -g2  -DHAVE_LITTLE_ENDIAN -Wall -fstrict-aliasing -Wp,-D_FORTIFY_SOURCE=2 -Wmissing-prototypes -Wstrict-prototypes -Wpointer-sign -DENABLE_ASSERTS -DDEFAULT_LDIF=\"/usr/share/openchange/setup/profiles\" -DMAPISTORE_LDIF=\"/usr/share/openchange/setup/mapistore\" -DOPENCHANGEDB_DATA_DIR=\"/usr/share/openchange/setup/openchangedb\" -DMAPISTORE_BACKEND_INSTALLDIR=\"/usr/lib64/mapistore_backends\" -DLZXPRESS_DATADIR=\"/usr/share/openchange/mapitest/lzxpress\" -DLZFU_DATADIR=\"/usr/share/openchange/mapitest/lzfu\" -DHAVE_ICAL_0_46=1 -DHAVE_IMMEDIATE_STRUCTURES=1 -D_GNU_SOURCE=1 -DHAVE_IMMEDIATE_STRUCTURES=1 -I/usr/include/samba-4.0      -fPIC -c libmapi/async_emsmdb.c -o libmapi/async_emsmdb.po
Compiling libmapi/IABContainer.c with -fPIC
x86_64-pld-linux-gcc -I/usr/include/python2.7 -I/usr/include/python2.7 -fno-strict-aliasing -O2 -fwrapv -pipe -Wformat -Werror=format-security -gdwarf-4 -fno-debug-types-section -fvar-tracking-assignments -g2 -Wp,-D_FORTIFY_SOURCE=2 -fstack-protector-strong --param=ssp-buffer-size=4 -Werror=trampolines -fPIC -march=x86-64 -mtune=generic -gdwarf-4 -fno-debug-types-section -fvar-tracking-assignments -g2 -DNDEBUG -O2 -fwrapv -pipe -Wformat -Werror=format-security -gdwarf-4 -fno-debug-types-section -fvar-tracking-assignments -g2 -Wp,-D_FORTIFY_SOURCE=2 -fstack-protector-strong --param=ssp-buffer-size=4 -Werror=trampolines -fPIC -march=x86-64 -mtune=generic -gdwarf-4 -fno-debug-types-section -fvar-tracking-assignments -g2 -I. -O2 -fwrapv -pipe -Wformat -Werror=format-security -gdwarf-4 -fno-debug-types-section -fvar-tracking-assignments -g2 -Wp,-D_FORTIFY_SOURCE=2 -fstack-protector-strong --param=ssp-buffer-size=4 -Werror=trampolines -fPIC -march=x86-64 -mtune=generic -gdwarf-4 -fno-debug-types-section -fvar-tracking-assignments -g2  -DHAVE_LITTLE_ENDIAN -Wall -fstrict-aliasing -Wp,-D_FORTIFY_SOURCE=2 -Wmissing-prototypes -Wstrict-prototypes -Wpointer-sign -DENABLE_ASSERTS -DDEFAULT_LDIF=\"/usr/share/openchange/setup/profiles\" -DMAPISTORE_LDIF=\"/usr/share/openchange/setup/mapistore\" -DOPENCHANGEDB_DATA_DIR=\"/usr/share/openchange/setup/openchangedb\" -DMAPISTORE_BACKEND_INSTALLDIR=\"/usr/lib64/mapistore_backends\" -DLZXPRESS_DATADIR=\"/usr/share/openchange/mapitest/lzxpress\" -DLZFU_DATADIR=\"/usr/share/openchange/mapitest/lzfu\" -DHAVE_ICAL_0_46=1 -DHAVE_IMMEDIATE_STRUCTURES=1 -D_GNU_SOURCE=1 -DHAVE_IMMEDIATE_STRUCTURES=1 -I/usr/include/samba-4.0      -fPIC -c libmapi/IABContainer.c -o libmapi/IABContainer.po
Compiling libmapi/IProfAdmin.c with -fPIC
x86_64-pld-linux-gcc -I/usr/include/python2.7 -I/usr/include/python2.7 -fno-strict-aliasing -O2 -fwrapv -pipe -Wformat -Werror=format-security -gdwarf-4 -fno-debug-types-section -fvar-tracking-assignments -g2 -Wp,-D_FORTIFY_SOURCE=2 -fstack-protector-strong --param=ssp-buffer-size=4 -Werror=trampolines -fPIC -march=x86-64 -mtune=generic -gdwarf-4 -fno-debug-types-section -fvar-tracking-assignments -g2 -DNDEBUG -O2 -fwrapv -pipe -Wformat -Werror=format-security -gdwarf-4 -fno-debug-types-section -fvar-tracking-assignments -g2 -Wp,-D_FORTIFY_SOURCE=2 -fstack-protector-strong --param=ssp-buffer-size=4 -Werror=trampolines -fPIC -march=x86-64 -mtune=generic -gdwarf-4 -fno-debug-types-section -fvar-tracking-assignments -g2 -I. -O2 -fwrapv -pipe -Wformat -Werror=format-security -gdwarf-4 -fno-debug-types-section -fvar-tracking-assignments -g2 -Wp,-D_FORTIFY_SOURCE=2 -fstack-protector-strong --param=ssp-buffer-size=4 -Werror=trampolines -fPIC -march=x86-64 -mtune=generic -gdwarf-4 -fno-debug-types-section -fvar-tracking-assignments -g2  -DHAVE_LITTLE_ENDIAN -Wall -fstrict-aliasing -Wp,-D_FORTIFY_SOURCE=2 -Wmissing-prototypes -Wstrict-prototypes -Wpointer-sign -DENABLE_ASSERTS -DDEFAULT_LDIF=\"/usr/share/openchange/setup/profiles\" -DMAPISTORE_LDIF=\"/usr/share/openchange/setup/mapistore\" -DOPENCHANGEDB_DATA_DIR=\"/usr/share/openchange/setup/openchangedb\" -DMAPISTORE_BACKEND_INSTALLDIR=\"/usr/lib64/mapistore_backends\" -DLZXPRESS_DATADIR=\"/usr/share/openchange/mapitest/lzxpress\" -DLZFU_DATADIR=\"/usr/share/openchange/mapitest/lzfu\" -DHAVE_ICAL_0_46=1 -DHAVE_IMMEDIATE_STRUCTURES=1 -D_GNU_SOURCE=1 -DHAVE_IMMEDIATE_STRUCTURES=1 -I/usr/include/samba-4.0      -fPIC -c libmapi/IProfAdmin.c -o libmapi/IProfAdmin.po
libmapi/IProfAdmin.c: In function 'LoadProfile':
libmapi/IProfAdmin.c:756:49: error: 'CRED_AUTO_USE_KERBEROS' undeclared (first use in this function)
  756 |         enum credentials_use_kerberos use_krb = CRED_AUTO_USE_KERBEROS;
      |                                                 ^~~~~~~~~~~~~~~~~~~~~~
libmapi/IProfAdmin.c:756:49: note: each undeclared identifier is reported only once for each function it appears in
libmapi/IProfAdmin.c:780:35: error: 'CRED_MUST_USE_KERBEROS' undeclared (first use in this function)
  780 |                         use_krb = CRED_MUST_USE_KERBEROS;
      |                                   ^~~~~~~~~~~~~~~~~~~~~~
libmapi/IProfAdmin.c:782:35: error: 'CRED_DONT_USE_KERBEROS' undeclared (first use in this function)
  782 |                         use_krb = CRED_DONT_USE_KERBEROS;
      |                                   ^~~~~~~~~~~~~~~~~~~~~~
libmapi/IProfAdmin.c:797:17: error: too few arguments to function 'cli_credentials_set_kerberos_state'
  797 |                 cli_credentials_set_kerberos_state(profile->credentials, use_krb);
      |                 ^~~~~~~~~~~~~~~~~~~~~~~~~~~~~~~~~~
In file included from libmapi/IProfAdmin.c:23:
/usr/include/samba-4.0/credentials.h:146:6: note: declared here
  146 | bool cli_credentials_set_kerberos_state(struct cli_credentials *creds,
      |      ^~~~~~~~~~~~~~~~~~~~~~~~~~~~~~~~~~
make: *** [Makefile:125: libmapi/IProfAdmin.po] Error 1
error: Bad exit status from /tmp/B.84f1oybb/BUILD/tmp/rpm-tmp.2QEXG0 (%build)


RPM build errors:
    Macro expanded in comment on line 439: %{_libdir}/nagios/plugins/check_exchange.ldb

    Could not canonicalize hostname: ymir
    Bad exit status from /tmp/B.84f1oybb/BUILD/tmp/rpm-tmp.2QEXG0 (%build)
ended at: Sun Nov 14 18:42:30 2021, done in 0:00:16.050050
error: No files produced.
+ chmod -R u+rwX /tmp/B.84f1oybb/BUILD
+ rm -rf /tmp/B.84f1oybb/tmp /tmp/B.84f1oybb/BUILD
+ rm -rf /tmp/B.84f1oybb
Begin-PLD-Builder-Info
Build-Time: user:15.43s sys:2.60s real:18.02s (faults io:1 non-io:651331)

End-PLD-Builder-Info
[Back to list of logs] [View rpm -qa of builder]