FailedOk

th/SRPMS[OK]
th/x32[OK]
th/i686[OK]
th/x86_64[OK]

ac/SRPMS[OK]
ac/i386[OK]
ac/i586[OK]
ac/i686[OK]
ac/alpha[OK]
ac/amd64[OK]
ac/athlon[OK]
ac/ppc[OK]
ac/sparc[OK]
ac/sparc64[OK]

Advanced Search
main()
Powered by PLD Linux
(c) 2002-2021 PLD Team
$Revision: 1.37 $
Powered by KDE.
Your IP: 3.83.187.254

opensc 88e4ccf3-ecb9-4f5f-937d-757bd9f67487

Status:Failed
Source URL:https://buildlogs.pld-linux.org/pld/th/x86_64/FAIL/opensc,88e4ccf3-ecb9-4f5f-937d-757bd9f67487.bz2
text/plain URL:View!
full text:View!
rpm -qa of builder:View!
Date:2021/10/04 22:42:05
Runtime:0:00:59.329116

Toc:

  • error 1
  • collect2: error: ld returned 1 exit status
  • error 2
  • make[4]: *** [Makefile:492: p11test] Error 1
  • error 3
  • make[3]: *** [Makefile:618: all-recursive] Error 1
  • error 4
  • make[2]: *** [Makefile:441: all-recursive] Error 1
  • error 5
  • make[1]: *** [Makefile:564: all-recursive] Error 1
  • error 6
  • error: Bad exit status from /tmp/B.rx3zccoc/BUILD/tmp/rpm-tmp.TW8Ehh (%build)
  • error 7
  • RPM build errors:
  • error 8
  • error: No files produced.

Content:

      |                               ^~~~~~~~~~~~~~~~~~~~~~~~
p11test_case_common.c:371:25: warning: 'EC_KEY_set_public_key' is deprecated: Since OpenSSL 3.0 [-Wdeprecated-declarations]
  371 |                         EC_KEY_set_public_key(o->key.ec, ecpoint);
      |                         ^~~~~~~~~~~~~~~~~~~~~
In file included from /usr/include/openssl/x509.h:33,
                 from p11test_case_common.h:25,
                 from p11test_case_common.c:22:
/usr/include/openssl/ec.h:1068:27: note: declared here
 1068 | OSSL_DEPRECATEDIN_3_0 int EC_KEY_set_public_key(EC_KEY *key, const EC_POINT *pub);
      |                           ^~~~~~~~~~~~~~~~~~~~~
p11test_case_common.c:372:25: warning: 'EC_KEY_set_group' is deprecated: Since OpenSSL 3.0 [-Wdeprecated-declarations]
  372 |                         EC_KEY_set_group(o->key.ec, ecgroup);
      |                         ^~~~~~~~~~~~~~~~
In file included from /usr/include/openssl/x509.h:33,
                 from p11test_case_common.h:25,
                 from p11test_case_common.c:22:
/usr/include/openssl/ec.h:1040:27: note: declared here
 1040 | OSSL_DEPRECATEDIN_3_0 int EC_KEY_set_group(EC_KEY *key, const EC_GROUP *group);
      |                           ^~~~~~~~~~~~~~~~
p11test_case_common.c: In function 'clean_all_objects':
p11test_case_common.c:540:25: warning: 'RSA_free' is deprecated: Since OpenSSL 3.0 [-Wdeprecated-declarations]
  540 |                         RSA_free(objects->data[i].key.rsa);
      |                         ^~~~~~~~
In file included from /usr/include/openssl/x509.h:36,
                 from p11test_case_common.h:25,
                 from p11test_case_common.c:22:
/usr/include/openssl/rsa.h:293:28: note: declared here
  293 | OSSL_DEPRECATEDIN_3_0 void RSA_free(RSA *r);
      |                            ^~~~~~~~
p11test_case_common.c:542:25: warning: 'EC_KEY_free' is deprecated: Since OpenSSL 3.0 [-Wdeprecated-declarations]
  542 |                         EC_KEY_free(objects->data[i].key.ec);
      |                         ^~~~~~~~~~~
In file included from /usr/include/openssl/x509.h:33,
                 from p11test_case_common.h:25,
                 from p11test_case_common.c:22:
/usr/include/openssl/ec.h:1001:28: note: declared here
 1001 | OSSL_DEPRECATEDIN_3_0 void EC_KEY_free(EC_KEY *key);
      |                            ^~~~~~~~~~~
mv -f .deps/p11test-p11test_case_common.Tpo .deps/p11test-p11test_case_common.Po
make[4]: Leaving directory '/tmp/B.rx3zccoc/BUILD/opensc-0.19.0/src/tests/p11test'
make[4]: Entering directory '/tmp/B.rx3zccoc/BUILD/opensc-0.19.0/src/tests/p11test'
x86_64-pld-linux-gcc -DHAVE_CONFIG_H -I. -I../../..  -I../../../src  -DNDEBUG  -O2 -fwrapv -pipe -Wformat -Werror=format-security -gdwarf-4 -fno-debug-types-section -fvar-tracking-assignments -g2 -Wp,-D_FORTIFY_SOURCE=2 -fstack-protector-strong --param=ssp-buffer-size=4 -Werror=trampolines -fPIC -march=x86-64 -mtune=generic -gdwarf-4 -fno-debug-types-section -fvar-tracking-assignments -g2  -Wall -Wextra -Wno-unused-parameter -MT p11test-p11test_case_pss_oaep.o -MD -MP -MF .deps/p11test-p11test_case_pss_oaep.Tpo -c -o p11test-p11test_case_pss_oaep.o `test -f 'p11test_case_pss_oaep.c' || echo './'`p11test_case_pss_oaep.c
p11test_case_pss_oaep.c: In function 'oaep_encrypt_message_openssl':
p11test_case_pss_oaep.c:225:17: warning: 'RSA_up_ref' is deprecated: Since OpenSSL 3.0 [-Wdeprecated-declarations]
  225 |                 || RSA_up_ref(o->key.rsa) < 1
      |                 ^~
In file included from /usr/include/openssl/x509.h:36,
                 from p11test_case_common.h:25,
                 from p11test_case_pss_oaep.h:22,
                 from p11test_case_pss_oaep.c:22:
/usr/include/openssl/rsa.h:295:27: note: declared here
  295 | OSSL_DEPRECATEDIN_3_0 int RSA_up_ref(RSA *r);
      |                           ^~~~~~~~~~
p11test_case_pss_oaep.c:226:17: warning: 'EVP_PKEY_set1_RSA' is deprecated: Since OpenSSL 3.0 [-Wdeprecated-declarations]
  226 |                 || EVP_PKEY_set1_RSA(key, o->key.rsa) != 1) {
      |                 ^~
In file included from /usr/include/openssl/x509.h:29,
                 from p11test_case_common.h:25,
                 from p11test_case_pss_oaep.h:22,
                 from p11test_case_pss_oaep.c:22:
/usr/include/openssl/evp.h:1344:5: note: declared here
 1344 | int EVP_PKEY_set1_RSA(EVP_PKEY *pkey, struct rsa_st *key);
      |     ^~~~~~~~~~~~~~~~~
p11test_case_pss_oaep.c: In function 'pss_verify_message_openssl':
p11test_case_pss_oaep.c:556:17: warning: 'RSA_up_ref' is deprecated: Since OpenSSL 3.0 [-Wdeprecated-declarations]
  556 |                 || RSA_up_ref(o->key.rsa) < 1
      |                 ^~
In file included from /usr/include/openssl/x509.h:36,
                 from p11test_case_common.h:25,
                 from p11test_case_pss_oaep.h:22,
                 from p11test_case_pss_oaep.c:22:
/usr/include/openssl/rsa.h:295:27: note: declared here
  295 | OSSL_DEPRECATEDIN_3_0 int RSA_up_ref(RSA *r);
      |                           ^~~~~~~~~~
p11test_case_pss_oaep.c:557:17: warning: 'EVP_PKEY_set1_RSA' is deprecated: Since OpenSSL 3.0 [-Wdeprecated-declarations]
  557 |                 || EVP_PKEY_set1_RSA(key, o->key.rsa) != 1) {
      |                 ^~
In file included from /usr/include/openssl/x509.h:29,
                 from p11test_case_common.h:25,
                 from p11test_case_pss_oaep.h:22,
                 from p11test_case_pss_oaep.c:22:
/usr/include/openssl/evp.h:1344:5: note: declared here
 1344 | int EVP_PKEY_set1_RSA(EVP_PKEY *pkey, struct rsa_st *key);
      |     ^~~~~~~~~~~~~~~~~
mv -f .deps/p11test-p11test_case_pss_oaep.Tpo .deps/p11test-p11test_case_pss_oaep.Po
make[4]: Leaving directory '/tmp/B.rx3zccoc/BUILD/opensc-0.19.0/src/tests/p11test'
make[4]: Entering directory '/tmp/B.rx3zccoc/BUILD/opensc-0.19.0/src/tests/p11test'
/bin/sh ../../../libtool  --tag=CC   --mode=link x86_64-pld-linux-gcc -DNDEBUG  -O2 -fwrapv -pipe -Wformat -Werror=format-security -gdwarf-4 -fno-debug-types-section -fvar-tracking-assignments -g2 -Wp,-D_FORTIFY_SOURCE=2 -fstack-protector-strong --param=ssp-buffer-size=4 -Werror=trampolines -fPIC -march=x86-64 -mtune=generic -gdwarf-4 -fno-debug-types-section -fvar-tracking-assignments -g2  -Wall -Wextra -Wno-unused-parameter  -Wl,--as-needed -Wl,--no-copy-dt-needed-entries -Wl,-z,relro -Wl,-z,combreloc  -o p11test p11test-p11test.o p11test-p11test_loader.o p11test-p11test_case_common.o p11test-p11test_case_readonly.o p11test-p11test_case_multipart.o p11test-p11test_case_mechs.o p11test-p11test_case_ec_sign.o p11test-p11test_case_usage.o p11test-p11test_case_wait.o p11test-p11test_case_pss_oaep.o p11test-p11test_helpers.o  -lcrypto -lcmocka 
libtool: link: x86_64-pld-linux-gcc -DNDEBUG -O2 -fwrapv -pipe -Wformat -Werror=format-security -gdwarf-4 -fno-debug-types-section -fvar-tracking-assignments -g2 -Wp,-D_FORTIFY_SOURCE=2 -fstack-protector-strong --param=ssp-buffer-size=4 -Werror=trampolines -fPIC -march=x86-64 -mtune=generic -gdwarf-4 -fno-debug-types-section -fvar-tracking-assignments -g2 -Wall -Wextra -Wno-unused-parameter -Wl,--as-needed -Wl,--no-copy-dt-needed-entries -Wl,-z -Wl,relro -Wl,-z -Wl,combreloc -o p11test p11test-p11test.o p11test-p11test_loader.o p11test-p11test_case_common.o p11test-p11test_case_readonly.o p11test-p11test_case_multipart.o p11test-p11test_case_mechs.o p11test-p11test_case_ec_sign.o p11test-p11test_case_usage.o p11test-p11test_case_wait.o p11test-p11test_case_pss_oaep.o p11test-p11test_helpers.o  -lcrypto -lcmocka
/usr/bin/ld: p11test-p11test_loader.o:/tmp/B.rx3zccoc/BUILD/opensc-0.19.0/src/tests/p11test/p11test_common.h:86: multiple definition of `token'; p11test-p11test.o:/tmp/B.rx3zccoc/BUILD/opensc-0.19.0/src/tests/p11test/p11test_common.h:86: first defined here
/usr/bin/ld: p11test-p11test_case_common.o:/tmp/B.rx3zccoc/BUILD/opensc-0.19.0/src/tests/p11test/p11test_common.h:86: multiple definition of `token'; p11test-p11test.o:/tmp/B.rx3zccoc/BUILD/opensc-0.19.0/src/tests/p11test/p11test_common.h:86: first defined here
/usr/bin/ld: p11test-p11test_case_readonly.o:/tmp/B.rx3zccoc/BUILD/opensc-0.19.0/src/tests/p11test/p11test_common.h:86: multiple definition of `token'; p11test-p11test.o:/tmp/B.rx3zccoc/BUILD/opensc-0.19.0/src/tests/p11test/p11test_common.h:86: first defined here
/usr/bin/ld: p11test-p11test_case_multipart.o:/tmp/B.rx3zccoc/BUILD/opensc-0.19.0/src/tests/p11test/p11test_common.h:86: multiple definition of `token'; p11test-p11test.o:/tmp/B.rx3zccoc/BUILD/opensc-0.19.0/src/tests/p11test/p11test_common.h:86: first defined here
/usr/bin/ld: p11test-p11test_case_mechs.o:/tmp/B.rx3zccoc/BUILD/opensc-0.19.0/src/tests/p11test/p11test_common.h:86: multiple definition of `token'; p11test-p11test.o:/tmp/B.rx3zccoc/BUILD/opensc-0.19.0/src/tests/p11test/p11test_common.h:86: first defined here
/usr/bin/ld: p11test-p11test_case_ec_sign.o:/tmp/B.rx3zccoc/BUILD/opensc-0.19.0/src/tests/p11test/p11test_common.h:86: multiple definition of `token'; p11test-p11test.o:/tmp/B.rx3zccoc/BUILD/opensc-0.19.0/src/tests/p11test/p11test_common.h:86: first defined here
/usr/bin/ld: p11test-p11test_case_usage.o:/tmp/B.rx3zccoc/BUILD/opensc-0.19.0/src/tests/p11test/p11test_common.h:86: multiple definition of `token'; p11test-p11test.o:/tmp/B.rx3zccoc/BUILD/opensc-0.19.0/src/tests/p11test/p11test_common.h:86: first defined here
/usr/bin/ld: p11test-p11test_case_wait.o:/tmp/B.rx3zccoc/BUILD/opensc-0.19.0/src/tests/p11test/p11test_common.h:86: multiple definition of `token'; p11test-p11test.o:/tmp/B.rx3zccoc/BUILD/opensc-0.19.0/src/tests/p11test/p11test_common.h:86: first defined here
/usr/bin/ld: p11test-p11test_case_pss_oaep.o:/tmp/B.rx3zccoc/BUILD/opensc-0.19.0/src/tests/p11test/p11test_common.h:86: multiple definition of `token'; p11test-p11test.o:/tmp/B.rx3zccoc/BUILD/opensc-0.19.0/src/tests/p11test/p11test_common.h:86: first defined here
/usr/bin/ld: p11test-p11test_helpers.o:/tmp/B.rx3zccoc/BUILD/opensc-0.19.0/src/tests/p11test/p11test_common.h:86: multiple definition of `token'; p11test-p11test.o:/tmp/B.rx3zccoc/BUILD/opensc-0.19.0/src/tests/p11test/p11test_common.h:86: first defined here
collect2: error: ld returned 1 exit status
make[4]: *** [Makefile:492: p11test] Error 1
make[4]: Leaving directory '/tmp/B.rx3zccoc/BUILD/opensc-0.19.0/src/tests/p11test'
make[3]: *** [Makefile:618: all-recursive] Error 1
make[2]: *** [Makefile:441: all-recursive] Error 1
make[1]: *** [Makefile:564: all-recursive] Error 1
make: *** [Makefile:473: all] Error 2
error: Bad exit status from /tmp/B.rx3zccoc/BUILD/tmp/rpm-tmp.TW8Ehh (%build)


RPM build errors:
    line 36: It's not recommended to have unversioned Obsoletes: Obsoletes:	browser-plugin-opensc
    line 37: It's not recommended to have unversioned Obsoletes: Obsoletes:	mozilla-plugin-opensc
    Could not canonicalize hostname: ymir
    Bad exit status from /tmp/B.rx3zccoc/BUILD/tmp/rpm-tmp.TW8Ehh (%build)
ended at: Mon Oct  4 22:42:04 2021, done in 0:00:59.329116
error: No files produced.
+ chmod -R u+rwX /tmp/B.rx3zccoc/BUILD
+ rm -rf /tmp/B.rx3zccoc/tmp /tmp/B.rx3zccoc/BUILD
+ rm -rf /tmp/B.rx3zccoc
Begin-PLD-Builder-Info
Build-Time: user:204.13s sys:36.57s real:61.38s (faults io:212 non-io:8610327)

End-PLD-Builder-Info
[Back to list of logs] [View rpm -qa of builder]