FailedOk

th/SRPMS[OK]
th/x32[OK]
th/i686[OK]
th/x86_64[OK]

ac/SRPMS[OK]
ac/i386[OK]
ac/i586[OK]
ac/i686[OK]
ac/alpha[OK]
ac/amd64[OK]
ac/athlon[OK]
ac/ppc[OK]
ac/sparc[OK]
ac/sparc64[OK]

Advanced Search
main()
Powered by PLD Linux
(c) 2002-2024 PLD Team
$Revision: 1.37 $
Powered by foobarbaz.
Your IP: 44.200.140.218

perl-Moose 06a4c070-bc83-46fd-bd33-7d5b74477848

Status:Failed
Source URL:https://buildlogs.pld-linux.org/pld/th/x86_64/FAIL/perl-Moose,06a4c070-bc83-46fd-bd33-7d5b74477848.bz2
text/plain URL:View!
rpm -qa of builder:View!
Date:2024/06/30 16:04:31
Runtime:0:02:11.612216

Toc:

  • error 1
  • rpm: error: Failed build dependencies:
  • error 2
  • rpm: error: Failed build dependencies:
  • error 3
  • rpm: error: Failed build dependencies:
  • prep
  • Executing(%prep): /bin/sh -e /tmp/B.8xtwfat7/BUILD/tmp/rpm-tmp.KSAjmb
  • build
  • Executing(%build): /bin/sh -e /tmp/B.8xtwfat7/BUILD/tmp/rpm-tmp.XUMpb7
  • error 4
  • error: Bad exit status from /tmp/B.8xtwfat7/BUILD/tmp/rpm-tmp.XUMpb7 (%build)
  • error 5
  • RPM build errors:
  • error 6
  • error: No files produced.

Content:

request from: atler
checking if we should skip the build
started at: Sun Jun 30 16:02:05 2024
killing old processes on a builder
sending signal 9 to pid -1
cleaning up /tmp
fetching https://srcbuilder.pld-linux.org/th//srpms/06a4c070-bc83-46fd-bd33-7d5b74477848/perl-Moose-2.2203-2.src.rpm
fetched 918490 bytes, 2228.9 K/s
installing srpm: perl-Moose-2.2203-2.src.rpm
+ install -d /tmp/B.8xtwfat7/BUILD /tmp/B.8xtwfat7/RPMS
+ LC_ALL=en_US.UTF-8
+ rpm -qp --changelog perl-Moose-2.2203-2.src.rpm
* Sun Jun 30 2024 PLD Linux Team <feedback@pld-linux.org>
- For complete changelog see: http://git.pld-linux.org/?p=packages/perl-Moose.git;a=log;h=master
* Fri Jul 07 2023 Jan Palus <atler@pld-linux.org> bea2fbe
- perl 5.38.0 rebuild * Fri Feb 03 2023 Jakub Bogusz <qboosh@pld-linux.org> 1872f7b
- updated to 2.2203 * Mon Aug 22 2022 Jan Palus <atler@pld-linux.org> 004060d
- perl 5.36.0 rebuild * Mon May 30 2022 Jakub Bogusz <qboosh@pld-linux.org> 8320605
- updated to 2.2201 * Sun Feb 27 2022 Jan Rękorajski <baggins@pld-linux.org> baabc05
- rebuild with perl 5.34.0 * Thu May 20 2021 Jakub Bogusz <qboosh@pld-linux.org> 3c7ba4f
- updated to 2.2015 * Tue May 11 2021 Jan Palus <atler@pld-linux.org> 8d33917
- Release 2 (by relup.sh) * Mon Feb 01 2021 Arkadiusz Miśkiewicz <arekm@maven.pl> 9167ca1
- up to 2.2014 * Fri Oct 09 2020 Jakub Bogusz <qboosh@pld-linux.org> 51a9313
- updated to 2.2013 * Sat Jan 25 2020 Jan Rękorajski <baggins@pld-linux.org> bc205cf
- drop obsolete and outdated manual inclusion of rpm macros * Thu Dec 05 2019 Jan Rękorajski <baggins@pld-linux.org> cd70f3d
- rebuild with perl 5.30.0 - release 8 (by relup.sh) * Sun Sep 02 2018 Jan Rękorajski <baggins@pld-linux.org> d4378b5
- release 7 (by relup.sh) * Thu Jun 22 2017 Jan Rękorajski <baggins@pld-linux.org> af9eb25
- release 6 (by relup.sh) * Sun Jun 11 2017 Jan Rękorajski <baggins@pld-linux.org> ed4faab
- perl req/prov fix - release 5 (by relup.sh) * Sun Jun 11 2017 Jan Rękorajski <baggins@pld-linux.org> 87c01e0
- rebuild with perl 5.26 - release 4 (by relup.sh) * Sat Nov 26 2016 Jakub Bogusz <qboosh@pld-linux.org> 153dd7b
- release 3 (x32 rebuild) * Thu Nov 03 2016 Jan Rękorajski <baggins@pld-linux.org> d77b38f
- updated BRs * Sun Oct 30 2016 Jan Rękorajski <baggins@pld-linux.org> 66d1026
- rebuild with perl 5.24.0 - release 2 (by relup.sh) * Mon Jun 27 2016 Adam Osuchowski <adwol@pld-linux.org> d6530f3
- up to 2.1804 * Mon Mar 07 2016 Adam Osuchowski <adwol@pld-linux.org> 96320e0
- up to 2.1605 + rpm -Uhv --nodeps --define '_topdir /tmp/B.8xtwfat7' --define '_specdir %{_topdir}' --define '_sourcedir %{_specdir}' --define '_rpmdir %{_topdir}/RPMS' --define '_builddir %{_topdir}/BUILD' perl-Moose-2.2203-2.src.rpm Updating / installing... perl-Moose-2.2203-2 ######################################## + rm -f perl-Moose-2.2203-2.src.rpm + install -m 700 -d /tmp/B.8xtwfat7/BUILD/tmp + TMPDIR=/tmp/B.8xtwfat7/BUILD/tmp + exec nice -n 0 rpmbuild -bp --short-circuit --nodeps --define '_topdir /tmp/B.8xtwfat7' --define '_specdir %{_topdir}' --define '_sourcedir %{_specdir}' --define '_rpmdir %{_topdir}/RPMS' --define '_builddir %{_topdir}/BUILD' --target x86_64-pld-linux --define 'prep exit 0' /tmp/B.8xtwfat7/perl-Moose.spec warning: Could not canonicalize hostname: ymir Building target platforms: x86_64-pld-linux Building for target x86_64-pld-linux RPM build warnings: Could not canonicalize hostname: ymir checking BuildConflict-ing packages rpm: warning: Could not canonicalize hostname: ymir rpm: error: Failed build dependencies: rpm: perl-Class-Load-XS >= 0.01 is needed by perl-Moose-2.2203-2.x86_64 rpm: perl-DBM-Deep >= 1.0003 is needed by perl-Moose-2.2203-2.x86_64 rpm: perl-DateTime-Calendar-Mayan is needed by perl-Moose-2.2203-2.x86_64 rpm: perl-DateTime-Format-MySQL >= 0.01 is needed by perl-Moose-2.2203-2.x86_64 rpm: perl-Declare-Constraints-Simple is needed by perl-Moose-2.2203-2.x86_64 rpm: perl-Devel-OverloadInfo >= 0.005 is needed by perl-Moose-2.2203-2.x86_64 rpm: perl-File-Find-Rule is needed by perl-Moose-2.2203-2.x86_64 rpm: perl-Locale-US is needed by perl-Moose-2.2203-2.x86_64 rpm: perl-Module-Refresh >= 0.01 is needed by perl-Moose-2.2203-2.x86_64 rpm: perl-Module-Runtime-Conflicts >= 0.002 is needed by perl-Moose-2.2203-2.x86_64 rpm: perl-Package-DeprecationManager >= 0.11 is needed by perl-Moose-2.2203-2.x86_64 rpm: perl-Package-Stash-XS >= 0.24 is needed by perl-Moose-2.2203-2.x86_64 rpm: perl-Params-Coerce is needed by perl-Moose-2.2203-2.x86_64 rpm: perl-Regexp-Common is needed by perl-Moose-2.2203-2.x86_64 rpm: perl-Sub-Exporter >= 0.980 is needed by perl-Moose-2.2203-2.x86_64 rpm: perl-Test-CleanNamespaces >= 0.13 is needed by perl-Moose-2.2203-2.x86_64 rpm: perl-Test-Inline is needed by perl-Moose-2.2203-2.x86_64 rpm: perl-Test-NoTabs is needed by perl-Moose-2.2203-2.x86_64 rpm: perl-Test-Spelling is needed by perl-Moose-2.2203-2.x86_64 rpm: Building target platforms: x86_64-pld-linux rpm: Building for target x86_64-pld-linux rpm: rpm: RPM build warnings: rpm: Could not canonicalize hostname: ymir no BuildConflicts found checking BR rpm: warning: Could not canonicalize hostname: ymir rpm: error: Failed build dependencies: rpm: perl-Class-Load-XS >= 0.01 is needed by perl-Moose-2.2203-2.x86_64 rpm: perl-DBM-Deep >= 1.0003 is needed by perl-Moose-2.2203-2.x86_64 rpm: perl-DateTime-Calendar-Mayan is needed by perl-Moose-2.2203-2.x86_64 rpm: perl-DateTime-Format-MySQL >= 0.01 is needed by perl-Moose-2.2203-2.x86_64 rpm: perl-Declare-Constraints-Simple is needed by perl-Moose-2.2203-2.x86_64 rpm: perl-Devel-OverloadInfo >= 0.005 is needed by perl-Moose-2.2203-2.x86_64 rpm: perl-File-Find-Rule is needed by perl-Moose-2.2203-2.x86_64 rpm: perl-Locale-US is needed by perl-Moose-2.2203-2.x86_64 rpm: perl-Module-Refresh >= 0.01 is needed by perl-Moose-2.2203-2.x86_64 rpm: perl-Module-Runtime-Conflicts >= 0.002 is needed by perl-Moose-2.2203-2.x86_64 rpm: perl-Package-DeprecationManager >= 0.11 is needed by perl-Moose-2.2203-2.x86_64 rpm: perl-Package-Stash-XS >= 0.24 is needed by perl-Moose-2.2203-2.x86_64 rpm: perl-Params-Coerce is needed by perl-Moose-2.2203-2.x86_64 rpm: perl-Regexp-Common is needed by perl-Moose-2.2203-2.x86_64 rpm: perl-Sub-Exporter >= 0.980 is needed by perl-Moose-2.2203-2.x86_64 rpm: perl-Test-CleanNamespaces >= 0.13 is needed by perl-Moose-2.2203-2.x86_64 rpm: perl-Test-Inline is needed by perl-Moose-2.2203-2.x86_64 rpm: perl-Test-NoTabs is needed by perl-Moose-2.2203-2.x86_64 rpm: perl-Test-Spelling is needed by perl-Moose-2.2203-2.x86_64 rpm: Building target platforms: x86_64-pld-linux rpm: Building for target x86_64-pld-linux rpm: rpm: RPM build warnings: rpm: Could not canonicalize hostname: ymir updating poldek cache... ready is up to date th is up to date th is up to date th-ready is up to date th-ready is up to date th-test is up to date th-test is up to date checking conflicting packages in BRed packages poldek: Loading [pndir]ready... poldek: Loading [pndir]th-test... poldek: Loading [pndir]th-test... poldek: Loading [pndir]th-ready... poldek: Loading [pndir]th-ready... poldek: Loading [pndir]th... poldek: Loading [pndir]th... poldek: 37051 packages read poldek: Removed 4680 duplicate packages from available set poldek: Processing dependencies... poldek: perl-File-Find-Rule-0.34-1.noarch marks perl-Number-Compare-0.03-1.noarch (cap perl(Number::Compare)) poldek: perl-File-Find-Rule-0.34-1.noarch marks perl-Text-Glob-0.11-1.noarch (cap perl(Text::Glob)) poldek: perl-Package-DeprecationManager-0.17-2.noarch marks perl-Sub-Name-0.27-2.x86_64 (cap perl(Sub::Name)) poldek: perl-DateTime-Format-MySQL-0.08-1.noarch marks perl-DateTime-Format-Builder-0.83-1.noarch (cap perl-DateTime-Format-Builder >= 0.60) poldek: perl-Declare-Constraints-Simple-0.03-3.noarch marks perl-aliased-0.34-1.noarch (cap perl(aliased)) poldek: perl-Locale-US-3.04-1.noarch marks perl-Data-Section-Simple-0.07-1.noarch (cap perl(Data::Section::Simple)) poldek: perl-Test-Inline-2.214-1.noarch marks perl-Algorithm-Dependency-1.112-1.noarch (cap perl(Algorithm::Dependency) >= 1.02) poldek: perl-Test-Inline-2.214-1.noarch marks perl-Config-Tiny-2.26-1.noarch (cap perl(Config::Tiny)) poldek: perl-Test-Inline-2.214-1.noarch marks perl-File-chmod-0.42-1.noarch (cap perl(File::chmod)) poldek: perl-Test-Spelling-0.25-1.noarch marks perl-Pod-Spell-1.20-1.noarch (cap perl(Pod::Spell)) poldek: perl-Pod-Spell-1.20-1.noarch marks perl-Class-Tiny-1.006-1.noarch (cap perl(Class::Tiny)) poldek: perl-Pod-Spell-1.20-1.noarch marks perl-Lingua-EN-Inflect-1.900-1.noarch (cap perl(Lingua::EN::Inflect)) poldek: There are 31 packages to install (12 marked by dependencies): poldek: A perl-Algorithm-Dependency-1.112-1.noarch poldek: A perl-Class-Load-XS-0.10-6.x86_64 perl-Class-Tiny-1.006-1.noarch poldek: A perl-Config-Tiny-2.26-1.noarch perl-DBM-Deep-2.0017-1.noarch poldek: A perl-Data-Section-Simple-0.07-1.noarch poldek: A perl-DateTime-Calendar-Mayan-0.0601-3.noarch poldek: A perl-DateTime-Format-Builder-0.83-1.noarch poldek: A perl-DateTime-Format-MySQL-0.08-1.noarch poldek: A perl-Declare-Constraints-Simple-0.03-3.noarch poldek: A perl-Devel-OverloadInfo-0.007-1.noarch poldek: A perl-File-Find-Rule-0.34-1.noarch perl-File-chmod-0.42-1.noarch poldek: A perl-Lingua-EN-Inflect-1.900-1.noarch perl-Locale-US-3.04-1.noarch poldek: A perl-Module-Refresh-0.17-1.noarch poldek: A perl-Module-Runtime-Conflicts-0.003-1.noarch poldek: A perl-Number-Compare-0.03-1.noarch poldek: A perl-Package-DeprecationManager-0.17-2.noarch poldek: A perl-Package-Stash-XS-0.30-3.x86_64 perl-Params-Coerce-0.15-1.noarch poldek: A perl-Pod-Spell-1.20-1.noarch perl-Regexp-Common-2017060201-1.noarch poldek: A perl-Sub-Exporter-0.988-1.noarch perl-Sub-Name-0.27-2.x86_64 poldek: A perl-Test-CleanNamespaces-0.24-1.noarch perl-Test-Inline-2.214-1.noarch poldek: A perl-Test-NoTabs-2.02-1.noarch perl-Test-Spelling-0.25-1.noarch poldek: A perl-Text-Glob-0.11-1.noarch perl-aliased-0.34-1.noarch poldek: This operation will use 1.8MB of disk space. poldek: perl-File-Find-Rule-0.34-1.noarch.rpm: digests OK poldek: perl-Regexp-Common-2017060201-1.noarch.rpm: digests OK poldek: perl-Devel-OverloadInfo-0.007-1.noarch.rpm: digests OK poldek: perl-Package-DeprecationManager-0.17-2.noarch.rpm: digests OK poldek: perl-Sub-Exporter-0.988-1.noarch.rpm: digests OK poldek: perl-DBM-Deep-2.0017-1.noarch.rpm: digests OK poldek: perl-DateTime-Calendar-Mayan-0.0601-3.noarch.rpm: digests OK poldek: perl-DateTime-Format-MySQL-0.08-1.noarch.rpm: digests OK poldek: perl-Declare-Constraints-Simple-0.03-3.noarch.rpm: digests OK poldek: perl-Module-Refresh-0.17-1.noarch.rpm: digests OK poldek: perl-Locale-US-3.04-1.noarch.rpm: digests OK poldek: perl-Module-Runtime-Conflicts-0.003-1.noarch.rpm: digests OK poldek: perl-Params-Coerce-0.15-1.noarch.rpm: digests OK poldek: perl-Test-CleanNamespaces-0.24-1.noarch.rpm: digests OK poldek: perl-Test-Inline-2.214-1.noarch.rpm: digests OK poldek: perl-Test-NoTabs-2.02-1.noarch.rpm: digests OK poldek: perl-Test-Spelling-0.25-1.noarch.rpm: digests OK poldek: perl-Number-Compare-0.03-1.noarch.rpm: digests OK poldek: perl-Text-Glob-0.11-1.noarch.rpm: digests OK poldek: perl-DateTime-Format-Builder-0.83-1.noarch.rpm: digests OK poldek: perl-aliased-0.34-1.noarch.rpm: digests OK poldek: perl-Data-Section-Simple-0.07-1.noarch.rpm: digests OK poldek: perl-Algorithm-Dependency-1.112-1.noarch.rpm: digests OK poldek: perl-Config-Tiny-2.26-1.noarch.rpm: digests OK poldek: perl-File-chmod-0.42-1.noarch.rpm: digests OK poldek: perl-Pod-Spell-1.20-1.noarch.rpm: digests OK poldek: perl-Class-Tiny-1.006-1.noarch.rpm: digests OK poldek: perl-Lingua-EN-Inflect-1.900-1.noarch.rpm: digests OK poldek: Need to get 979.1KB of archives. poldek: perl-Algorithm-Dependency-1.112-1.noarch.rpm: digests OK poldek: perl-Class-Load-XS-0.10-6.x86_64.rpm: digests OK poldek: perl-Class-Tiny-1.006-1.noarch.rpm: digests OK poldek: perl-Config-Tiny-2.26-1.noarch.rpm: digests OK poldek: perl-DBM-Deep-2.0017-1.noarch.rpm: digests OK poldek: perl-Data-Section-Simple-0.07-1.noarch.rpm: digests OK poldek: perl-DateTime-Calendar-Mayan-0.0601-3.noarch.rpm: digests OK poldek: perl-DateTime-Format-Builder-0.83-1.noarch.rpm: digests OK poldek: perl-DateTime-Format-MySQL-0.08-1.noarch.rpm: digests OK poldek: perl-aliased-0.34-1.noarch.rpm: digests OK poldek: perl-Declare-Constraints-Simple-0.03-3.noarch.rpm: digests OK poldek: perl-Devel-OverloadInfo-0.007-1.noarch.rpm: digests OK poldek: perl-Number-Compare-0.03-1.noarch.rpm: digests OK poldek: perl-Text-Glob-0.11-1.noarch.rpm: digests OK poldek: perl-File-Find-Rule-0.34-1.noarch.rpm: digests OK poldek: perl-File-chmod-0.42-1.noarch.rpm: digests OK poldek: perl-Lingua-EN-Inflect-1.900-1.noarch.rpm: digests OK poldek: perl-Locale-US-3.04-1.noarch.rpm: digests OK poldek: perl-Module-Refresh-0.17-1.noarch.rpm: digests OK poldek: perl-Module-Runtime-Conflicts-0.003-1.noarch.rpm: digests OK poldek: perl-Sub-Name-0.27-2.x86_64.rpm: digests OK poldek: perl-Package-DeprecationManager-0.17-2.noarch.rpm: digests OK poldek: perl-Package-Stash-XS-0.30-3.x86_64.rpm: digests OK poldek: perl-Params-Coerce-0.15-1.noarch.rpm: digests OK poldek: perl-Pod-Spell-1.20-1.noarch.rpm: digests OK poldek: perl-Regexp-Common-2017060201-1.noarch.rpm: digests OK poldek: perl-Sub-Exporter-0.988-1.noarch.rpm: digests OK poldek: perl-Test-CleanNamespaces-0.24-1.noarch.rpm: digests OK poldek: perl-Test-Inline-2.214-1.noarch.rpm: digests OK poldek: perl-Test-NoTabs-2.02-1.noarch.rpm: digests OK poldek: perl-Test-Spelling-0.25-1.noarch.rpm: digests OK poldek: Executing pm-command.sh --upgrade -vh --test --root / --define _check_dirname_deps 0... poldek: warning: /root/.cache/poldek/ftp_ep09.pld-linux.org.dists.th.PLD.noarch.RPMS/perl-Algorithm-Dependency-1.112-1.noarch.rpm: Header V4 DSA/SHA1 Signature, key ID e4f1bc2d: NOKEY poldek: Verifying... ######################################## poldek: Preparing... ######################################## no conflicts found checking BR rpm: warning: Could not canonicalize hostname: ymir rpm: error: Failed build dependencies: rpm: perl-Class-Load-XS >= 0.01 is needed by perl-Moose-2.2203-2.x86_64 rpm: perl-DBM-Deep >= 1.0003 is needed by perl-Moose-2.2203-2.x86_64 rpm: perl-DateTime-Calendar-Mayan is needed by perl-Moose-2.2203-2.x86_64 rpm: perl-DateTime-Format-MySQL >= 0.01 is needed by perl-Moose-2.2203-2.x86_64 rpm: perl-Declare-Constraints-Simple is needed by perl-Moose-2.2203-2.x86_64 rpm: perl-Devel-OverloadInfo >= 0.005 is needed by perl-Moose-2.2203-2.x86_64 rpm: perl-File-Find-Rule is needed by perl-Moose-2.2203-2.x86_64 rpm: perl-Locale-US is needed by perl-Moose-2.2203-2.x86_64 rpm: perl-Module-Refresh >= 0.01 is needed by perl-Moose-2.2203-2.x86_64 rpm: perl-Module-Runtime-Conflicts >= 0.002 is needed by perl-Moose-2.2203-2.x86_64 rpm: perl-Package-DeprecationManager >= 0.11 is needed by perl-Moose-2.2203-2.x86_64 rpm: perl-Package-Stash-XS >= 0.24 is needed by perl-Moose-2.2203-2.x86_64 rpm: perl-Params-Coerce is needed by perl-Moose-2.2203-2.x86_64 rpm: perl-Regexp-Common is needed by perl-Moose-2.2203-2.x86_64 rpm: perl-Sub-Exporter >= 0.980 is needed by perl-Moose-2.2203-2.x86_64 rpm: perl-Test-CleanNamespaces >= 0.13 is needed by perl-Moose-2.2203-2.x86_64 rpm: perl-Test-Inline is needed by perl-Moose-2.2203-2.x86_64 rpm: perl-Test-NoTabs is needed by perl-Moose-2.2203-2.x86_64 rpm: perl-Test-Spelling is needed by perl-Moose-2.2203-2.x86_64 rpm: Building target platforms: x86_64-pld-linux rpm: Building for target x86_64-pld-linux rpm: rpm: RPM build warnings: rpm: Could not canonicalize hostname: ymir installing BR: perl\-Class\-Load\-XS perl\-DBM\-Deep perl\-DateTime\-Calendar\-Mayan perl\-DateTime\-Format\-MySQL perl\-Declare\-Constraints\-Simple perl\-Devel\-OverloadInfo perl\-File\-Find\-Rule perl\-Locale\-US perl\-Module\-Refresh perl\-Module\-Runtime\-Conflicts perl\-Package\-DeprecationManager perl\-Package\-Stash\-XS perl\-Params\-Coerce perl\-Regexp\-Common perl\-Sub\-Exporter perl\-Test\-CleanNamespaces perl\-Test\-Inline perl\-Test\-NoTabs perl\-Test\-Spelling + poldek --noask --caplookup -Q -v '--ignore=hhvm-*' '--ignore=php4-*' '--ignore=php52-*' '--ignore=php54-*' '--ignore=php55-*' '--ignore=php56-*' '--ignore=php70-*' '--ignore=php71-*' '--ignore=php72-*' '--ignore=php73-*' '--ignore=php74-*' '--ignore=php80-*' '--ignore=php81-*' '--ignore=php82-*' --upgrade perl-Class-Load-XS perl-DBM-Deep perl-DateTime-Calendar-Mayan perl-DateTime-Format-MySQL perl-Declare-Constraints-Simple perl-Devel-OverloadInfo perl-File-Find-Rule perl-Locale-US perl-Module-Refresh perl-Module-Runtime-Conflicts perl-Package-DeprecationManager perl-Package-Stash-XS perl-Params-Coerce perl-Regexp-Common perl-Sub-Exporter perl-Test-CleanNamespaces perl-Test-Inline perl-Test-NoTabs perl-Test-Spelling Loading [pndir]ready... Loading [pndir]th-test... Loading [pndir]th-test... Loading [pndir]th-ready... Loading [pndir]th-ready... Loading [pndir]th... Loading [pndir]th... 37051 packages read Removed 4680 duplicate packages from available set Processing dependencies... perl-File-Find-Rule-0.34-1.noarch marks perl-Number-Compare-0.03-1.noarch (cap perl(Number::Compare)) perl-File-Find-Rule-0.34-1.noarch marks perl-Text-Glob-0.11-1.noarch (cap perl(Text::Glob)) perl-DateTime-Format-MySQL-0.08-1.noarch marks perl-DateTime-Format-Builder-0.83-1.noarch (cap perl-DateTime-Format-Builder >= 0.60) perl-Declare-Constraints-Simple-0.03-3.noarch marks perl-aliased-0.34-1.noarch (cap perl(aliased)) perl-Locale-US-3.04-1.noarch marks perl-Data-Section-Simple-0.07-1.noarch (cap perl(Data::Section::Simple)) perl-Package-DeprecationManager-0.17-2.noarch marks perl-Sub-Name-0.27-2.x86_64 (cap perl(Sub::Name)) perl-Test-Inline-2.214-1.noarch marks perl-Algorithm-Dependency-1.112-1.noarch (cap perl(Algorithm::Dependency) >= 1.02) perl-Test-Inline-2.214-1.noarch marks perl-Config-Tiny-2.26-1.noarch (cap perl(Config::Tiny)) perl-Test-Inline-2.214-1.noarch marks perl-File-chmod-0.42-1.noarch (cap perl(File::chmod)) perl-Test-Spelling-0.25-1.noarch marks perl-Pod-Spell-1.20-1.noarch (cap perl(Pod::Spell)) perl-Pod-Spell-1.20-1.noarch marks perl-Class-Tiny-1.006-1.noarch (cap perl(Class::Tiny)) perl-Pod-Spell-1.20-1.noarch marks perl-Lingua-EN-Inflect-1.900-1.noarch (cap perl(Lingua::EN::Inflect)) There are 31 packages to install (12 marked by dependencies): A perl-Algorithm-Dependency-1.112-1.noarch A perl-Class-Load-XS-0.10-6.x86_64 perl-Class-Tiny-1.006-1.noarch A perl-Config-Tiny-2.26-1.noarch perl-DBM-Deep-2.0017-1.noarch A perl-Data-Section-Simple-0.07-1.noarch A perl-DateTime-Calendar-Mayan-0.0601-3.noarch A perl-DateTime-Format-Builder-0.83-1.noarch A perl-DateTime-Format-MySQL-0.08-1.noarch A perl-Declare-Constraints-Simple-0.03-3.noarch A perl-Devel-OverloadInfo-0.007-1.noarch A perl-File-Find-Rule-0.34-1.noarch perl-File-chmod-0.42-1.noarch A perl-Lingua-EN-Inflect-1.900-1.noarch perl-Locale-US-3.04-1.noarch A perl-Module-Refresh-0.17-1.noarch A perl-Module-Runtime-Conflicts-0.003-1.noarch A perl-Number-Compare-0.03-1.noarch A perl-Package-DeprecationManager-0.17-2.noarch A perl-Package-Stash-XS-0.30-3.x86_64 perl-Params-Coerce-0.15-1.noarch A perl-Pod-Spell-1.20-1.noarch perl-Regexp-Common-2017060201-1.noarch A perl-Sub-Exporter-0.988-1.noarch perl-Sub-Name-0.27-2.x86_64 A perl-Test-CleanNamespaces-0.24-1.noarch perl-Test-Inline-2.214-1.noarch A perl-Test-NoTabs-2.02-1.noarch perl-Test-Spelling-0.25-1.noarch A perl-Text-Glob-0.11-1.noarch perl-aliased-0.34-1.noarch This operation will use 1.8MB of disk space. perl-File-Find-Rule-0.34-1.noarch.rpm: digests OK perl-DBM-Deep-2.0017-1.noarch.rpm: digests OK perl-DateTime-Calendar-Mayan-0.0601-3.noarch.rpm: digests OK perl-DateTime-Format-MySQL-0.08-1.noarch.rpm: digests OK perl-Declare-Constraints-Simple-0.03-3.noarch.rpm: digests OK perl-Devel-OverloadInfo-0.007-1.noarch.rpm: digests OK perl-Locale-US-3.04-1.noarch.rpm: digests OK perl-Module-Refresh-0.17-1.noarch.rpm: digests OK perl-Module-Runtime-Conflicts-0.003-1.noarch.rpm: digests OK perl-Package-DeprecationManager-0.17-2.noarch.rpm: digests OK perl-Params-Coerce-0.15-1.noarch.rpm: digests OK perl-Regexp-Common-2017060201-1.noarch.rpm: digests OK perl-Sub-Exporter-0.988-1.noarch.rpm: digests OK perl-Test-CleanNamespaces-0.24-1.noarch.rpm: digests OK perl-Test-Inline-2.214-1.noarch.rpm: digests OK perl-Test-NoTabs-2.02-1.noarch.rpm: digests OK perl-Test-Spelling-0.25-1.noarch.rpm: digests OK perl-Number-Compare-0.03-1.noarch.rpm: digests OK perl-Text-Glob-0.11-1.noarch.rpm: digests OK perl-DateTime-Format-Builder-0.83-1.noarch.rpm: digests OK perl-aliased-0.34-1.noarch.rpm: digests OK perl-Data-Section-Simple-0.07-1.noarch.rpm: digests OK perl-Algorithm-Dependency-1.112-1.noarch.rpm: digests OK perl-Config-Tiny-2.26-1.noarch.rpm: digests OK perl-File-chmod-0.42-1.noarch.rpm: digests OK perl-Pod-Spell-1.20-1.noarch.rpm: digests OK perl-Class-Tiny-1.006-1.noarch.rpm: digests OK perl-Lingua-EN-Inflect-1.900-1.noarch.rpm: digests OK Need to get 979.1KB of archives. perl-Algorithm-Dependency-1.112-1.noarch.rpm: digests OK perl-Class-Load-XS-0.10-6.x86_64.rpm: digests OK perl-Class-Tiny-1.006-1.noarch.rpm: digests OK perl-Config-Tiny-2.26-1.noarch.rpm: digests OK perl-DBM-Deep-2.0017-1.noarch.rpm: digests OK perl-Data-Section-Simple-0.07-1.noarch.rpm: digests OK perl-DateTime-Calendar-Mayan-0.0601-3.noarch.rpm: digests OK perl-DateTime-Format-Builder-0.83-1.noarch.rpm: digests OK perl-DateTime-Format-MySQL-0.08-1.noarch.rpm: digests OK perl-aliased-0.34-1.noarch.rpm: digests OK perl-Declare-Constraints-Simple-0.03-3.noarch.rpm: digests OK perl-Devel-OverloadInfo-0.007-1.noarch.rpm: digests OK perl-Number-Compare-0.03-1.noarch.rpm: digests OK perl-Text-Glob-0.11-1.noarch.rpm: digests OK perl-File-Find-Rule-0.34-1.noarch.rpm: digests OK perl-File-chmod-0.42-1.noarch.rpm: digests OK perl-Lingua-EN-Inflect-1.900-1.noarch.rpm: digests OK perl-Locale-US-3.04-1.noarch.rpm: digests OK perl-Module-Refresh-0.17-1.noarch.rpm: digests OK perl-Module-Runtime-Conflicts-0.003-1.noarch.rpm: digests OK perl-Sub-Name-0.27-2.x86_64.rpm: digests OK perl-Package-DeprecationManager-0.17-2.noarch.rpm: digests OK perl-Package-Stash-XS-0.30-3.x86_64.rpm: digests OK perl-Params-Coerce-0.15-1.noarch.rpm: digests OK perl-Pod-Spell-1.20-1.noarch.rpm: digests OK perl-Regexp-Common-2017060201-1.noarch.rpm: digests OK perl-Sub-Exporter-0.988-1.noarch.rpm: digests OK perl-Test-CleanNamespaces-0.24-1.noarch.rpm: digests OK perl-Test-Inline-2.214-1.noarch.rpm: digests OK perl-Test-NoTabs-2.02-1.noarch.rpm: digests OK perl-Test-Spelling-0.25-1.noarch.rpm: digests OK Executing pm-command.sh --upgrade -vh --root / --define _check_dirname_deps 0... warning: /root/.cache/poldek/ftp_ep09.pld-linux.org.dists.th.PLD.noarch.RPMS/perl-Algorithm-Dependency-1.112-1.noarch.rpm: Header V4 DSA/SHA1 Signature, key ID e4f1bc2d: NOKEY Verifying... ######################################## Preparing... ######################################## Updating / installing... perl-Sub-Name-0.27-2 ######################################## perl-Lingua-EN-Inflect-1.900-1 ######################################## perl-File-chmod-0.42-1 ######################################## perl-Text-Glob-0.11-1 ######################################## perl-Number-Compare-0:0.03-1 ######################################## perl-aliased-0.34-1 ######################################## perl-DateTime-Format-Builder-1:0.83-1 ######################################## perl-Data-Section-Simple-0.07-1 ######################################## perl-Config-Tiny-2.26-1 ######################################## perl-Class-Tiny-1.006-1 ######################################## perl-Pod-Spell-1.20-1 ######################################## perl-Algorithm-Dependency-1.112-1 ######################################## perl-Test-Inline-2.214-1 ######################################## perl-Test-Spelling-0.25-1 ######################################## perl-Locale-US-3.04-1 ######################################## perl-DateTime-Format-MySQL-0.08-1 ######################################## perl-Declare-Constraints-Simple-0:0.03######################################## perl-File-Find-Rule-0.34-1 ######################################## perl-Package-DeprecationManager-0.17-2######################################## perl-Test-NoTabs-2.02-1 ######################################## perl-Test-CleanNamespaces-0.24-1 ######################################## perl-Sub-Exporter-0.988-1 ######################################## perl-Regexp-Common-2017060201-1 ######################################## perl-Params-Coerce-0.15-1 ######################################## perl-Package-Stash-XS-0.30-3 ######################################## perl-Module-Runtime-Conflicts-0.003-1 ######################################## perl-Module-Refresh-0:0.17-1 ######################################## perl-Devel-OverloadInfo-0.007-1 ######################################## perl-DateTime-Calendar-Mayan-0:0.0601-######################################## perl-DBM-Deep-2.0017-1 ######################################## perl-Class-Load-XS-0.10-6 ######################################## building RPM using: set -ex; : build-id: 06a4c070-bc83-46fd-bd33-7d5b74477848; TMPDIR=/tmp/B.8xtwfat7/BUILD/tmp exec nice -n 0 rpmbuild -bb --define '__jobs 28' --define '_smp_mflags -j28' --define '_make_opts -Otarget' --define '_pld_builder 1' --define '_topdir /tmp/B.8xtwfat7' --define '_specdir %{_topdir}' --define '_sourcedir %{_specdir}' --define '_rpmdir %{_topdir}/RPMS' --define '_builddir %{_topdir}/BUILD' --target x86_64-pld-linux /tmp/B.8xtwfat7/perl-Moose.spec + : build-id: 06a4c070-bc83-46fd-bd33-7d5b74477848 + TMPDIR=/tmp/B.8xtwfat7/BUILD/tmp + exec nice -n 0 rpmbuild -bb --define '__jobs 28' --define '_smp_mflags -j28' --define '_make_opts -Otarget' --define '_pld_builder 1' --define '_topdir /tmp/B.8xtwfat7' --define '_specdir %{_topdir}' --define '_sourcedir %{_specdir}' --define '_rpmdir %{_topdir}/RPMS' --define '_builddir %{_topdir}/BUILD' --target x86_64-pld-linux /tmp/B.8xtwfat7/perl-Moose.spec warning: Could not canonicalize hostname: ymir Building target platforms: x86_64-pld-linux Building for target x86_64-pld-linux Executing(%prep): /bin/sh -e /tmp/B.8xtwfat7/BUILD/tmp/rpm-tmp.KSAjmb + umask 022 + cd /tmp/B.8xtwfat7/BUILD + cd /tmp/B.8xtwfat7/BUILD + rm -rf Moose-2.2203 + /bin/gzip -dc /tmp/B.8xtwfat7/Moose-2.2203.tar.gz + /bin/tar -xof - + STATUS=0 + '[' 0 -ne 0 ']' + cd Moose-2.2203 + /bin/chmod -Rf a+rX,u+w,g-w,o-w . + RPM_EC=0 + jobs -p + exit 0 Executing(%build): /bin/sh -e /tmp/B.8xtwfat7/BUILD/tmp/rpm-tmp.XUMpb7 TMP=/home/users/builder/tmp HOME=/home/users/builder PATH=/home/users/builder/GNUstep/Tools:/bin:/usr/bin:/usr/local/bin:/home/users/builder/bin TMPDIR=/tmp/B.8xtwfat7/BUILD/tmp + umask 022 + cd /tmp/B.8xtwfat7/BUILD + cd Moose-2.2203 + /usr/bin/perl Makefile.PL 'INSTALLDIRS=vendor' Checking if your kit is complete... Looks good Generating a Unix-style Makefile Writing Makefile for Moose Writing MYMETA.yml and MYMETA.json + /usr/bin/make -Otarget -j28 Running Mkbootstrap for Moose () chmod 644 "Moose.bs" "/usr/bin/perl5.40.0" "/usr/share/perl5/5.40.0/ExtUtils/xsubpp" -typemap '/usr/share/perl5/5.40.0/ExtUtils/typemap' xs/Attribute.xs > xs/Attribute.xsc mv xs/Attribute.xsc xs/Attribute.c "/usr/bin/perl5.40.0" "/usr/share/perl5/5.40.0/ExtUtils/xsubpp" -typemap '/usr/share/perl5/5.40.0/ExtUtils/typemap' xs/AttributeCore.xs > xs/AttributeCore.xsc mv xs/AttributeCore.xsc xs/AttributeCore.c "/usr/bin/perl5.40.0" "/usr/share/perl5/5.40.0/ExtUtils/xsubpp" -typemap '/usr/share/perl5/5.40.0/ExtUtils/typemap' xs/Class.xs > xs/Class.xsc mv xs/Class.xsc xs/Class.c "/usr/bin/perl5.40.0" "/usr/share/perl5/5.40.0/ExtUtils/xsubpp" -typemap '/usr/share/perl5/5.40.0/ExtUtils/typemap' xs/Generated.xs > xs/Generated.xsc mv xs/Generated.xsc xs/Generated.c "/usr/bin/perl5.40.0" "/usr/share/perl5/5.40.0/ExtUtils/xsubpp" -typemap '/usr/share/perl5/5.40.0/ExtUtils/typemap' xs/HasAttributes.xs > xs/HasAttributes.xsc mv xs/HasAttributes.xsc xs/HasAttributes.c "/usr/bin/perl5.40.0" "/usr/share/perl5/5.40.0/ExtUtils/xsubpp" -typemap '/usr/share/perl5/5.40.0/ExtUtils/typemap' xs/HasMethods.xs > xs/HasMethods.xsc mv xs/HasMethods.xsc xs/HasMethods.c "/usr/bin/perl5.40.0" "/usr/share/perl5/5.40.0/ExtUtils/xsubpp" -typemap '/usr/share/perl5/5.40.0/ExtUtils/typemap' xs/Instance.xs > xs/Instance.xsc mv xs/Instance.xsc xs/Instance.c "/usr/bin/perl5.40.0" "/usr/share/perl5/5.40.0/ExtUtils/xsubpp" -typemap '/usr/share/perl5/5.40.0/ExtUtils/typemap' xs/Method.xs > xs/Method.xsc mv xs/Method.xsc xs/Method.c "/usr/bin/perl5.40.0" "/usr/share/perl5/5.40.0/ExtUtils/xsubpp" -typemap '/usr/share/perl5/5.40.0/ExtUtils/typemap' xs/Moose.xs > xs/Moose.xsc mv xs/Moose.xsc xs/Moose.c "/usr/bin/perl5.40.0" "/usr/share/perl5/5.40.0/ExtUtils/xsubpp" -typemap '/usr/share/perl5/5.40.0/ExtUtils/typemap' xs/MOP.xs > xs/MOP.xsc mv xs/MOP.xsc xs/MOP.c "/usr/bin/perl5.40.0" "/usr/share/perl5/5.40.0/ExtUtils/xsubpp" -typemap '/usr/share/perl5/5.40.0/ExtUtils/typemap' xs/Package.xs > xs/Package.xsc mv xs/Package.xsc xs/Package.c "/usr/bin/perl5.40.0" "/usr/share/perl5/5.40.0/ExtUtils/xsubpp" -typemap '/usr/share/perl5/5.40.0/ExtUtils/typemap' xs/ToInstance.xs > xs/ToInstance.xsc mv xs/ToInstance.xsc xs/ToInstance.c "/usr/bin/perl5.40.0" "/usr/share/perl5/5.40.0/ExtUtils/xsubpp" -typemap '/usr/share/perl5/5.40.0/ExtUtils/typemap' xs/Inlined.xs > xs/Inlined.xsc mv xs/Inlined.xsc xs/Inlined.c "/usr/bin/perl5.40.0" -MExtUtils::Command::MM -e 'cp_nonempty' -- Moose.bs blib/arch/auto/Moose/Moose.bs 644 x86_64-pld-linux-gcc -c -D_REENTRANT -D_GNU_SOURCE -fwrapv -fno-strict-aliasing -pipe -fstack-protector-strong -I/usr/local/include -D_LARGEFILE_SOURCE -D_FILE_OFFSET_BITS=64 -I. -O2 -fwrapv -pipe -Wformat -Werror=format-security -gdwarf-4 -fno-debug-types-section -fvar-tracking-assignments -g2 -Wp,-D_FORTIFY_SOURCE=2 -fstack-protector-strong --param=ssp-buffer-size=4 -Werror=trampolines -fPIC -march=x86-64 -mtune=generic -gdwarf-4 -fno-debug-types-section -fvar-tracking-assignments -g2 -DVERSION=\"2.2203\" -DXS_VERSION=\"2.2203\" -o xs/Class.o -fPIC "-I/usr/lib64/perl5/5.40.0/x86_64-pld-linux-thread-multi/CORE" xs/Class.c x86_64-pld-linux-gcc -c -D_REENTRANT -D_GNU_SOURCE -fwrapv -fno-strict-aliasing -pipe -fstack-protector-strong -I/usr/local/include -D_LARGEFILE_SOURCE -D_FILE_OFFSET_BITS=64 -I. -O2 -fwrapv -pipe -Wformat -Werror=format-security -gdwarf-4 -fno-debug-types-section -fvar-tracking-assignments -g2 -Wp,-D_FORTIFY_SOURCE=2 -fstack-protector-strong --param=ssp-buffer-size=4 -Werror=trampolines -fPIC -march=x86-64 -mtune=generic -gdwarf-4 -fno-debug-types-section -fvar-tracking-assignments -g2 -DVERSION=\"2.2203\" -DXS_VERSION=\"2.2203\" -o xs/Attribute.o -fPIC "-I/usr/lib64/perl5/5.40.0/x86_64-pld-linux-thread-multi/CORE" xs/Attribute.c x86_64-pld-linux-gcc -c -D_REENTRANT -D_GNU_SOURCE -fwrapv -fno-strict-aliasing -pipe -fstack-protector-strong -I/usr/local/include -D_LARGEFILE_SOURCE -D_FILE_OFFSET_BITS=64 -I. -O2 -fwrapv -pipe -Wformat -Werror=format-security -gdwarf-4 -fno-debug-types-section -fvar-tracking-assignments -g2 -Wp,-D_FORTIFY_SOURCE=2 -fstack-protector-strong --param=ssp-buffer-size=4 -Werror=trampolines -fPIC -march=x86-64 -mtune=generic -gdwarf-4 -fno-debug-types-section -fvar-tracking-assignments -g2 -DVERSION=\"2.2203\" -DXS_VERSION=\"2.2203\" -o xs/AttributeCore.o -fPIC "-I/usr/lib64/perl5/5.40.0/x86_64-pld-linux-thread-multi/CORE" xs/AttributeCore.c x86_64-pld-linux-gcc -c -D_REENTRANT -D_GNU_SOURCE -fwrapv -fno-strict-aliasing -pipe -fstack-protector-strong -I/usr/local/include -D_LARGEFILE_SOURCE -D_FILE_OFFSET_BITS=64 -I. -O2 -fwrapv -pipe -Wformat -Werror=format-security -gdwarf-4 -fno-debug-types-section -fvar-tracking-assignments -g2 -Wp,-D_FORTIFY_SOURCE=2 -fstack-protector-strong --param=ssp-buffer-size=4 -Werror=trampolines -fPIC -march=x86-64 -mtune=generic -gdwarf-4 -fno-debug-types-section -fvar-tracking-assignments -g2 -DVERSION=\"2.2203\" -DXS_VERSION=\"2.2203\" -o xs/Generated.o -fPIC "-I/usr/lib64/perl5/5.40.0/x86_64-pld-linux-thread-multi/CORE" xs/Generated.c x86_64-pld-linux-gcc -c -D_REENTRANT -D_GNU_SOURCE -fwrapv -fno-strict-aliasing -pipe -fstack-protector-strong -I/usr/local/include -D_LARGEFILE_SOURCE -D_FILE_OFFSET_BITS=64 -I. -O2 -fwrapv -pipe -Wformat -Werror=format-security -gdwarf-4 -fno-debug-types-section -fvar-tracking-assignments -g2 -Wp,-D_FORTIFY_SOURCE=2 -fstack-protector-strong --param=ssp-buffer-size=4 -Werror=trampolines -fPIC -march=x86-64 -mtune=generic -gdwarf-4 -fno-debug-types-section -fvar-tracking-assignments -g2 -DVERSION=\"2.2203\" -DXS_VERSION=\"2.2203\" -o xs/HasAttributes.o -fPIC "-I/usr/lib64/perl5/5.40.0/x86_64-pld-linux-thread-multi/CORE" xs/HasAttributes.c x86_64-pld-linux-gcc -c -D_REENTRANT -D_GNU_SOURCE -fwrapv -fno-strict-aliasing -pipe -fstack-protector-strong -I/usr/local/include -D_LARGEFILE_SOURCE -D_FILE_OFFSET_BITS=64 -I. -O2 -fwrapv -pipe -Wformat -Werror=format-security -gdwarf-4 -fno-debug-types-section -fvar-tracking-assignments -g2 -Wp,-D_FORTIFY_SOURCE=2 -fstack-protector-strong --param=ssp-buffer-size=4 -Werror=trampolines -fPIC -march=x86-64 -mtune=generic -gdwarf-4 -fno-debug-types-section -fvar-tracking-assignments -g2 -DVERSION=\"2.2203\" -DXS_VERSION=\"2.2203\" -o xs/Inlined.o -fPIC "-I/usr/lib64/perl5/5.40.0/x86_64-pld-linux-thread-multi/CORE" xs/Inlined.c x86_64-pld-linux-gcc -c -D_REENTRANT -D_GNU_SOURCE -fwrapv -fno-strict-aliasing -pipe -fstack-protector-strong -I/usr/local/include -D_LARGEFILE_SOURCE -D_FILE_OFFSET_BITS=64 -I. -O2 -fwrapv -pipe -Wformat -Werror=format-security -gdwarf-4 -fno-debug-types-section -fvar-tracking-assignments -g2 -Wp,-D_FORTIFY_SOURCE=2 -fstack-protector-strong --param=ssp-buffer-size=4 -Werror=trampolines -fPIC -march=x86-64 -mtune=generic -gdwarf-4 -fno-debug-types-section -fvar-tracking-assignments -g2 -DVERSION=\"2.2203\" -DXS_VERSION=\"2.2203\" -o xs/Package.o -fPIC "-I/usr/lib64/perl5/5.40.0/x86_64-pld-linux-thread-multi/CORE" xs/Package.c x86_64-pld-linux-gcc -c -D_REENTRANT -D_GNU_SOURCE -fwrapv -fno-strict-aliasing -pipe -fstack-protector-strong -I/usr/local/include -D_LARGEFILE_SOURCE -D_FILE_OFFSET_BITS=64 -I. -O2 -fwrapv -pipe -Wformat -Werror=format-security -gdwarf-4 -fno-debug-types-section -fvar-tracking-assignments -g2 -Wp,-D_FORTIFY_SOURCE=2 -fstack-protector-strong --param=ssp-buffer-size=4 -Werror=trampolines -fPIC -march=x86-64 -mtune=generic -gdwarf-4 -fno-debug-types-section -fvar-tracking-assignments -g2 -DVERSION=\"2.2203\" -DXS_VERSION=\"2.2203\" -o xs/MOP.o -fPIC "-I/usr/lib64/perl5/5.40.0/x86_64-pld-linux-thread-multi/CORE" xs/MOP.c x86_64-pld-linux-gcc -c -D_REENTRANT -D_GNU_SOURCE -fwrapv -fno-strict-aliasing -pipe -fstack-protector-strong -I/usr/local/include -D_LARGEFILE_SOURCE -D_FILE_OFFSET_BITS=64 -I. -O2 -fwrapv -pipe -Wformat -Werror=format-security -gdwarf-4 -fno-debug-types-section -fvar-tracking-assignments -g2 -Wp,-D_FORTIFY_SOURCE=2 -fstack-protector-strong --param=ssp-buffer-size=4 -Werror=trampolines -fPIC -march=x86-64 -mtune=generic -gdwarf-4 -fno-debug-types-section -fvar-tracking-assignments -g2 -DVERSION=\"2.2203\" -DXS_VERSION=\"2.2203\" -o mop.o -fPIC "-I/usr/lib64/perl5/5.40.0/x86_64-pld-linux-thread-multi/CORE" mop.c x86_64-pld-linux-gcc -c -D_REENTRANT -D_GNU_SOURCE -fwrapv -fno-strict-aliasing -pipe -fstack-protector-strong -I/usr/local/include -D_LARGEFILE_SOURCE -D_FILE_OFFSET_BITS=64 -I. -O2 -fwrapv -pipe -Wformat -Werror=format-security -gdwarf-4 -fno-debug-types-section -fvar-tracking-assignments -g2 -Wp,-D_FORTIFY_SOURCE=2 -fstack-protector-strong --param=ssp-buffer-size=4 -Werror=trampolines -fPIC -march=x86-64 -mtune=generic -gdwarf-4 -fno-debug-types-section -fvar-tracking-assignments -g2 -DVERSION=\"2.2203\" -DXS_VERSION=\"2.2203\" -o xs/Instance.o -fPIC "-I/usr/lib64/perl5/5.40.0/x86_64-pld-linux-thread-multi/CORE" xs/Instance.c x86_64-pld-linux-gcc -c -D_REENTRANT -D_GNU_SOURCE -fwrapv -fno-strict-aliasing -pipe -fstack-protector-strong -I/usr/local/include -D_LARGEFILE_SOURCE -D_FILE_OFFSET_BITS=64 -I. -O2 -fwrapv -pipe -Wformat -Werror=format-security -gdwarf-4 -fno-debug-types-section -fvar-tracking-assignments -g2 -Wp,-D_FORTIFY_SOURCE=2 -fstack-protector-strong --param=ssp-buffer-size=4 -Werror=trampolines -fPIC -march=x86-64 -mtune=generic -gdwarf-4 -fno-debug-types-section -fvar-tracking-assignments -g2 -DVERSION=\"2.2203\" -DXS_VERSION=\"2.2203\" -o xs/ToInstance.o -fPIC "-I/usr/lib64/perl5/5.40.0/x86_64-pld-linux-thread-multi/CORE" xs/ToInstance.c x86_64-pld-linux-gcc -c -D_REENTRANT -D_GNU_SOURCE -fwrapv -fno-strict-aliasing -pipe -fstack-protector-strong -I/usr/local/include -D_LARGEFILE_SOURCE -D_FILE_OFFSET_BITS=64 -I. -O2 -fwrapv -pipe -Wformat -Werror=format-security -gdwarf-4 -fno-debug-types-section -fvar-tracking-assignments -g2 -Wp,-D_FORTIFY_SOURCE=2 -fstack-protector-strong --param=ssp-buffer-size=4 -Werror=trampolines -fPIC -march=x86-64 -mtune=generic -gdwarf-4 -fno-debug-types-section -fvar-tracking-assignments -g2 -DVERSION=\"2.2203\" -DXS_VERSION=\"2.2203\" -o xs/Moose.o -fPIC "-I/usr/lib64/perl5/5.40.0/x86_64-pld-linux-thread-multi/CORE" xs/Moose.c x86_64-pld-linux-gcc -c -D_REENTRANT -D_GNU_SOURCE -fwrapv -fno-strict-aliasing -pipe -fstack-protector-strong -I/usr/local/include -D_LARGEFILE_SOURCE -D_FILE_OFFSET_BITS=64 -I. -O2 -fwrapv -pipe -Wformat -Werror=format-security -gdwarf-4 -fno-debug-types-section -fvar-tracking-assignments -g2 -Wp,-D_FORTIFY_SOURCE=2 -fstack-protector-strong --param=ssp-buffer-size=4 -Werror=trampolines -fPIC -march=x86-64 -mtune=generic -gdwarf-4 -fno-debug-types-section -fvar-tracking-assignments -g2 -DVERSION=\"2.2203\" -DXS_VERSION=\"2.2203\" -o xs/HasMethods.o -fPIC "-I/usr/lib64/perl5/5.40.0/x86_64-pld-linux-thread-multi/CORE" xs/HasMethods.c x86_64-pld-linux-gcc -c -D_REENTRANT -D_GNU_SOURCE -fwrapv -fno-strict-aliasing -pipe -fstack-protector-strong -I/usr/local/include -D_LARGEFILE_SOURCE -D_FILE_OFFSET_BITS=64 -I. -O2 -fwrapv -pipe -Wformat -Werror=format-security -gdwarf-4 -fno-debug-types-section -fvar-tracking-assignments -g2 -Wp,-D_FORTIFY_SOURCE=2 -fstack-protector-strong --param=ssp-buffer-size=4 -Werror=trampolines -fPIC -march=x86-64 -mtune=generic -gdwarf-4 -fno-debug-types-section -fvar-tracking-assignments -g2 -DVERSION=\"2.2203\" -DXS_VERSION=\"2.2203\" -o xs/Method.o -fPIC "-I/usr/lib64/perl5/5.40.0/x86_64-pld-linux-thread-multi/CORE" xs/Method.c rm -f blib/arch/auto/Moose/Moose.so x86_64-pld-linux-gcc -shared -Wl,--no-copy-dt-needed-entries -Wl,-z,relro -Wl,-z,combreloc -L/usr/local/lib -fstack-protector-strong xs/Attribute.o xs/AttributeCore.o xs/Class.o xs/Generated.o xs/HasAttributes.o xs/HasMethods.o xs/Inlined.o xs/Instance.o xs/Method.o xs/Moose.o xs/MOP.o xs/Package.o xs/ToInstance.o mop.o -o blib/arch/auto/Moose/Moose.so \ \ chmod 755 blib/arch/auto/Moose/Moose.so cp lib/Class/MOP/Overload.pm blib/lib/Class/MOP/Overload.pm cp lib/Class/MOP/Attribute.pm blib/lib/Class/MOP/Attribute.pm cp lib/Moose/Cookbook/Basics/Company_Subtypes.pod blib/lib/Moose/Cookbook/Basics/Company_Subtypes.pod cp lib/Class/MOP/Method.pm blib/lib/Class/MOP/Method.pm cp lib/Class/MOP/Package.pm blib/lib/Class/MOP/Package.pm cp lib/Class/MOP.pm blib/lib/Class/MOP.pm cp lib/Moose/Cookbook/Basics/Genome_OverloadingSubtypesAndCoercion.pod blib/lib/Moose/Cookbook/Basics/Genome_OverloadingSubtypesAndCoercion.pod cp lib/Class/MOP/Method/Meta.pm blib/lib/Class/MOP/Method/Meta.pm cp lib/Moose/Cookbook/Basics/BinaryTree_BuilderAndLazyBuild.pod blib/lib/Moose/Cookbook/Basics/BinaryTree_BuilderAndLazyBuild.pod cp lib/Moose/Cookbook/Basics/BankAccount_MethodModifiersAndSubclassing.pod blib/lib/Moose/Cookbook/Basics/BankAccount_MethodModifiersAndSubclassing.pod cp lib/Moose/Cookbook/Basics/DateTime_ExtendingNonMooseParent.pod blib/lib/Moose/Cookbook/Basics/DateTime_ExtendingNonMooseParent.pod cp lib/Class/MOP/Mixin/HasAttributes.pm blib/lib/Class/MOP/Mixin/HasAttributes.pm cp lib/Class/MOP/Deprecated.pm blib/lib/Class/MOP/Deprecated.pm cp lib/Class/MOP/Method/Wrapped.pm blib/lib/Class/MOP/Method/Wrapped.pm cp lib/Moose/Cookbook/Basics/BinaryTree_AttributeFeatures.pod blib/lib/Moose/Cookbook/Basics/BinaryTree_AttributeFeatures.pod cp lib/Class/MOP/Method/Accessor.pm blib/lib/Class/MOP/Method/Accessor.pm cp lib/Class/MOP/Module.pm blib/lib/Class/MOP/Module.pm cp lib/Moose/Cookbook.pod blib/lib/Moose/Cookbook.pod cp lib/Class/MOP/Mixin.pm blib/lib/Class/MOP/Mixin.pm cp lib/Class/MOP/Mixin/AttributeCore.pm blib/lib/Class/MOP/Mixin/AttributeCore.pm cp lib/Class/MOP/Mixin/HasOverloads.pm blib/lib/Class/MOP/Mixin/HasOverloads.pm cp lib/Moose/Conflicts.pm blib/lib/Moose/Conflicts.pm cp lib/Class/MOP/Method/Constructor.pm blib/lib/Class/MOP/Method/Constructor.pm cp lib/Class/MOP/Mixin/HasMethods.pm blib/lib/Class/MOP/Mixin/HasMethods.pm cp lib/Class/MOP/Method/Inlined.pm blib/lib/Class/MOP/Method/Inlined.pm cp lib/Class/MOP/Class/Immutable/Trait.pm blib/lib/Class/MOP/Class/Immutable/Trait.pm cp lib/Class/MOP/Method/Generated.pm blib/lib/Class/MOP/Method/Generated.pm cp lib/Class/MOP/Object.pm blib/lib/Class/MOP/Object.pm cp lib/Class/MOP/Instance.pm blib/lib/Class/MOP/Instance.pm cp lib/Moose.pm blib/lib/Moose.pm cp lib/Moose/Cookbook/Basics/Document_AugmentAndInner.pod blib/lib/Moose/Cookbook/Basics/Document_AugmentAndInner.pod cp lib/Class/MOP/MiniTrait.pm blib/lib/Class/MOP/MiniTrait.pm cp lib/Class/MOP/Class.pm blib/lib/Class/MOP/Class.pm cp lib/Moose/Cookbook/Legacy/Labeled_AttributeMetaclass.pod blib/lib/Moose/Cookbook/Legacy/Labeled_AttributeMetaclass.pod cp lib/Moose/Cookbook/Extending/Mooseish_MooseSugar.pod blib/lib/Moose/Cookbook/Extending/Mooseish_MooseSugar.pod cp lib/Moose/Cookbook/Roles/Comparable_CodeReuse.pod blib/lib/Moose/Cookbook/Roles/Comparable_CodeReuse.pod cp lib/Moose/Exception/AccessorMustReadWrite.pm blib/lib/Moose/Exception/AccessorMustReadWrite.pm cp lib/Moose/Deprecated.pm blib/lib/Moose/Deprecated.pm cp lib/Moose/Cookbook/Roles/Restartable_AdvancedComposition.pod blib/lib/Moose/Cookbook/Roles/Restartable_AdvancedComposition.pod cp lib/Moose/Cookbook/Style.pod blib/lib/Moose/Cookbook/Style.pod cp lib/Moose/Cookbook/Meta/PrivateOrPublic_MethodMetaclass.pod blib/lib/Moose/Cookbook/Meta/PrivateOrPublic_MethodMetaclass.pod cp lib/Moose/Cookbook/Legacy/Debugging_BaseClassReplacement.pod blib/lib/Moose/Cookbook/Legacy/Debugging_BaseClassReplacement.pod cp lib/Moose/Cookbook/Basics/Point_AttributesAndSubclassing.pod blib/lib/Moose/Cookbook/Basics/Point_AttributesAndSubclassing.pod cp lib/Moose/Cookbook/Roles/ApplicationToInstance.pod blib/lib/Moose/Cookbook/Roles/ApplicationToInstance.pod cp lib/Moose/Cookbook/Extending/Debugging_BaseClassRole.pod blib/lib/Moose/Cookbook/Extending/Debugging_BaseClassRole.pod cp lib/Moose/Cookbook/Basics/HTTP_SubtypesAndCoercion.pod blib/lib/Moose/Cookbook/Basics/HTTP_SubtypesAndCoercion.pod cp lib/Moose/Cookbook/Meta/Labeled_AttributeTrait.pod blib/lib/Moose/Cookbook/Meta/Labeled_AttributeTrait.pod cp lib/Moose/Cookbook/Meta/GlobRef_InstanceMetaclass.pod blib/lib/Moose/Cookbook/Meta/GlobRef_InstanceMetaclass.pod cp lib/Moose/Cookbook/Basics/Immutable.pod blib/lib/Moose/Cookbook/Basics/Immutable.pod cp lib/Moose/Exception.pm blib/lib/Moose/Exception.pm cp lib/Moose/Cookbook/Snack/Keywords.pod blib/lib/Moose/Cookbook/Snack/Keywords.pod cp lib/Moose/Cookbook/Meta/Table_MetaclassTrait.pod blib/lib/Moose/Cookbook/Meta/Table_MetaclassTrait.pod cp lib/Moose/Cookbook/Legacy/Table_ClassMetaclass.pod blib/lib/Moose/Cookbook/Legacy/Table_ClassMetaclass.pod cp lib/Moose/Cookbook/Snack/Types.pod blib/lib/Moose/Cookbook/Snack/Types.pod cp lib/Moose/Cookbook/Basics/Person_BUILDARGSAndBUILD.pod blib/lib/Moose/Cookbook/Basics/Person_BUILDARGSAndBUILD.pod cp lib/Moose/Cookbook/Extending/ExtensionOverview.pod blib/lib/Moose/Cookbook/Extending/ExtensionOverview.pod cp lib/Moose/Cookbook/Meta/WhyMeta.pod blib/lib/Moose/Cookbook/Meta/WhyMeta.pod cp lib/Moose/Exception/BadOptionFormat.pm blib/lib/Moose/Exception/BadOptionFormat.pm cp lib/Moose/Exception/AttributeExtensionIsNotSupportedInRoles.pm blib/lib/Moose/Exception/AttributeExtensionIsNotSupportedInRoles.pm cp lib/Moose/Exception/AttributeNamesDoNotMatch.pm blib/lib/Moose/Exception/AttributeNamesDoNotMatch.pm cp lib/Moose/Exception/AttributeConflictInRoles.pm blib/lib/Moose/Exception/AttributeConflictInRoles.pm cp lib/Moose/Exception/BuilderMethodNotSupportedForInlineAttribute.pm blib/lib/Moose/Exception/BuilderMethodNotSupportedForInlineAttribute.pm cp lib/Moose/Exception/BuilderMethodNotSupportedForAttribute.pm blib/lib/Moose/Exception/BuilderMethodNotSupportedForAttribute.pm cp lib/Moose/Exception/BuilderDoesNotExist.pm blib/lib/Moose/Exception/BuilderDoesNotExist.pm cp lib/Moose/Exception/AttributeValueIsNotAnObject.pm blib/lib/Moose/Exception/AttributeValueIsNotAnObject.pm cp lib/Moose/Exception/AttributeValueIsNotDefined.pm blib/lib/Moose/Exception/AttributeValueIsNotDefined.pm cp lib/Moose/Exception/CallingMethodOnAnImmutableInstance.pm blib/lib/Moose/Exception/CallingMethodOnAnImmutableInstance.pm cp lib/Moose/Exception/ApplyTakesABlessedInstance.pm blib/lib/Moose/Exception/ApplyTakesABlessedInstance.pm cp lib/Moose/Exception/BothBuilderAndDefaultAreNotAllowed.pm blib/lib/Moose/Exception/BothBuilderAndDefaultAreNotAllowed.pm cp lib/Moose/Exception/AddParameterizableTypeTakesParameterizableType.pm blib/lib/Moose/Exception/AddParameterizableTypeTakesParameterizableType.pm cp lib/Moose/Exception/AttributeMustBeAnClassMOPMixinAttributeCoreOrSubclass.pm blib/lib/Moose/Exception/AttributeMustBeAnClassMOPMixinAttributeCoreOrSubclass.pm cp lib/Moose/Exception/BuilderMustBeAMethodName.pm blib/lib/Moose/Exception/BuilderMustBeAMethodName.pm cp lib/Moose/Exception/AttributeIsRequired.pm blib/lib/Moose/Exception/AttributeIsRequired.pm cp lib/Moose/Exception/AttributeConflictInSummation.pm blib/lib/Moose/Exception/AttributeConflictInSummation.pm cp lib/Moose/Exception/AttachToClassNeedsAClassMOPClassInstanceOrASubclass.pm blib/lib/Moose/Exception/AttachToClassNeedsAClassMOPClassInstanceOrASubclass.pm cp lib/Moose/Exception/AddRoleToARoleTakesAMooseMetaRole.pm blib/lib/Moose/Exception/AddRoleToARoleTakesAMooseMetaRole.pm cp lib/Moose/Exception/AutoDeRefNeedsArrayRefOrHashRef.pm blib/lib/Moose/Exception/AutoDeRefNeedsArrayRefOrHashRef.pm cp lib/Moose/Exception/AddRoleTakesAMooseMetaRoleInstance.pm blib/lib/Moose/Exception/AddRoleTakesAMooseMetaRoleInstance.pm cp lib/Moose/Exception/CanReblessOnlyIntoASubclass.pm blib/lib/Moose/Exception/CanReblessOnlyIntoASubclass.pm cp lib/Moose/Exception/CanReblessOnlyIntoASuperclass.pm blib/lib/Moose/Exception/CanReblessOnlyIntoASuperclass.pm cp lib/Moose/Exception/CannotAssignValueToReadOnlyAccessor.pm blib/lib/Moose/Exception/CannotAssignValueToReadOnlyAccessor.pm cp lib/Moose/Exception/CannotCoerceAWeakRef.pm blib/lib/Moose/Exception/CannotCoerceAWeakRef.pm cp lib/Moose/Exception/CannotCreateMethodAliasLocalMethodIsPresentInClass.pm blib/lib/Moose/Exception/CannotCreateMethodAliasLocalMethodIsPresentInClass.pm cp lib/Moose/Exception/CannotAddAdditionalTypeCoercionsToUnion.pm blib/lib/Moose/Exception/CannotAddAdditionalTypeCoercionsToUnion.pm cp lib/Moose/Exception/CannotCallAnAbstractBaseMethod.pm blib/lib/Moose/Exception/CannotCallAnAbstractBaseMethod.pm cp lib/Moose/Exception/CannotAutoDereferenceTypeConstraint.pm blib/lib/Moose/Exception/CannotAutoDereferenceTypeConstraint.pm cp lib/Moose/Exception/CannotAugmentNoSuperMethod.pm blib/lib/Moose/Exception/CannotAugmentNoSuperMethod.pm cp lib/Moose/Exception/CannotCreateMethodAliasLocalMethodIsPresent.pm blib/lib/Moose/Exception/CannotCreateMethodAliasLocalMethodIsPresent.pm cp lib/Moose/Exception/CannotCallAnAbstractMethod.pm blib/lib/Moose/Exception/CannotCallAnAbstractMethod.pm cp lib/Moose/Exception/CanExtendOnlyClasses.pm blib/lib/Moose/Exception/CanExtendOnlyClasses.pm cp lib/Moose/Exception/CannotCoerceAttributeWhichHasNoCoercion.pm blib/lib/Moose/Exception/CannotCoerceAttributeWhichHasNoCoercion.pm cp lib/Moose/Exception/CannotApplyBaseClassRolesToRole.pm blib/lib/Moose/Exception/CannotApplyBaseClassRolesToRole.pm cp lib/Moose/Exception/CanOnlyConsumeRole.pm blib/lib/Moose/Exception/CanOnlyConsumeRole.pm cp lib/Moose/Exception/CannotCalculateNativeType.pm blib/lib/Moose/Exception/CannotCalculateNativeType.pm cp lib/Moose/Exception/CallingReadOnlyMethodOnAnImmutableInstance.pm blib/lib/Moose/Exception/CallingReadOnlyMethodOnAnImmutableInstance.pm cp lib/Moose/Exception/CannotAutoDerefWithoutIsa.pm blib/lib/Moose/Exception/CannotAutoDerefWithoutIsa.pm cp lib/Moose/Exception/CannotAddAsAnAttributeToARole.pm blib/lib/Moose/Exception/CannotAddAsAnAttributeToARole.pm cp lib/Moose/Exception/CannotCreateHigherOrderTypeWithoutATypeParameter.pm blib/lib/Moose/Exception/CannotCreateHigherOrderTypeWithoutATypeParameter.pm cp lib/Moose/Exception/CannotAugmentIfLocalMethodPresent.pm blib/lib/Moose/Exception/CannotAugmentIfLocalMethodPresent.pm cp lib/Moose/Exception/CanOnlyWrapBlessedCode.pm blib/lib/Moose/Exception/CanOnlyWrapBlessedCode.pm cp lib/Moose/Exception/CannotMakeMetaclassCompatible.pm blib/lib/Moose/Exception/CannotMakeMetaclassCompatible.pm cp lib/Moose/Exception/CannotOverrideNoSuperMethod.pm blib/lib/Moose/Exception/CannotOverrideNoSuperMethod.pm cp lib/Moose/Exception/ClassDoesNotHaveInitMeta.pm blib/lib/Moose/Exception/ClassDoesNotHaveInitMeta.pm cp lib/Moose/Exception/CannotFindDelegateMetaclass.pm blib/lib/Moose/Exception/CannotFindDelegateMetaclass.pm cp lib/Moose/Exception/CloneObjectExpectsAnInstanceOfMetaclass.pm blib/lib/Moose/Exception/CloneObjectExpectsAnInstanceOfMetaclass.pm cp lib/Moose/Exception/CannotOverrideALocalMethod.pm blib/lib/Moose/Exception/CannotOverrideALocalMethod.pm cp lib/Moose/Exception/ClassDoesTheExcludedRole.pm blib/lib/Moose/Exception/ClassDoesTheExcludedRole.pm cp lib/Moose/Exception/ClassNamesDoNotMatch.pm blib/lib/Moose/Exception/ClassNamesDoNotMatch.pm cp lib/Moose/Exception/CannotFindTypeGivenToMatchOnType.pm blib/lib/Moose/Exception/CannotFindTypeGivenToMatchOnType.pm cp lib/Moose/Exception/CannotRegisterUnnamedTypeConstraint.pm blib/lib/Moose/Exception/CannotRegisterUnnamedTypeConstraint.pm cp lib/Moose/Exception/CannotOverrideLocalMethodIsPresent.pm blib/lib/Moose/Exception/CannotOverrideLocalMethodIsPresent.pm cp lib/Moose/Exception/CircularReferenceInAlso.pm blib/lib/Moose/Exception/CircularReferenceInAlso.pm cp lib/Moose/Exception/CannotDelegateLocalMethodIsPresent.pm blib/lib/Moose/Exception/CannotDelegateLocalMethodIsPresent.pm cp lib/Moose/Exception/CodeBlockMustBeACodeRef.pm blib/lib/Moose/Exception/CodeBlockMustBeACodeRef.pm cp lib/Moose/Exception/CannotFindType.pm blib/lib/Moose/Exception/CannotFindType.pm cp lib/Moose/Exception/CannotInlineTypeConstraintCheck.pm blib/lib/Moose/Exception/CannotInlineTypeConstraintCheck.pm cp lib/Moose/Exception/CannotLocatePackageInINC.pm blib/lib/Moose/Exception/CannotLocatePackageInINC.pm cp lib/Moose/Exception/CannotUseLazyBuildAndDefaultSimultaneously.pm blib/lib/Moose/Exception/CannotUseLazyBuildAndDefaultSimultaneously.pm cp lib/Moose/Exception/CannotOverrideBodyOfMetaMethods.pm blib/lib/Moose/Exception/CannotOverrideBodyOfMetaMethods.pm cp lib/Moose/Exception/CannotFixMetaclassCompatibility.pm blib/lib/Moose/Exception/CannotFixMetaclassCompatibility.pm cp lib/Moose/Exception/CannotDelegateWithoutIsa.pm blib/lib/Moose/Exception/CannotDelegateWithoutIsa.pm cp lib/Moose/Exception/CannotInitializeMooseMetaRoleComposite.pm blib/lib/Moose/Exception/CannotInitializeMooseMetaRoleComposite.pm cp lib/Moose/Exception/CannotGenerateInlineConstraint.pm blib/lib/Moose/Exception/CannotGenerateInlineConstraint.pm cp lib/Moose/Exception/CouldNotFindTypeConstraintToCoerceFrom.pm blib/lib/Moose/Exception/CouldNotFindTypeConstraintToCoerceFrom.pm cp lib/Moose/Exception/CreateTakesHashRefOfMethods.pm blib/lib/Moose/Exception/CreateTakesHashRefOfMethods.pm cp lib/Moose/Exception/CreateMOPClassTakesArrayRefOfAttributes.pm blib/lib/Moose/Exception/CreateMOPClassTakesArrayRefOfAttributes.pm cp lib/Moose/Exception/CreateTakesArrayRefOfRoles.pm blib/lib/Moose/Exception/CreateTakesArrayRefOfRoles.pm cp lib/Moose/Exception/ConflictDetectedInCheckRoleExclusionsInToClass.pm blib/lib/Moose/Exception/ConflictDetectedInCheckRoleExclusionsInToClass.pm cp lib/Moose/Exception/ConstructClassInstanceTakesPackageName.pm blib/lib/Moose/Exception/ConstructClassInstanceTakesPackageName.pm cp lib/Moose/Exception/CoercionNeedsTypeConstraint.pm blib/lib/Moose/Exception/CoercionNeedsTypeConstraint.pm cp lib/Moose/Exception/CoercingWithoutCoercions.pm blib/lib/Moose/Exception/CoercingWithoutCoercions.pm cp lib/Moose/Exception/CouldNotCreateMethod.pm blib/lib/Moose/Exception/CouldNotCreateMethod.pm cp lib/Moose/Exception/CreateMOPClassTakesArrayRefOfSuperclasses.pm blib/lib/Moose/Exception/CreateMOPClassTakesArrayRefOfSuperclasses.pm cp lib/Moose/Exception/ConflictDetectedInCheckRoleExclusions.pm blib/lib/Moose/Exception/ConflictDetectedInCheckRoleExclusions.pm cp lib/Moose/Exception/CoercionAlreadyExists.pm blib/lib/Moose/Exception/CoercionAlreadyExists.pm cp lib/Moose/Exception/CreateMOPClassTakesHashRefOfMethods.pm blib/lib/Moose/Exception/CreateMOPClassTakesHashRefOfMethods.pm cp lib/Moose/Exception/CreateTakesHashRefOfAttributes.pm blib/lib/Moose/Exception/CreateTakesHashRefOfAttributes.pm cp lib/Moose/Exception/CouldNotEvalDestructor.pm blib/lib/Moose/Exception/CouldNotEvalDestructor.pm cp lib/Moose/Exception/CouldNotCreateWriter.pm blib/lib/Moose/Exception/CouldNotCreateWriter.pm cp lib/Moose/Exception/CouldNotLocateTypeConstraintForUnion.pm blib/lib/Moose/Exception/CouldNotLocateTypeConstraintForUnion.pm cp lib/Moose/Exception/CouldNotGenerateInlineAttributeMethod.pm blib/lib/Moose/Exception/CouldNotGenerateInlineAttributeMethod.pm cp lib/Moose/Exception/DelegationToAClassWhichIsNotLoaded.pm blib/lib/Moose/Exception/DelegationToAClassWhichIsNotLoaded.pm cp lib/Moose/Exception/CouldNotEvalConstructor.pm blib/lib/Moose/Exception/CouldNotEvalConstructor.pm cp lib/Moose/Exception/DefaultToMatchOnTypeMustBeCodeRef.pm blib/lib/Moose/Exception/DefaultToMatchOnTypeMustBeCodeRef.pm cp lib/Moose/Exception/CouldNotParseType.pm blib/lib/Moose/Exception/CouldNotParseType.pm cp lib/Moose/Exception/DoesRequiresRoleName.pm blib/lib/Moose/Exception/DoesRequiresRoleName.pm cp lib/Moose/Exception/InvalidArgumentToMethod.pm blib/lib/Moose/Exception/InvalidArgumentToMethod.pm cp lib/Moose/Exception/InvalidNameForType.pm blib/lib/Moose/Exception/InvalidNameForType.pm cp lib/Moose/Exception/InvalidRoleApplication.pm blib/lib/Moose/Exception/InvalidRoleApplication.pm cp lib/Moose/Exception/InstanceMustBeABlessedReference.pm blib/lib/Moose/Exception/InstanceMustBeABlessedReference.pm cp lib/Moose/Exception/InvalidArgPassedToMooseUtilMetaRole.pm blib/lib/Moose/Exception/InvalidArgPassedToMooseUtilMetaRole.pm cp lib/Moose/Exception/InvalidBaseTypeGivenToCreateParameterizedTypeConstraint.pm blib/lib/Moose/Exception/InvalidBaseTypeGivenToCreateParameterizedTypeConstraint.pm cp lib/Moose/Exception/InvalidHandleValue.pm blib/lib/Moose/Exception/InvalidHandleValue.pm cp lib/Moose/Exception/InstanceBlessedIntoWrongClass.pm blib/lib/Moose/Exception/InstanceBlessedIntoWrongClass.pm cp lib/Moose/Exception/ExtendsMissingArgs.pm blib/lib/Moose/Exception/ExtendsMissingArgs.pm cp lib/Moose/Exception/InvalidOverloadOperator.pm blib/lib/Moose/Exception/InvalidOverloadOperator.pm cp lib/Moose/Exception/EnumCalledWithAnArrayRefAndAdditionalArgs.pm blib/lib/Moose/Exception/EnumCalledWithAnArrayRefAndAdditionalArgs.pm cp lib/Moose/Exception/InvalidHasProvidedInARole.pm blib/lib/Moose/Exception/InvalidHasProvidedInARole.pm cp lib/Moose/Exception/IllegalMethodTypeToAddMethodModifier.pm blib/lib/Moose/Exception/IllegalMethodTypeToAddMethodModifier.pm cp lib/Moose/Exception/IllegalInheritedOptions.pm blib/lib/Moose/Exception/IllegalInheritedOptions.pm cp lib/Moose/Exception/InitMetaRequiresClass.pm blib/lib/Moose/Exception/InitMetaRequiresClass.pm cp lib/Moose/Exception/HandlesMustBeAHashRef.pm blib/lib/Moose/Exception/HandlesMustBeAHashRef.pm cp lib/Moose/Exception/InvalidArgumentsToTraitAliases.pm blib/lib/Moose/Exception/InvalidArgumentsToTraitAliases.pm cp lib/Moose/Exception/InitializeTakesUnBlessedPackageName.pm blib/lib/Moose/Exception/InitializeTakesUnBlessedPackageName.pm cp lib/Moose/Exception/EnumValuesMustBeString.pm blib/lib/Moose/Exception/EnumValuesMustBeString.pm cp lib/Moose/Exception/DelegationToATypeWhichIsNotAClass.pm blib/lib/Moose/Exception/DelegationToATypeWhichIsNotAClass.pm cp lib/Moose/Exception/DelegationToARoleWhichIsNotLoaded.pm blib/lib/Moose/Exception/DelegationToARoleWhichIsNotLoaded.pm cp lib/Moose/Exception/IncompatibleMetaclassOfSuperclass.pm blib/lib/Moose/Exception/IncompatibleMetaclassOfSuperclass.pm cp lib/Moose/Exception/LazyAttributeNeedsADefault.pm blib/lib/Moose/Exception/LazyAttributeNeedsADefault.pm cp lib/Moose/Exception/MethodNameConflictInRoles.pm blib/lib/Moose/Exception/MethodNameConflictInRoles.pm cp lib/Moose/Exception/MetaclassNotLoaded.pm blib/lib/Moose/Exception/MetaclassNotLoaded.pm cp lib/Moose/Exception/MOPAttributeNewNeedsAttributeName.pm blib/lib/Moose/Exception/MOPAttributeNewNeedsAttributeName.pm cp lib/Moose/Exception/MessageParameterMustBeCodeRef.pm blib/lib/Moose/Exception/MessageParameterMustBeCodeRef.pm cp lib/Moose/Exception/MetaclassMustBeASubclassOfMooseMetaClass.pm blib/lib/Moose/Exception/MetaclassMustBeASubclassOfMooseMetaClass.pm cp lib/Moose/Exception/MethodExpectsFewerArgs.pm blib/lib/Moose/Exception/MethodExpectsFewerArgs.pm cp lib/Moose/Exception/IsaDoesNotDoTheRole.pm blib/lib/Moose/Exception/IsaDoesNotDoTheRole.pm cp lib/Moose/Exception/MetaclassMustBeASubclassOfMooseMetaRole.pm blib/lib/Moose/Exception/MetaclassMustBeASubclassOfMooseMetaRole.pm cp lib/Moose/Exception/MetaclassIsNotASubclassOfGivenMetaclass.pm blib/lib/Moose/Exception/MetaclassIsNotASubclassOfGivenMetaclass.pm cp lib/Moose/Exception/MethodModifierNeedsMethodName.pm blib/lib/Moose/Exception/MethodModifierNeedsMethodName.pm cp lib/Moose/Exception/IsaLacksDoesMethod.pm blib/lib/Moose/Exception/IsaLacksDoesMethod.pm cp lib/Moose/Exception/InvalidValueForIs.pm blib/lib/Moose/Exception/InvalidValueForIs.pm cp lib/Moose/Exception/MetaclassTypeIncompatible.pm blib/lib/Moose/Exception/MetaclassTypeIncompatible.pm cp lib/Moose/Exception/MetaclassIsAClassNotASubclassOfGivenMetaclass.pm blib/lib/Moose/Exception/MetaclassIsAClassNotASubclassOfGivenMetaclass.pm cp lib/Moose/Exception/MatchActionMustBeACodeRef.pm blib/lib/Moose/Exception/MatchActionMustBeACodeRef.pm cp lib/Moose/Exception/MetaclassIsARoleNotASubclassOfGivenMetaclass.pm blib/lib/Moose/Exception/MetaclassIsARoleNotASubclassOfGivenMetaclass.pm cp lib/Moose/Exception/MethodExpectsMoreArgs.pm blib/lib/Moose/Exception/MethodExpectsMoreArgs.pm cp lib/Moose/Exception/InvalidTypeConstraint.pm blib/lib/Moose/Exception/InvalidTypeConstraint.pm cp lib/Moose/Exception/MethodExpectedAMetaclassObject.pm blib/lib/Moose/Exception/MethodExpectedAMetaclassObject.pm cp lib/Moose/Exception/MetaclassMustBeDerivedFromClassMOPClass.pm blib/lib/Moose/Exception/MetaclassMustBeDerivedFromClassMOPClass.pm cp lib/Moose/Exception/Legacy.pm blib/lib/Moose/Exception/Legacy.pm cp lib/Moose/Exception/InvalidTypeGivenToCreateParameterizedTypeConstraint.pm blib/lib/Moose/Exception/InvalidTypeGivenToCreateParameterizedTypeConstraint.pm cp lib/Moose/Exception/MustPassEvenNumberOfArguments.pm blib/lib/Moose/Exception/MustPassEvenNumberOfArguments.pm cp lib/Moose/Exception/MustDefineAMethodName.pm blib/lib/Moose/Exception/MustDefineAMethodName.pm cp lib/Moose/Exception/MustPassAHashOfOptions.pm blib/lib/Moose/Exception/MustPassAHashOfOptions.pm cp lib/Moose/Exception/MustSupplyADelegateToMethod.pm blib/lib/Moose/Exception/MustSupplyADelegateToMethod.pm cp lib/Moose/Exception/MustPassAPackageNameOrAnExistingClassMOPPackageInstance.pm blib/lib/Moose/Exception/MustPassAPackageNameOrAnExistingClassMOPPackageInstance.pm cp lib/Moose/Exception/MethodNameNotFoundInInheritanceHierarchy.pm blib/lib/Moose/Exception/MethodNameNotFoundInInheritanceHierarchy.pm cp lib/Moose/Exception/MustSupplyArrayRefAsCurriedArguments.pm blib/lib/Moose/Exception/MustSupplyArrayRefAsCurriedArguments.pm cp lib/Moose/Exception/MustPassEvenNumberOfAttributeOptions.pm blib/lib/Moose/Exception/MustPassEvenNumberOfAttributeOptions.pm cp lib/Moose/Exception/MustSupplyAMooseMetaAttributeInstance.pm blib/lib/Moose/Exception/MustSupplyAMooseMetaAttributeInstance.pm cp lib/Moose/Exception/MustDefineAnOverloadOperator.pm blib/lib/Moose/Exception/MustDefineAnOverloadOperator.pm cp lib/Moose/Exception/MustSupplyAMetaclass.pm blib/lib/Moose/Exception/MustSupplyAMetaclass.pm cp lib/Moose/Exception/MustSpecifyAtleastOneRoleToApplicant.pm blib/lib/Moose/Exception/MustSpecifyAtleastOneRoleToApplicant.pm cp lib/Moose/Exception/MethodNameNotGiven.pm blib/lib/Moose/Exception/MethodNameNotGiven.pm cp lib/Moose/Exception/MustProvideANameForTheAttribute.pm blib/lib/Moose/Exception/MustProvideANameForTheAttribute.pm cp lib/Moose/Exception/MustSupplyAClassMOPAttributeInstance.pm blib/lib/Moose/Exception/MustSupplyAClassMOPAttributeInstance.pm cp lib/Moose/Exception/MustHaveAtLeastOneValueToEnumerate.pm blib/lib/Moose/Exception/MustHaveAtLeastOneValueToEnumerate.pm cp lib/Moose/Exception/MustSupplyAnAttributeToConstructWith.pm blib/lib/Moose/Exception/MustSupplyAnAttributeToConstructWith.pm cp lib/Moose/Exception/MustSpecifyAtleastOneRole.pm blib/lib/Moose/Exception/MustSpecifyAtleastOneRole.pm cp lib/Moose/Exception/MustDefineAnAttributeName.pm blib/lib/Moose/Exception/MustDefineAnAttributeName.pm cp lib/Moose/Exception/MustPassAMooseMetaRoleInstanceOrSubclass.pm blib/lib/Moose/Exception/MustPassAMooseMetaRoleInstanceOrSubclass.pm cp lib/Moose/Exception/MustSupplyAnAccessorTypeToConstructWith.pm blib/lib/Moose/Exception/MustSupplyAnAccessorTypeToConstructWith.pm cp lib/Moose/Exception/MustSpecifyAtleastOneMethod.pm blib/lib/Moose/Exception/MustSpecifyAtleastOneMethod.pm cp lib/Moose/Exception/NeitherRoleNorRoleNameIsGiven.pm blib/lib/Moose/Exception/NeitherRoleNorRoleNameIsGiven.pm cp lib/Moose/Exception/OverloadRequiresAnOperator.pm blib/lib/Moose/Exception/OverloadRequiresAnOperator.pm cp lib/Moose/Exception/MustSupplyPackageNameAndName.pm blib/lib/Moose/Exception/MustSupplyPackageNameAndName.pm cp lib/Moose/Exception/NoImmutableTraitSpecifiedForClass.pm blib/lib/Moose/Exception/NoImmutableTraitSpecifiedForClass.pm cp lib/Moose/Exception/OperatorIsRequired.pm blib/lib/Moose/Exception/OperatorIsRequired.pm cp lib/Moose/Exception/OverloadRequiresAMethodNameOrCoderef.pm blib/lib/Moose/Exception/OverloadRequiresAMethodNameOrCoderef.pm cp lib/Moose/Exception/NeitherAttributeNorAttributeNameIsGiven.pm blib/lib/Moose/Exception/NeitherAttributeNorAttributeNameIsGiven.pm cp lib/Moose/Exception/OverloadRequiresAMetaOverload.pm blib/lib/Moose/Exception/OverloadRequiresAMetaOverload.pm cp lib/Moose/Exception/OverloadConflictInSummation.pm blib/lib/Moose/Exception/OverloadConflictInSummation.pm cp lib/Moose/Exception/NoCasesMatched.pm blib/lib/Moose/Exception/NoCasesMatched.pm cp lib/Moose/Exception/OverloadRequiresAMetaMethod.pm blib/lib/Moose/Exception/OverloadRequiresAMetaMethod.pm cp lib/Moose/Exception/OnlyInstancesCanBeCloned.pm blib/lib/Moose/Exception/OnlyInstancesCanBeCloned.pm cp lib/Moose/Exception/NoConstraintCheckForTypeConstraint.pm blib/lib/Moose/Exception/NoConstraintCheckForTypeConstraint.pm cp lib/Moose/Exception/OverloadRequiresAMetaClass.pm blib/lib/Moose/Exception/OverloadRequiresAMetaClass.pm cp lib/Moose/Exception/NoParentGivenToSubtype.pm blib/lib/Moose/Exception/NoParentGivenToSubtype.pm cp lib/Moose/Exception/OverloadRequiresNamesForCoderef.pm blib/lib/Moose/Exception/OverloadRequiresNamesForCoderef.pm cp lib/Moose/Exception/NoAttributeFoundInSuperClass.pm blib/lib/Moose/Exception/NoAttributeFoundInSuperClass.pm cp lib/Moose/Exception/NoDestructorClassSpecified.pm blib/lib/Moose/Exception/NoDestructorClassSpecified.pm cp lib/Moose/Exception/NoBodyToInitializeInAnAbstractBaseClass.pm blib/lib/Moose/Exception/NoBodyToInitializeInAnAbstractBaseClass.pm cp lib/Moose/Exception/NeitherTypeNorTypeNameIsGiven.pm blib/lib/Moose/Exception/NeitherTypeNorTypeNameIsGiven.pm cp lib/Moose/Exception/OverrideConflictInComposition.pm blib/lib/Moose/Exception/OverrideConflictInComposition.pm cp lib/Moose/Exception/NeitherClassNorClassNameIsGiven.pm blib/lib/Moose/Exception/NeitherClassNorClassNameIsGiven.pm cp lib/Moose/Exception/NeedsTypeConstraintUnionForTypeCoercionUnion.pm blib/lib/Moose/Exception/NeedsTypeConstraintUnionForTypeCoercionUnion.pm cp lib/Moose/Exception/RoleExclusionConflict.pm blib/lib/Moose/Exception/RoleExclusionConflict.pm cp lib/Moose/Exception/RequiredMethodsImportedByClass.pm blib/lib/Moose/Exception/RequiredMethodsImportedByClass.pm cp lib/Moose/Exception/Role/RoleForCreateMOPClass.pm blib/lib/Moose/Exception/Role/RoleForCreateMOPClass.pm cp lib/Moose/Exception/Role/Attribute.pm blib/lib/Moose/Exception/Role/Attribute.pm cp lib/Moose/Exception/RequiredMethodsNotImplementedByClass.pm blib/lib/Moose/Exception/RequiredMethodsNotImplementedByClass.pm cp lib/Moose/Exception/OverrideConflictInSummation.pm blib/lib/Moose/Exception/OverrideConflictInSummation.pm cp lib/Moose/Exception/Role/Instance.pm blib/lib/Moose/Exception/Role/Instance.pm cp lib/Moose/Exception/RoleDoesTheExcludedRole.pm blib/lib/Moose/Exception/RoleDoesTheExcludedRole.pm cp lib/Moose/Exception/Role/TypeConstraint.pm blib/lib/Moose/Exception/Role/TypeConstraint.pm cp lib/Moose/Exception/Role/ParamsHash.pm blib/lib/Moose/Exception/Role/ParamsHash.pm cp lib/Moose/Exception/Role/InvalidAttributeOptions.pm blib/lib/Moose/Exception/Role/InvalidAttributeOptions.pm cp lib/Moose/Exception/Role/Class.pm blib/lib/Moose/Exception/Role/Class.pm cp lib/Moose/Exception/PackageNameAndNameParamsNotGivenToWrap.pm blib/lib/Moose/Exception/PackageNameAndNameParamsNotGivenToWrap.pm cp lib/Moose/Exception/RequiredAttributeNeedsADefault.pm blib/lib/Moose/Exception/RequiredAttributeNeedsADefault.pm cp lib/Moose/Exception/Role/EitherAttributeOrAttributeName.pm blib/lib/Moose/Exception/Role/EitherAttributeOrAttributeName.pm cp lib/Moose/Exception/PackagesAndModulesAreNotCachable.pm blib/lib/Moose/Exception/PackagesAndModulesAreNotCachable.pm cp lib/Moose/Exception/RequiredAttributeLacksInitialization.pm blib/lib/Moose/Exception/RequiredAttributeLacksInitialization.pm cp lib/Moose/Exception/Role/InstanceClass.pm blib/lib/Moose/Exception/Role/InstanceClass.pm cp lib/Moose/Exception/Role/RoleForCreate.pm blib/lib/Moose/Exception/Role/RoleForCreate.pm cp lib/Moose/Exception/Role/Method.pm blib/lib/Moose/Exception/Role/Method.pm cp lib/Moose/Exception/ParameterIsNotSubtypeOfParent.pm blib/lib/Moose/Exception/ParameterIsNotSubtypeOfParent.pm cp lib/Moose/Exception/PackageDoesNotUseMooseExporter.pm blib/lib/Moose/Exception/PackageDoesNotUseMooseExporter.pm cp lib/Moose/Exception/Role/AttributeName.pm blib/lib/Moose/Exception/Role/AttributeName.pm cp lib/Moose/Exception/Role/Role.pm blib/lib/Moose/Exception/Role/Role.pm cp lib/Moose/Exception/ReferencesAreNotAllowedAsDefault.pm blib/lib/Moose/Exception/ReferencesAreNotAllowedAsDefault.pm cp lib/Moose/Exception/RolesInCreateTakesAnArrayRef.pm blib/lib/Moose/Exception/RolesInCreateTakesAnArrayRef.pm cp lib/Moose/Exception/UnableToCanonicalizeNonRolePackage.pm blib/lib/Moose/Exception/UnableToCanonicalizeNonRolePackage.pm cp lib/Moose/Exception/UnableToRecognizeDelegateMetaclass.pm blib/lib/Moose/Exception/UnableToRecognizeDelegateMetaclass.pm cp lib/Moose/Exception/WrapTakesACodeRefToBless.pm blib/lib/Moose/Exception/WrapTakesACodeRefToBless.pm cp lib/Moose/Exception/TriggerMustBeACodeRef.pm blib/lib/Moose/Exception/TriggerMustBeACodeRef.pm cp lib/Moose/Exception/RolesListMustBeInstancesOfMooseMetaRole.pm blib/lib/Moose/Exception/RolesListMustBeInstancesOfMooseMetaRole.pm cp lib/Moose/Exception/TypeConstraintCannotBeUsedForAParameterizableType.pm blib/lib/Moose/Exception/TypeConstraintCannotBeUsedForAParameterizableType.pm cp lib/Moose/Exception/ValidationFailedForInlineTypeConstraint.pm blib/lib/Moose/Exception/ValidationFailedForInlineTypeConstraint.pm cp lib/Moose/Exception/TypeParameterMustBeMooseMetaType.pm blib/lib/Moose/Exception/TypeParameterMustBeMooseMetaType.pm cp lib/Moose/Exception/UnionCalledWithAnArrayRefAndAdditionalArgs.pm blib/lib/Moose/Exception/UnionCalledWithAnArrayRefAndAdditionalArgs.pm cp lib/Moose/Exception/RoleNameRequired.pm blib/lib/Moose/Exception/RoleNameRequired.pm cp lib/Moose/Exception/RolesDoNotSupportRegexReferencesForMethodModifiers.pm blib/lib/Moose/Exception/RolesDoNotSupportRegexReferencesForMethodModifiers.pm cp lib/Moose/Exception/RolesDoNotSupportAugment.pm blib/lib/Moose/Exception/RolesDoNotSupportAugment.pm cp lib/Moose/Exception/UnableToCanonicalizeHandles.pm blib/lib/Moose/Exception/UnableToCanonicalizeHandles.pm cp lib/Moose/Exception/RolesDoNotSupportExtends.pm blib/lib/Moose/Exception/RolesDoNotSupportExtends.pm cp lib/Moose/Exception/SingleParamsToNewMustBeHashRef.pm blib/lib/Moose/Exception/SingleParamsToNewMustBeHashRef.pm cp lib/Moose/Exception/ValidationFailedForTypeConstraint.pm blib/lib/Moose/Exception/ValidationFailedForTypeConstraint.pm cp lib/Moose/Exception/RolesDoNotSupportInner.pm blib/lib/Moose/Exception/RolesDoNotSupportInner.pm cp lib/Moose/Exception/UnionTakesAtleastTwoTypeNames.pm blib/lib/Moose/Exception/UnionTakesAtleastTwoTypeNames.pm cp lib/Moose/Exception/RoleNameRequiredForMooseMetaRole.pm blib/lib/Moose/Exception/RoleNameRequiredForMooseMetaRole.pm cp lib/Moose/Exception/UndefinedHashKeysPassedToMethod.pm blib/lib/Moose/Exception/UndefinedHashKeysPassedToMethod.pm cp lib/Moose/Exception/TypeConstraintIsAlreadyCreated.pm blib/lib/Moose/Exception/TypeConstraintIsAlreadyCreated.pm cp lib/Moose/Manual/BestPractices.pod blib/lib/Moose/Manual/BestPractices.pod cp lib/Moose/Manual/Support.pod blib/lib/Moose/Manual/Support.pod cp lib/Moose/Exception/WrongTypeConstraintGiven.pm blib/lib/Moose/Exception/WrongTypeConstraintGiven.pm cp lib/Moose/Meta/Attribute/Native/Trait/Hash.pm blib/lib/Moose/Meta/Attribute/Native/Trait/Hash.pm cp lib/Moose/Manual/Unsweetened.pod blib/lib/Moose/Manual/Unsweetened.pod cp lib/Moose/Meta/Attribute/Native/Trait/Code.pm blib/lib/Moose/Meta/Attribute/Native/Trait/Code.pm cp lib/Moose/Meta/Attribute.pm blib/lib/Moose/Meta/Attribute.pm cp lib/Moose/Manual/Construction.pod blib/lib/Moose/Manual/Construction.pod cp lib/Moose/Manual.pod blib/lib/Moose/Manual.pod cp lib/Moose/Meta/Attribute/Native/Trait/Number.pm blib/lib/Moose/Meta/Attribute/Native/Trait/Number.pm cp lib/Moose/Meta/Attribute/Native/Trait/Array.pm blib/lib/Moose/Meta/Attribute/Native/Trait/Array.pm cp lib/Moose/Manual/Exceptions.pod blib/lib/Moose/Manual/Exceptions.pod cp lib/Moose/Meta/Attribute/Native/Trait.pm blib/lib/Moose/Meta/Attribute/Native/Trait.pm cp lib/Moose/Manual/Roles.pod blib/lib/Moose/Manual/Roles.pod cp lib/Moose/Manual/Types.pod blib/lib/Moose/Manual/Types.pod cp lib/Moose/Manual/Resources.pod blib/lib/Moose/Manual/Resources.pod cp lib/Moose/Meta/Attribute/Native/Trait/String.pm blib/lib/Moose/Meta/Attribute/Native/Trait/String.pm cp lib/Moose/Manual/MOP.pod blib/lib/Moose/Manual/MOP.pod cp lib/Moose/Manual/Classes.pod blib/lib/Moose/Manual/Classes.pod cp lib/Moose/Manual/MethodModifiers.pod blib/lib/Moose/Manual/MethodModifiers.pod cp lib/Moose/Manual/Contributing.pod blib/lib/Moose/Manual/Contributing.pod cp lib/Moose/Meta/Attribute/Native/Trait/Counter.pm blib/lib/Moose/Meta/Attribute/Native/Trait/Counter.pm cp lib/Moose/Manual/Attributes.pod blib/lib/Moose/Manual/Attributes.pod cp lib/Moose/Exporter.pm blib/lib/Moose/Exporter.pm cp lib/Moose/Manual/FAQ.pod blib/lib/Moose/Manual/FAQ.pod cp lib/Moose/Manual/Exceptions/Manifest.pod blib/lib/Moose/Manual/Exceptions/Manifest.pod cp lib/Moose/Meta/Attribute/Native.pm blib/lib/Moose/Meta/Attribute/Native.pm cp lib/Moose/Intro.pod blib/lib/Moose/Intro.pod cp lib/Moose/Meta/Attribute/Native/Trait/Bool.pm blib/lib/Moose/Meta/Attribute/Native/Trait/Bool.pm cp lib/Moose/Manual/Delta.pod blib/lib/Moose/Manual/Delta.pod cp lib/Moose/Manual/MooseX.pod blib/lib/Moose/Manual/MooseX.pod cp lib/Moose/Manual/Concepts.pod blib/lib/Moose/Manual/Concepts.pod cp lib/Moose/Manual/Delegation.pod blib/lib/Moose/Manual/Delegation.pod cp lib/Moose/Meta/Class.pm blib/lib/Moose/Meta/Class.pm cp lib/Moose/Meta/Method/Accessor.pm blib/lib/Moose/Meta/Method/Accessor.pm cp lib/Moose/Meta/Instance.pm blib/lib/Moose/Meta/Instance.pm cp lib/Moose/Meta/Method/Accessor/Native/Array/pop.pm blib/lib/Moose/Meta/Method/Accessor/Native/Array/pop.pm cp lib/Moose/Meta/Method/Accessor/Native/Array/natatime.pm blib/lib/Moose/Meta/Method/Accessor/Native/Array/natatime.pm cp lib/Moose/Meta/Method/Accessor/Native/Array/insert.pm blib/lib/Moose/Meta/Method/Accessor/Native/Array/insert.pm cp lib/Moose/Meta/Method/Accessor/Native/Array/is_empty.pm blib/lib/Moose/Meta/Method/Accessor/Native/Array/is_empty.pm cp lib/Moose/Meta/Method/Accessor/Native/Array/Writer.pm blib/lib/Moose/Meta/Method/Accessor/Native/Array/Writer.pm cp lib/Moose/Meta/Class/Immutable/Trait.pm blib/lib/Moose/Meta/Class/Immutable/Trait.pm cp lib/Moose/Meta/Method/Accessor/Native/Array/elements.pm blib/lib/Moose/Meta/Method/Accessor/Native/Array/elements.pm cp lib/Moose/Meta/Method/Accessor/Native/Array/join.pm blib/lib/Moose/Meta/Method/Accessor/Native/Array/join.pm cp lib/Moose/Meta/Method/Accessor/Native/Array/map.pm blib/lib/Moose/Meta/Method/Accessor/Native/Array/map.pm cp lib/Moose/Meta/Method.pm blib/lib/Moose/Meta/Method.pm cp lib/Moose/Meta/Method/Accessor/Native/Array/get.pm blib/lib/Moose/Meta/Method/Accessor/Native/Array/get.pm cp lib/Moose/Meta/Method/Accessor/Native/Array/grep.pm blib/lib/Moose/Meta/Method/Accessor/Native/Array/grep.pm cp lib/Moose/Meta/Method/Accessor/Native/Array/delete.pm blib/lib/Moose/Meta/Method/Accessor/Native/Array/delete.pm cp lib/Moose/Meta/Method/Accessor/Native/Array/count.pm blib/lib/Moose/Meta/Method/Accessor/Native/Array/count.pm cp lib/Moose/Meta/Method/Accessor/Native/Array/first.pm blib/lib/Moose/Meta/Method/Accessor/Native/Array/first.pm cp lib/Moose/Meta/Method/Accessor/Native/Array/reduce.pm blib/lib/Moose/Meta/Method/Accessor/Native/Array/reduce.pm cp lib/Moose/Meta/Method/Accessor/Native/Array/clear.pm blib/lib/Moose/Meta/Method/Accessor/Native/Array/clear.pm cp lib/Moose/Meta/Method/Accessor/Native/Array/first_index.pm blib/lib/Moose/Meta/Method/Accessor/Native/Array/first_index.pm cp lib/Moose/Meta/Method/Accessor/Native.pm blib/lib/Moose/Meta/Method/Accessor/Native.pm cp lib/Moose/Meta/Method/Accessor/Native/Array.pm blib/lib/Moose/Meta/Method/Accessor/Native/Array.pm cp lib/Moose/Meta/Method/Accessor/Native/Array/accessor.pm blib/lib/Moose/Meta/Method/Accessor/Native/Array/accessor.pm cp lib/Moose/Meta/Method/Accessor/Native/Array/push.pm blib/lib/Moose/Meta/Method/Accessor/Native/Array/push.pm cp lib/Moose/Meta/Method/Accessor/Native/Counter/set.pm blib/lib/Moose/Meta/Method/Accessor/Native/Counter/set.pm cp lib/Moose/Meta/Method/Accessor/Native/Bool/toggle.pm blib/lib/Moose/Meta/Method/Accessor/Native/Bool/toggle.pm cp lib/Moose/Meta/Method/Accessor/Native/Array/sort.pm blib/lib/Moose/Meta/Method/Accessor/Native/Array/sort.pm cp lib/Moose/Meta/Method/Accessor/Native/Code/execute.pm blib/lib/Moose/Meta/Method/Accessor/Native/Code/execute.pm cp lib/Moose/Meta/Method/Accessor/Native/Array/set.pm blib/lib/Moose/Meta/Method/Accessor/Native/Array/set.pm cp lib/Moose/Meta/Method/Accessor/Native/Counter/reset.pm blib/lib/Moose/Meta/Method/Accessor/Native/Counter/reset.pm cp lib/Moose/Meta/Method/Accessor/Native/Collection.pm blib/lib/Moose/Meta/Method/Accessor/Native/Collection.pm cp lib/Moose/Meta/Method/Accessor/Native/Array/shift.pm blib/lib/Moose/Meta/Method/Accessor/Native/Array/shift.pm cp lib/Moose/Meta/Method/Accessor/Native/Bool/not.pm blib/lib/Moose/Meta/Method/Accessor/Native/Bool/not.pm cp lib/Moose/Meta/Method/Accessor/Native/Array/shuffle.pm blib/lib/Moose/Meta/Method/Accessor/Native/Array/shuffle.pm cp lib/Moose/Meta/Method/Accessor/Native/Hash.pm blib/lib/Moose/Meta/Method/Accessor/Native/Hash.pm cp lib/Moose/Meta/Method/Accessor/Native/Bool/unset.pm blib/lib/Moose/Meta/Method/Accessor/Native/Bool/unset.pm cp lib/Moose/Meta/Method/Accessor/Native/Array/splice.pm blib/lib/Moose/Meta/Method/Accessor/Native/Array/splice.pm cp lib/Moose/Meta/Method/Accessor/Native/Array/uniq.pm blib/lib/Moose/Meta/Method/Accessor/Native/Array/uniq.pm cp lib/Moose/Meta/Method/Accessor/Native/Array/unshift.pm blib/lib/Moose/Meta/Method/Accessor/Native/Array/unshift.pm cp lib/Moose/Meta/Method/Accessor/Native/Array/sort_in_place.pm blib/lib/Moose/Meta/Method/Accessor/Native/Array/sort_in_place.pm cp lib/Moose/Meta/Method/Accessor/Native/Array/shallow_clone.pm blib/lib/Moose/Meta/Method/Accessor/Native/Array/shallow_clone.pm cp lib/Moose/Meta/Method/Accessor/Native/Bool/set.pm blib/lib/Moose/Meta/Method/Accessor/Native/Bool/set.pm cp lib/Moose/Meta/Method/Accessor/Native/Counter/inc.pm blib/lib/Moose/Meta/Method/Accessor/Native/Counter/inc.pm cp lib/Moose/Meta/Method/Accessor/Native/Counter/Writer.pm blib/lib/Moose/Meta/Method/Accessor/Native/Counter/Writer.pm cp lib/Moose/Meta/Method/Accessor/Native/Code/execute_method.pm blib/lib/Moose/Meta/Method/Accessor/Native/Code/execute_method.pm cp lib/Moose/Meta/Method/Accessor/Native/Counter/dec.pm blib/lib/Moose/Meta/Method/Accessor/Native/Counter/dec.pm cp lib/Moose/Meta/Method/Accessor/Native/Hash/values.pm blib/lib/Moose/Meta/Method/Accessor/Native/Hash/values.pm cp lib/Moose/Meta/Method/Accessor/Native/Number/abs.pm blib/lib/Moose/Meta/Method/Accessor/Native/Number/abs.pm cp lib/Moose/Meta/Method/Accessor/Native/Number/mod.pm blib/lib/Moose/Meta/Method/Accessor/Native/Number/mod.pm cp lib/Moose/Meta/Method/Accessor/Native/Hash/elements.pm blib/lib/Moose/Meta/Method/Accessor/Native/Hash/elements.pm cp lib/Moose/Meta/Method/Accessor/Native/Number/sub.pm blib/lib/Moose/Meta/Method/Accessor/Native/Number/sub.pm cp lib/Moose/Meta/Method/Accessor/Native/Hash/accessor.pm blib/lib/Moose/Meta/Method/Accessor/Native/Hash/accessor.pm cp lib/Moose/Meta/Method/Accessor/Native/Hash/exists.pm blib/lib/Moose/Meta/Method/Accessor/Native/Hash/exists.pm cp lib/Moose/Meta/Method/Accessor/Native/Hash/set.pm blib/lib/Moose/Meta/Method/Accessor/Native/Hash/set.pm cp lib/Moose/Meta/Method/Accessor/Native/Hash/Writer.pm blib/lib/Moose/Meta/Method/Accessor/Native/Hash/Writer.pm cp lib/Moose/Meta/Method/Accessor/Native/Number/add.pm blib/lib/Moose/Meta/Method/Accessor/Native/Number/add.pm cp lib/Moose/Meta/Method/Accessor/Native/Hash/keys.pm blib/lib/Moose/Meta/Method/Accessor/Native/Hash/keys.pm cp lib/Moose/Meta/Method/Accessor/Native/Hash/clear.pm blib/lib/Moose/Meta/Method/Accessor/Native/Hash/clear.pm cp lib/Moose/Meta/Method/Accessor/Native/Hash/defined.pm blib/lib/Moose/Meta/Method/Accessor/Native/Hash/defined.pm cp lib/Moose/Meta/Method/Accessor/Native/Hash/delete.pm blib/lib/Moose/Meta/Method/Accessor/Native/Hash/delete.pm cp lib/Moose/Meta/Method/Accessor/Native/Reader.pm blib/lib/Moose/Meta/Method/Accessor/Native/Reader.pm cp lib/Moose/Meta/Method/Accessor/Native/Hash/is_empty.pm blib/lib/Moose/Meta/Method/Accessor/Native/Hash/is_empty.pm cp lib/Moose/Meta/Method/Accessor/Native/Hash/get.pm blib/lib/Moose/Meta/Method/Accessor/Native/Hash/get.pm cp lib/Moose/Meta/Method/Accessor/Native/Hash/count.pm blib/lib/Moose/Meta/Method/Accessor/Native/Hash/count.pm cp lib/Moose/Meta/Method/Accessor/Native/Hash/kv.pm blib/lib/Moose/Meta/Method/Accessor/Native/Hash/kv.pm cp lib/Moose/Meta/Method/Accessor/Native/Number/mul.pm blib/lib/Moose/Meta/Method/Accessor/Native/Number/mul.pm cp lib/Moose/Meta/Method/Accessor/Native/Number/div.pm blib/lib/Moose/Meta/Method/Accessor/Native/Number/div.pm cp lib/Moose/Meta/Method/Accessor/Native/Hash/shallow_clone.pm blib/lib/Moose/Meta/Method/Accessor/Native/Hash/shallow_clone.pm cp lib/Moose/Meta/Method/Accessor/Native/Number/set.pm blib/lib/Moose/Meta/Method/Accessor/Native/Number/set.pm cp lib/Moose/Meta/Role/Application/ToRole.pm blib/lib/Moose/Meta/Role/Application/ToRole.pm cp lib/Moose/Meta/Role/Application/RoleSummation.pm blib/lib/Moose/Meta/Role/Application/RoleSummation.pm cp lib/Moose/Meta/Method/Constructor.pm blib/lib/Moose/Meta/Method/Constructor.pm cp lib/Moose/Meta/Method/Destructor.pm blib/lib/Moose/Meta/Method/Destructor.pm cp lib/Moose/Meta/Method/Meta.pm blib/lib/Moose/Meta/Method/Meta.pm cp lib/Moose/Meta/Role/Application/ToClass.pm blib/lib/Moose/Meta/Role/Application/ToClass.pm cp lib/Moose/Meta/Method/Augmented.pm blib/lib/Moose/Meta/Method/Augmented.pm cp lib/Moose/Meta/Method/Accessor/Native/String/prepend.pm blib/lib/Moose/Meta/Method/Accessor/Native/String/prepend.pm cp lib/Moose/Meta/Role/Composite.pm blib/lib/Moose/Meta/Role/Composite.pm cp lib/Moose/Meta/Role/Attribute.pm blib/lib/Moose/Meta/Role/Attribute.pm cp lib/Moose/Meta/Role/Application/ToInstance.pm blib/lib/Moose/Meta/Role/Application/ToInstance.pm cp lib/Moose/Meta/Method/Delegation.pm blib/lib/Moose/Meta/Method/Delegation.pm cp lib/Moose/Meta/Method/Accessor/Native/String/replace.pm blib/lib/Moose/Meta/Method/Accessor/Native/String/replace.pm cp lib/Moose/Meta/Object/Trait.pm blib/lib/Moose/Meta/Object/Trait.pm cp lib/Moose/Meta/Method/Accessor/Native/String/substr.pm blib/lib/Moose/Meta/Method/Accessor/Native/String/substr.pm cp lib/Moose/Meta/Method/Accessor/Native/String/clear.pm blib/lib/Moose/Meta/Method/Accessor/Native/String/clear.pm cp lib/Moose/Meta/Mixin/AttributeCore.pm blib/lib/Moose/Meta/Mixin/AttributeCore.pm cp lib/Moose/Meta/Role.pm blib/lib/Moose/Meta/Role.pm cp lib/Moose/Meta/Role/Application.pm blib/lib/Moose/Meta/Role/Application.pm cp lib/Moose/Meta/Method/Overridden.pm blib/lib/Moose/Meta/Method/Overridden.pm cp lib/Moose/Meta/Method/Accessor/Native/String/chop.pm blib/lib/Moose/Meta/Method/Accessor/Native/String/chop.pm cp lib/Moose/Meta/Method/Accessor/Native/String/match.pm blib/lib/Moose/Meta/Method/Accessor/Native/String/match.pm cp lib/Moose/Meta/Method/Accessor/Native/String/chomp.pm blib/lib/Moose/Meta/Method/Accessor/Native/String/chomp.pm cp lib/Moose/Meta/Method/Accessor/Native/Writer.pm blib/lib/Moose/Meta/Method/Accessor/Native/Writer.pm cp lib/Moose/Meta/Method/Accessor/Native/String/inc.pm blib/lib/Moose/Meta/Method/Accessor/Native/String/inc.pm cp lib/Moose/Meta/Method/Accessor/Native/String/append.pm blib/lib/Moose/Meta/Method/Accessor/Native/String/append.pm cp lib/Moose/Meta/Method/Accessor/Native/String/length.pm blib/lib/Moose/Meta/Method/Accessor/Native/String/length.pm cp lib/Moose/Meta/TypeConstraint/Enum.pm blib/lib/Moose/Meta/TypeConstraint/Enum.pm cp lib/Moose/Meta/Role/Method/Required.pm blib/lib/Moose/Meta/Role/Method/Required.pm cp lib/Moose/Meta/TypeConstraint/Registry.pm blib/lib/Moose/Meta/TypeConstraint/Registry.pm cp lib/Moose/Util.pm blib/lib/Moose/Util.pm cp lib/oose.pm blib/lib/oose.pm cp lib/metaclass.pm blib/lib/metaclass.pm cp lib/Moose/Meta/TypeCoercion.pm blib/lib/Moose/Meta/TypeCoercion.pm cp lib/Moose/Util/MetaRole.pm blib/lib/Moose/Util/MetaRole.pm cp lib/Moose/Role.pm blib/lib/Moose/Role.pm cp lib/Moose/Meta/Role/Method/Conflicting.pm blib/lib/Moose/Meta/Role/Method/Conflicting.pm cp lib/Moose/Object.pm blib/lib/Moose/Object.pm cp lib/Moose/Util/TypeConstraints/Builtins.pm blib/lib/Moose/Util/TypeConstraints/Builtins.pm cp lib/Moose/Meta/Role/Method.pm blib/lib/Moose/Meta/Role/Method.pm cp lib/Moose/Meta/TypeConstraint/Parameterizable.pm blib/lib/Moose/Meta/TypeConstraint/Parameterizable.pm cp lib/Moose/Meta/TypeConstraint.pm blib/lib/Moose/Meta/TypeConstraint.pm cp lib/Test/Moose.pm blib/lib/Test/Moose.pm cp lib/Moose/Unsweetened.pod blib/lib/Moose/Unsweetened.pod cp lib/Moose/Util/TypeConstraints.pm blib/lib/Moose/Util/TypeConstraints.pm cp lib/Moose/Meta/TypeConstraint/Union.pm blib/lib/Moose/Meta/TypeConstraint/Union.pm cp lib/Moose/Meta/TypeConstraint/DuckType.pm blib/lib/Moose/Meta/TypeConstraint/DuckType.pm cp lib/Moose/Spec/Role.pod blib/lib/Moose/Spec/Role.pod cp lib/Moose/Meta/TypeConstraint/Parameterized.pm blib/lib/Moose/Meta/TypeConstraint/Parameterized.pm cp lib/Moose/Meta/TypeCoercion/Union.pm blib/lib/Moose/Meta/TypeCoercion/Union.pm cp lib/Moose/Meta/TypeConstraint/Role.pm blib/lib/Moose/Meta/TypeConstraint/Role.pm cp lib/Moose/Meta/TypeConstraint/Class.pm blib/lib/Moose/Meta/TypeConstraint/Class.pm cp bin/moose-outdated blib/script/moose-outdated "/usr/bin/perl5.40.0" -MExtUtils::MY -e 'MY->fixin(shift)' -- blib/script/moose-outdated Manifying 29 pod documents Manifying 20 pod documents Manifying 31 pod documents Manifying 27 pod documents Manifying 26 pod documents + /usr/bin/make -Otarget -j28 test "/usr/bin/perl5.40.0" -MExtUtils::Command::MM -e 'cp_nonempty' -- Moose.bs blib/arch/auto/Moose/Moose.bs 644 PERL_DL_NONLAZY=1 "/usr/bin/perl5.40.0" "-MExtUtils::Command::MM" "-MTest::Harness" "-e" "undef *Test::Harness::Switches; test_harness(0, 'blib/lib', 'blib/arch')" t/*.t t/attributes/*.t t/basics/*.t t/bugs/*.t t/cmop/*.t t/compat/*.t t/examples/*.t t/exceptions/*.t t/immutable/*.t t/metaclasses/*.t t/moose_util/*.t t/native_traits/*.t t/recipes/*.t t/roles/*.t t/test_moose/*.t t/todo_tests/*.t t/type_constraints/*.t # # Versions for all modules listed in MYMETA.json (including optional ones): # # === Configure Requires === # # Module Want Have # -------------------- -------- -------- # Dist::CheckConflicts 0.02 0.11 # ExtUtils::MakeMaker any 7.70 # perl 5.008003 5.040000 # # === Configure Suggests === # # Module Want Have # -------- ------- ---- # JSON::PP 2.27300 4.16 # # === Build Requires === # # Module Want Have # ------------------- ---- ---- # ExtUtils::MakeMaker any 7.70 # # === Test Requires === # # Module Want Have # ------------------------ -------- -------- # CPAN::Meta::Check 0.011 0.018 # CPAN::Meta::Requirements any 2.143 # File::Spec any 3.90 # Module::Metadata any 1.000038 # Test::CleanNamespaces 0.13 0.24 # Test::Fatal 0.001 0.016 # Test::More 0.96 1.302199 # Test::Needs 0.002010 0.002010 # # === Test Recommends === # # Module Want Have # ---------- -------- -------- # CPAN::Meta 2.120900 2.150010 # # === Runtime Requires === # # Module Want Have # --------------------------- -------- -------- # Carp 1.22 1.54 # Class::Load 0.09 0.25 # Class::Load::XS 0.01 0.10 # Data::OptList 0.107 0.114 # Devel::GlobalDestruction any 0.14 # Devel::OverloadInfo 0.005 0.007 # Devel::StackTrace 2.03 2.04 # Dist::CheckConflicts 0.02 0.11 # Eval::Closure 0.04 0.14 # List::Util 1.56 1.63 # MRO::Compat 0.05 0.15 # Module::Runtime 0.014 0.016 # Module::Runtime::Conflicts 0.002 0.003 # Package::DeprecationManager 0.11 0.17 # Package::Stash 0.32 0.40 # Package::Stash::XS 0.24 0.30 # Params::Util 1.00 1.102 # Scalar::Util 1.19 1.63 # Sub::Exporter 0.980 0.988 # Sub::Util 1.40 1.63 # Try::Tiny 0.17 0.31 # parent 0.223 0.241 # perl 5.008003 5.040000 # strict 1.03 1.13 # warnings 1.03 1.70 # # === Runtime Recommends === # # Module Want Have # ------------- ----- ----- # Data::OptList 0.110 0.114 # # === Runtime Suggests === # # Module Want Have # ------------------ ---- ------- # Devel::PartialDump 0.14 missing # # === Other Modules === # # Module Have # ---------------------------- ---------- # Algorithm::C3 missing # DBM::Deep 2.0017 # DateTime 1.59 # DateTime::Calendar::Mayan 0.0601 # DateTime::Format::MySQL 0.08 # Declare::Constraints::Simple 0.03 # Dist::CheckConflicts 0.11 # DynaLoader 1.56 # HTTP::Headers 6.44 # IO::File 1.55 # Locale::US 3.04 # Module::Refresh 0.17 # MooseX::NonMoose missing # Params::Coerce 0.15 # Regexp::Common 2017060201 # SUPER missing # Test::Deep 1.204 # Test::DependentModules missing # Test::LeakTrace 0.17 # Test::Output 1.033 # URI 5.27 # YAML 1.30 # autodie 2.37 # t/00-report-prereqs.t ............................................ ok t/000_load.t ..................................................... ok t/attributes/accessor_context.t .................................. ok t/attributes/accessor_inlining.t ................................. ok t/attributes/accessor_override_method.t .......................... ok t/attributes/accessor_overwrite_warning.t ........................ ok t/attributes/attr_dereference_test.t ............................. ok t/attributes/attribute_accessor_generation.t ..................... ok t/attributes/attribute_custom_metaclass.t ........................ ok t/attributes/attribute_delegation.t .............................. ok t/attributes/attribute_does.t .................................... ok t/attributes/attribute_inherited_slot_specs.t .................... ok t/attributes/attribute_lazy_initializer.t ........................ ok t/attributes/attribute_names.t ................................... ok t/attributes/attribute_reader_generation.t ....................... ok t/attributes/attribute_required.t ................................ ok t/attributes/attribute_traits.t .................................. ok t/attributes/attribute_traits_n_meta.t ........................... ok t/attributes/attribute_traits_parameterized.t .................... ok t/attributes/attribute_traits_registered.t ....................... ok t/attributes/attribute_triggers.t ................................ ok t/attributes/attribute_type_unions.t ............................. ok t/attributes/attribute_without_any_methods.t ..................... ok t/attributes/attribute_writer_generation.t ....................... ok t/attributes/bad_coerce.t ........................................ ok t/attributes/chained_coercion.t .................................. ok t/attributes/clone_weak.t ........................................ ok t/attributes/default_class_role_types.t .......................... ok t/attributes/default_undef.t ..................................... ok t/attributes/delegation_and_modifiers.t .......................... ok t/attributes/delegation_arg_aliasing.t ........................... ok t/attributes/delegation_target_not_loaded.t ...................... ok t/attributes/illegal_options_for_inheritance.t ................... ok t/attributes/inherit_lazy_build.t ................................ ok t/attributes/lazy_no_default.t ................................... ok t/attributes/method_generation_rules.t ........................... ok t/attributes/misc_attribute_coerce_lazy.t ........................ ok t/attributes/misc_attribute_tests.t .............................. ok t/attributes/more_attr_delegation.t .............................. ok t/attributes/no_init_arg.t ....................................... ok t/attributes/no_slot_access.t .................................... ok t/attributes/non_alpha_attr_names.t .............................. ok t/attributes/numeric_defaults.t .................................. ok t/attributes/trigger_and_coerce.t ................................ ok t/attributes/type_constraint.t ................................... ok t/basics/always_strict_warnings.t ................................ ok t/basics/basic_class_setup.t ..................................... ok t/basics/buildargs.t ............................................. ok t/basics/buildargs_warning.t ..................................... ok t/basics/create.t ................................................ ok t/basics/create_anon.t ........................................... ok t/basics/definition_context.t .................................... ok t/basics/deprecations.t .......................................... ok t/basics/destruction.t ........................................... ok t/basics/error_handling.t ........................................ ok t/basics/global_destruction.t .................................... ok t/basics/import_unimport.t ....................................... ok t/basics/inner_and_augment.t ..................................... ok t/basics/load_into_main.t ........................................ ok t/basics/method_modifier_with_regexp.t ........................... ok t/basics/methods.t ............................................... ok t/basics/moose_object_does.t ..................................... ok t/basics/moose_respects_type_constraints.t ....................... ok t/basics/override_and_foreign_classes.t .......................... ok t/basics/override_augment_inner_super.t .......................... ok t/basics/rebless.t ............................................... ok t/basics/require_superclasses.t .................................. ok t/basics/super_and_override.t .................................... ok t/basics/super_warns_on_args.t ................................... ok t/basics/universal_methods_wrappable.t ........................... ok t/basics/wrapped_method_cxt_propagation.t ........................ ok t/bugs/anon_method_metaclass.t ................................... ok t/bugs/application_metarole_compat.t ............................. ok t/bugs/apply_role_to_one_instance_only.t ......................... ok t/bugs/attribute_trait_parameters.t .............................. ok t/bugs/augment_recursion_bug.t ................................... ok t/bugs/coerce_without_coercion.t ................................. ok t/bugs/constructor_object_overload.t ............................. ok t/bugs/create_anon_mkopt.t ....................................... ok t/bugs/create_anon_recursion.t ................................... ok t/bugs/create_anon_role_pass.t ................................... ok t/bugs/delete_sub_stash.t ........................................ ok t/bugs/DEMOLISH_eats_exceptions.t ................................ ok t/bugs/DEMOLISH_eats_mini.t ...................................... ok t/bugs/DEMOLISH_fails_without_metaclass.t ........................ ok t/bugs/DEMOLISHALL.t ............................................. ok t/bugs/DEMOLISHALL_shortcutted.t ................................. ok t/bugs/find_custom_trait_rt_92089.t .............................. ok t/bugs/handles_foreign_class_bug.t ............................... ok t/bugs/immutable_metaclass_does_role.t ........................... ok t/bugs/immutable_n_default_x2.t .................................. ok t/bugs/inheriting_from_roles.t ................................... ok t/bugs/inline_reader_bug.t ....................................... ok t/bugs/instance_application_role_args.t .......................... ok t/bugs/lazybuild_required_undef.t ................................ ok t/bugs/mark_as_methods_overloading_breakage.t .................... skipped: Need MooseX::MarkAsMethods t/bugs/moo_delegation.t .......................................... ok t/bugs/moose_exporter_false_circular_reference_rt_63818.t ........ ok t/bugs/Moose_Object_error.t ...................................... ok t/bugs/moose_octal_defaults.t .................................... ok t/bugs/native_trait_handles_bad_value.t .......................... ok t/bugs/overloading_edge_cases.t .................................. ok t/bugs/reader_precedence_bug.t ................................... ok t/bugs/role_caller.t ............................................. ok t/bugs/subclass_use_base_bug.t ................................... ok t/bugs/subtype_conflict_bug.t .................................... ok t/bugs/subtype_quote_bug.t ....................................... ok t/bugs/super_recursion.t ......................................... ok t/bugs/traits_with_exporter.t .................................... ok t/bugs/type_constraint_messages.t ................................ ok t/cmop/add_attribute_alternate.t ................................. ok t/cmop/add_method_debugmode.t .................................... ok t/cmop/add_method_modifier.t ..................................... ok t/cmop/advanced_methods.t ........................................ ok t/cmop/anon_class.t .............................................. ok t/cmop/anon_class_create_init.t .................................. ok t/cmop/anon_class_keep_alive.t ................................... ok t/cmop/anon_class_leak.t ......................................... ok t/cmop/anon_class_removal.t ...................................... ok t/cmop/anon_packages.t ........................................... ok t/cmop/ArrayBasedStorage_test.t .................................. ok t/cmop/attribute.t ............................................... ok t/cmop/attribute_duplication.t ................................... ok t/cmop/attribute_errors_and_edge_cases.t ......................... ok t/cmop/attribute_get_read_write.t ................................ ok t/cmop/attribute_initializer.t ................................... ok t/cmop/attribute_introspection.t ................................. ok t/cmop/attribute_non_alpha_name.t ................................ ok t/cmop/attributes.t .............................................. ok t/cmop/AttributesWithHistory_test.t .............................. ok t/cmop/basic.t ................................................... ok t/cmop/before_after_dollar_under.t ............................... ok t/cmop/BinaryTree_test.t ......................................... ok t/cmop/C3MethodDispatchOrder_test.t .............................. skipped: Need Algorithm::C3 t/cmop/Class_C3_compatibility.t .................................. ok t/cmop/class_errors_and_edge_cases.t ............................. ok t/cmop/class_is_pristine.t ....................................... ok t/cmop/class_precedence_list.t ................................... ok t/cmop/ClassEncapsulatedAttributes_test.t ........................ ok t/cmop/constant_codeinfo.t ....................................... ok t/cmop/create_class.t ............................................ ok t/cmop/custom_instance.t ......................................... ok t/cmop/deprecated.t .............................................. ok t/cmop/get_code_info.t ........................................... ok t/cmop/immutable_custom_trait.t .................................. ok t/cmop/immutable_metaclass.t ..................................... ok t/cmop/immutable_w_constructors.t ................................ ok t/cmop/immutable_w_custom_metaclass.t ............................ ok t/cmop/inline_and_dollar_at.t .................................... ok t/cmop/inline_structor.t ......................................... ok t/cmop/insertion_order.t ......................................... ok t/cmop/InsideOutClass_test.t ..................................... ok t/cmop/instance.t ................................................ ok t/cmop/instance_inline.t ......................................... ok t/cmop/instance_metaclass_incompat.t ............................. ok t/cmop/instance_metaclass_incompat_dyn.t ......................... ok t/cmop/InstanceCountingClass_test.t .............................. ok t/cmop/LazyClass_test.t .......................................... ok t/cmop/load.t .................................................... ok t/cmop/magic.t ................................................... ok t/cmop/make_mutable.t ............................................ ok t/cmop/meta_method.t ............................................. ok t/cmop/meta_package.t ............................................ ok t/cmop/meta_package_extension.t .................................. ok t/cmop/metaclass.t ............................................... ok t/cmop/metaclass_incompatibility.t ............................... ok t/cmop/metaclass_incompatibility_dyn.t ........................... ok t/cmop/metaclass_inheritance.t ................................... ok t/cmop/metaclass_loads_classes.t ................................. ok t/cmop/metaclass_reinitialize.t .................................. ok t/cmop/method.t .................................................. ok t/cmop/method_modifiers.t ........................................ ok # Failed test '... got the right list of applicable methods for Foo' # at t/cmop/methods.t line 211. # Structures begin differing at: # $got->[28] = 'import' # $expected->[28] = 'isa' # Failed test '... got the right list of applicable methods for Bar' # at t/cmop/methods.t line 302. # Structures begin differing at: # $got->[28] = 'import' # $expected->[28] = 'isa' # Looks like you failed 2 tests of 81. t/cmop/methods.t ................................................. Dubious, test returned 2 (wstat 512, 0x200) Failed 2/81 subtests t/cmop/modify_parent_method.t .................................... ok t/cmop/new_and_clone_metaclasses.t ............................... ok t/cmop/null_stash.t .............................................. ok t/cmop/numeric_defaults.t ........................................ ok t/cmop/package_variables.t ....................................... ok t/cmop/Perl6Attribute_test.t ..................................... ok t/cmop/random_eval_bug.t ......................................... ok t/cmop/rebless_instance.t ........................................ ok t/cmop/rebless_instance_away.t ................................... ok t/cmop/rebless_overload.t ........................................ ok t/cmop/rebless_with_extra_params.t ............................... ok t/cmop/RT_27329_fix.t ............................................ ok t/cmop/RT_39001_fix.t ............................................ ok t/cmop/RT_41255.t ................................................ ok t/cmop/scala_style_mixin_composition.t ........................... skipped: Need SUPER 1.1 t/cmop/self_introspection.t ...................................... ok t/cmop/subclasses.t .............................................. ok t/cmop/subname.t ................................................. ok t/cmop/universal_methods.t ....................................... ok t/compat/composite_metaroles.t ................................... ok t/compat/extends_nonmoose_that_isa_moose_with_metarole.t ......... ok t/compat/foreign_inheritence.t ................................... ok t/compat/inc_hash.t .............................................. ok t/compat/module_refresh_compat.t ................................. ok t/compat/moose_respects_base.t ................................... ok t/examples/Child_Parent_attr_inherit.t ........................... ok t/examples/example1.t ............................................ ok t/examples/example2.t ............................................ ok t/examples/example_Moose_POOP.t .................................. ok t/examples/example_Protomoose.t .................................. ok t/examples/example_w_DCS.t ....................................... ok t/examples/example_w_TestDeep.t .................................. ok t/examples/record_set_iterator.t ................................. ok t/exceptions/attribute.t ......................................... ok t/exceptions/class-mop-attribute.t ............................... ok t/exceptions/class-mop-class-immutable-trait.t ................... ok t/exceptions/class-mop-class.t ................................... ok t/exceptions/class-mop-method-accessor.t ......................... ok t/exceptions/class-mop-method-constructor.t ...................... ok t/exceptions/class-mop-method-generated.t ........................ ok t/exceptions/class-mop-method-meta.t ............................. ok t/exceptions/class-mop-method-wrapped.t .......................... ok t/exceptions/class-mop-method.t .................................. ok t/exceptions/class-mop-mixin-hasattributes.t ..................... ok t/exceptions/class-mop-mixin-hasmethods.t ........................ ok t/exceptions/class-mop-module.t .................................. ok t/exceptions/class-mop-object.t .................................. ok t/exceptions/class-mop-package.t ................................. ok t/exceptions/class.t ............................................. ok t/exceptions/cmop.t .............................................. ok t/exceptions/exception-lazyattributeneedsadefault.t .............. ok t/exceptions/frame-leak.t ........................................ skipped: Need Test::Memory::Cycle t/exceptions/meta-role.t ......................................... ok t/exceptions/metaclass.t ......................................... ok t/exceptions/moose-exporter.t .................................... ok t/exceptions/moose-meta-attribute-native-traits.t ................ ok t/exceptions/moose-meta-class-immutable-trait.t .................. ok t/exceptions/moose-meta-method-accessor-native-array.t ........... ok t/exceptions/moose-meta-method-accessor-native-collection.t ...... ok t/exceptions/moose-meta-method-accessor-native-grep.t ............ ok t/exceptions/moose-meta-method-accessor-native-hash-set.t ........ ok t/exceptions/moose-meta-method-accessor-native-hash.t ............ ok t/exceptions/moose-meta-method-accessor-native-string-match.t .... ok t/exceptions/moose-meta-method-accessor-native-string-replace.t .. ok t/exceptions/moose-meta-method-accessor-native-string-substr.t ... ok t/exceptions/moose-meta-method-accessor-native.t ................. ok t/exceptions/moose-meta-method-accessor.t ........................ ok t/exceptions/moose-meta-method-augmented.t ....................... ok t/exceptions/moose-meta-method-constructor.t ..................... ok t/exceptions/moose-meta-method-delegation.t ...................... ok t/exceptions/moose-meta-method-destructor.t ...................... ok t/exceptions/moose-meta-method-overridden.t ...................... ok t/exceptions/moose-meta-role-application-rolesummation.t ......... ok t/exceptions/moose-meta-role-application-toclass.t ............... ok t/exceptions/moose-meta-role-application-torole.t ................ ok t/exceptions/moose-meta-role-application.t ....................... ok t/exceptions/moose-meta-role-attribute.t ......................... ok t/exceptions/moose-meta-role-composite.t ......................... ok t/exceptions/moose-meta-typecoercion-union.t ..................... ok t/exceptions/moose-meta-typecoercion.t ........................... ok t/exceptions/moose-meta-typeconstraint-enum.t .................... ok t/exceptions/moose-meta-typeconstraint-parameterizable.t ......... ok t/exceptions/moose-meta-typeconstraint-parameterized.t ........... ok t/exceptions/moose-meta-typeconstraint-registry.t ................ ok t/exceptions/moose-meta-typeconstraint.t ......................... ok t/exceptions/moose-role.t ........................................ ok t/exceptions/moose-util-metarole.t ............................... ok t/exceptions/moose-util-typeconstraints.t ........................ ok t/exceptions/moose.t ............................................. ok t/exceptions/object.t ............................................ ok t/exceptions/overload.t .......................................... ok t/exceptions/rt-92818.t .......................................... ok t/exceptions/rt-94795.t .......................................... ok t/exceptions/stringify.t ......................................... ok t/exceptions/traits.t ............................................ ok t/exceptions/typeconstraints.t ................................... ok t/exceptions/util.t .............................................. ok t/exceptions/with-debugging.t .................................... ok t/exceptions/without-debugging.t ................................. ok t/immutable/apply_roles_to_immutable.t ........................... ok t/immutable/buildargs.t .......................................... ok t/immutable/constructor_is_not_moose.t ........................... ok t/immutable/constructor_is_wrapped.t ............................. ok t/immutable/default_values.t ..................................... ok t/immutable/definition_context.t ................................. ok t/immutable/immutable_constructor_error.t ........................ ok t/immutable/immutable_destroy.t .................................. ok t/immutable/immutable_meta_class.t ............................... ok t/immutable/immutable_metaclass_with_traits.t .................... ok t/immutable/immutable_moose.t .................................... ok t/immutable/immutable_roundtrip.t ................................ ok t/immutable/immutable_trigger_from_constructor.t ................. ok t/immutable/inline_close_over.t .................................. skipped: Need Data::Visitor 0.26 t/immutable/inline_fallbacks.t ................................... ok t/immutable/inlined_constructors_n_types.t ....................... ok t/immutable/multiple_demolish_inline.t ........................... ok t/metaclasses/create_anon_with_required_attr.t ................... ok t/metaclasses/custom_attr_meta_as_role.t ......................... ok t/metaclasses/custom_attr_meta_with_roles.t ...................... ok t/metaclasses/easy_init_meta.t ................................... ok t/metaclasses/export_with_prototype.t ............................ ok t/metaclasses/exporter_also_with_trait.t ......................... ok t/metaclasses/exporter_meta_lookup.t ............................. ok t/metaclasses/exporter_sub_names.t ............................... ok t/metaclasses/goto_moose_import.t ................................ ok t/metaclasses/immutable_metaclass_compat_bug.t ................... ok t/metaclasses/meta_name.t ........................................ ok t/metaclasses/metaclass_compat.t ................................. ok t/metaclasses/metaclass_compat_no_fixing_bug.t ................... ok t/metaclasses/metaclass_compat_role_conflicts.t .................. ok t/metaclasses/metaclass_parameterized_traits.t ................... ok t/metaclasses/metaclass_traits.t ................................. ok t/metaclasses/metarole.t ......................................... ok t/metaclasses/metarole_combination.t ............................. ok t/metaclasses/metarole_on_anon.t ................................. ok t/metaclasses/metarole_w_metaclass_pm.t .......................... ok t/metaclasses/metaroles_of_metaroles.t ........................... ok t/metaclasses/moose_exporter.t ................................... ok t/metaclasses/moose_exporter_trait_aliases.t ..................... ok t/metaclasses/moose_for_meta.t ................................... ok t/metaclasses/moose_nonmoose_metatrait_init_order.t .............. ok t/metaclasses/moose_nonmoose_moose_chain_init_meta.t ............. ok t/metaclasses/moose_w_metaclass.t ................................ ok t/metaclasses/new_metaclass.t .................................... ok t/metaclasses/new_object_BUILD.t ................................. ok t/metaclasses/overloading.t ...................................... ok t/metaclasses/reinitialize.t ..................................... ok t/metaclasses/use_base_of_moose.t ................................ ok t/moose_util/apply_roles.t ....................................... ok t/moose_util/create_alias.t ...................................... ok t/moose_util/ensure_all_roles.t .................................. ok t/moose_util/method_mod_args.t ................................... ok t/moose_util/moose_util.t ........................................ ok t/moose_util/moose_util_does_role.t .............................. ok t/moose_util/moose_util_search_class_by_role.t ................... ok t/moose_util/resolve_alias.t ..................................... ok t/moose_util/with_traits.t ....................................... ok t/native_traits/array_coerce.t ................................... ok t/native_traits/array_from_role.t ................................ ok t/native_traits/array_subtypes.t ................................. ok t/native_traits/array_trigger.t .................................. ok t/native_traits/collection_with_roles.t .......................... ok t/native_traits/custom_instance.t ................................ ok t/native_traits/hash_coerce.t .................................... ok t/native_traits/hash_subtypes.t .................................. ok t/native_traits/hash_trigger.t ................................... ok t/native_traits/remove_attribute.t ............................... ok t/native_traits/shallow_clone.t .................................. ok t/native_traits/trait_array.t .................................... ok t/native_traits/trait_bool.t ..................................... ok t/native_traits/trait_code.t ..................................... ok t/native_traits/trait_counter.t .................................. ok t/native_traits/trait_hash.t ..................................... ok t/native_traits/trait_number.t ................................... ok t/native_traits/trait_string.t ................................... ok t/recipes/basics_bankaccount_methodmodifiersandsubclassing.t ..... ok t/recipes/basics_binarytree_attributefeatures.t .................. ok t/recipes/basics_company_subtypes.t .............................. ok t/recipes/basics_datetime_extendingnonmooseparent.t .............. ok t/recipes/basics_document_augmentandinner.t ...................... ok t/recipes/basics_genome_overloadingsubtypesandcoercion.t ......... ok t/recipes/basics_http_subtypesandcoercion.t ...................... ok t/recipes/basics_point_attributesandsubclassing.t ................ ok t/recipes/extending_debugging_baseclassrole.t .................... ok t/recipes/extending_mooseish_moosesugar.t ........................ ok t/recipes/legacy_debugging_baseclassreplacement.t ................ ok t/recipes/legacy_labeled_attributemetaclass.t .................... ok t/recipes/meta_globref_instancemetaclass.t ....................... ok t/recipes/meta_labeled_attributetrait.t .......................... ok t/recipes/meta_privateorpublic_methodmetaclass.t ................. ok t/recipes/meta_table_metaclasstrait.t ............................ ok t/recipes/roles_applicationtoinstance.t .......................... ok t/recipes/roles_comparable_codereuse.t ........................... ok t/recipes/roles_restartable_advancedcomposition.t ................ ok t/roles/anonymous_roles.t ........................................ ok t/roles/application_toclass.t .................................... ok t/roles/apply_role.t ............................................. ok t/roles/build.t .................................................. ok t/roles/conflict_many_methods.t .................................. ok t/roles/create_role.t ............................................ ok t/roles/create_role_subclass.t ................................... ok t/roles/empty_method_modifiers_meta_bug.t ........................ ok t/roles/extending_role_attrs.t ................................... ok t/roles/free_anonymous_roles.t ................................... ok t/roles/imported_required_method.t ............................... ok t/roles/meta_role.t .............................................. ok t/roles/method_aliasing_in_composition.t ......................... ok t/roles/method_exclusion_in_composition.t ........................ ok t/roles/method_modifiers.t ....................................... ok t/roles/methods.t ................................................ ok t/roles/more_alias_and_exclude.t ................................. ok t/roles/more_role_edge_cases.t ................................... ok t/roles/new_meta_role.t .......................................... ok t/roles/overloading_combine_to_class.t ........................... ok t/roles/overloading_combine_to_instance.t ........................ ok t/roles/overloading_combine_to_role.t ............................ ok t/roles/overloading_composition_errors.t ......................... ok t/roles/overloading_remove_attributes_bug.t ...................... ok t/roles/overloading_to_class.t ................................... ok t/roles/overloading_to_instance.t ................................ ok t/roles/overloading_to_role.t .................................... ok t/roles/overriding.t ............................................. ok t/roles/reinitialize_anon_role.t ................................. ok t/roles/role.t ................................................... ok t/roles/role_attr_application.t .................................. ok t/roles/role_attribute_conflict.t ................................ ok t/roles/role_attrs.t ............................................. ok t/roles/role_compose_requires.t .................................. ok t/roles/role_composite.t ......................................... ok t/roles/role_composite_exclusion.t ............................... ok t/roles/role_composition_attributes.t ............................ ok t/roles/role_composition_conflict_detection.t .................... ok t/roles/role_composition_errors.t ................................ ok t/roles/role_composition_method_mods.t ........................... ok t/roles/role_composition_methods.t ............................... ok t/roles/role_composition_override.t .............................. ok t/roles/role_composition_req_methods.t ........................... ok t/roles/role_conflict_detection.t ................................ ok t/roles/role_conflict_edge_cases.t ............................... ok t/roles/role_consumers.t ......................................... ok t/roles/role_exclusion.t ......................................... ok t/roles/role_exclusion_and_alias_bug.t ........................... ok t/roles/role_for_combination.t ................................... ok t/roles/roles_and_method_cloning.t ............................... ok t/roles/roles_and_req_method_edge_cases.t ........................ ok t/roles/roles_applied_in_create.t ................................ ok t/roles/run_time_role_composition.t .............................. ok t/roles/runtime_roles_and_attrs.t ................................ ok t/roles/runtime_roles_and_nonmoose.t ............................. ok t/roles/runtime_roles_w_params.t ................................. ok t/roles/use_base_does.t .......................................... ok t/test_moose/test_moose.t ........................................ ok t/test_moose/test_moose_does_ok.t ................................ ok t/test_moose/test_moose_has_attribute_ok.t ....................... ok t/test_moose/test_moose_meta_ok.t ................................ ok t/test_moose/with_immutable.t .................................... ok t/todo_tests/exception_reflects_failed_constraint.t .............. ok t/todo_tests/immutable_n_around.t ................................ ok t/todo_tests/moose_and_threads.t ................................. ok t/todo_tests/replacing_super_methods.t ........................... ok t/todo_tests/required_role_accessors.t ........................... ok t/todo_tests/role_insertion_order.t .............................. ok t/todo_tests/various_role_features.t ............................. ok t/todo_tests/wrong-inner.t ....................................... ok t/type_constraints/advanced_type_creation.t ...................... ok t/type_constraints/class_subtypes.t .............................. ok t/type_constraints/class_type_constraint.t ....................... ok t/type_constraints/coerced_parameterized_types.t ................. ok t/type_constraints/container_type_coercion.t ..................... ok t/type_constraints/container_type_constraint.t ................... ok t/type_constraints/custom_parameterized_types.t .................. ok t/type_constraints/custom_type_errors.t .......................... ok t/type_constraints/define_type_twice_throws.t .................... ok t/type_constraints/duck_type_handles.t ........................... ok t/type_constraints/duck_types.t .................................. ok t/type_constraints/enum.t ........................................ ok t/type_constraints/inlining.t .................................... ok t/type_constraints/match_type_operator.t ......................... ok t/type_constraints/maybe_type_constraint.t ....................... ok t/type_constraints/misc_type_tests.t ............................. ok t/type_constraints/name_conflicts.t .............................. ok t/type_constraints/normalize_type_name.t ......................... ok t/type_constraints/parameterize_from.t ........................... ok t/type_constraints/role_type_constraint.t ........................ ok t/type_constraints/subtype_auto_vivify_parent.t .................. ok t/type_constraints/subtyping_parameterized_types.t ............... ok t/type_constraints/subtyping_union_types.t ....................... ok t/type_constraints/throw_error.t ................................. ok t/type_constraints/type_coersion_on_lazy_attributes.t ............ ok t/type_constraints/type_names.t .................................. ok t/type_constraints/type_notation_parser.t ........................ ok t/type_constraints/types_and_undef.t ............................. ok t/type_constraints/union_is_a_type_of.t .......................... ok t/type_constraints/union_types.t ................................. ok t/type_constraints/union_types_and_coercions.t ................... ok t/type_constraints/util_find_type_constraint.t ................... ok t/type_constraints/util_more_type_coercion.t ..................... ok t/type_constraints/util_std_type_constraints.t ................... ok t/type_constraints/util_type_coercion.t .......................... ok t/type_constraints/util_type_constraints.t ....................... ok t/type_constraints/util_type_constraints_export.t ................ ok t/type_constraints/util_type_reloading.t ......................... ok t/type_constraints/with-specio.t ................................. ok t/type_constraints/with-type-tiny.t .............................. ok t/zzz-check-breaks.t ............................................. ok Test Summary Report ------------------- t/cmop/methods.t (Wstat: 512 (exited 2) Tests: 81 Failed: 2) Failed tests: 53, 68 Non-zero exit status: 2 Files=478, Tests=17534, 126 wallclock secs ( 3.41 usr 1.10 sys + 109.56 cusr 14.99 csys = 129.06 CPU) Result: FAIL Failed 1/478 test programs. 2/17534 subtests failed. make: *** [Makefile:2050: test_dynamic] Error 255 error: Bad exit status from /tmp/B.8xtwfat7/BUILD/tmp/rpm-tmp.XUMpb7 (%build) RPM build warnings: Could not canonicalize hostname: ymir RPM build errors: Bad exit status from /tmp/B.8xtwfat7/BUILD/tmp/rpm-tmp.XUMpb7 (%build) ended at: Sun Jun 30 16:04:31 2024, done in 0:02:11.612216 error: No files produced. + chmod -R u+rwX /tmp/B.8xtwfat7/BUILD + rm -rf /tmp/B.8xtwfat7/tmp /tmp/B.8xtwfat7/BUILD + rm -rf /tmp/B.8xtwfat7 Begin-PLD-Builder-Info Build-Time: user:130.44s sys:20.53s real:146.13s (faults io:3 non-io:3530979) End-PLD-Builder-Info
[Back to list of logs] [View rpm -qa of builder]