FailedOk

th/SRPMS[OK]
th/x32[OK]
th/i686[OK]
th/x86_64[OK]

ac/SRPMS[OK]
ac/i386[OK]
ac/i586[OK]
ac/i686[OK]
ac/alpha[OK]
ac/amd64[OK]
ac/athlon[OK]
ac/ppc[OK]
ac/sparc[OK]
ac/sparc64[OK]

Advanced Search
main()
Powered by PLD Linux
(c) 2002-2022 PLD Team
$Revision: 1.37 $
Powered by quantum bogodynamics.
Your IP: 44.197.108.169

polybar 85667e3a-cfc1-4b71-b08a-1fcf2c1695ef

Status:Failed
Source URL:https://buildlogs.pld-linux.org/pld/th/x86_64/FAIL/polybar,85667e3a-cfc1-4b71-b08a-1fcf2c1695ef.bz2
text/plain URL:View!
rpm -qa of builder:View!
Date:2022/11/03 12:10:33
Runtime:0:00:09.532632

Toc:

  • prep
  • Executing(%prep): /bin/sh -e /tmp/B.dtjshvi2/BUILD/tmp/rpm-tmp.y3rqJP
  • build
  • Executing(%build): /bin/sh -e /tmp/B.dtjshvi2/BUILD/tmp/rpm-tmp.Ktqqvg
  • install
  • Executing(%install): /bin/sh -e /tmp/B.dtjshvi2/BUILD/tmp/rpm-tmp.NVEUEe
  • error 1
  • EOFError: Ran out of input
  • error 2
  • make[2]: *** [doc/CMakeFiles/doc_html.dir/build.make:74: doc/CMakeFiles/doc_html] Error 2
  • error 3
  • make[1]: *** [CMakeFiles/Makefile2:391: doc/CMakeFiles/doc_html.dir/all] Error 2
  • error 4
  • error: Bad exit status from /tmp/B.dtjshvi2/BUILD/tmp/rpm-tmp.NVEUEe (%install)
  • error 5
  • RPM build errors:
  • error 6
  • error: No files produced.

Content:

request from: atler
checking if we should skip the build
started at: Thu Nov  3 12:10:21 2022
killing old processes on a builder
sending signal 9 to pid -1
cleaning up /tmp
fetching https://srcbuilder.pld-linux.org/th//srpms/85667e3a-cfc1-4b71-b08a-1fcf2c1695ef/polybar-3.6.3-1.src.rpm
fetched 450516 bytes, 1023.1 K/s
installing srpm: polybar-3.6.3-1.src.rpm
+ install -d /tmp/B.dtjshvi2/BUILD /tmp/B.dtjshvi2/RPMS
+ LC_ALL=en_US.UTF-8
+ rpm -qp --changelog polybar-3.6.3-1.src.rpm
* Thu Nov 03 2022 PLD Linux Team <feedback@pld-linux.org>
- For complete changelog see: http://git.pld-linux.org/?p=packages/polybar.git;a=log;h=master
* Wed Jun 15 2022 Jan Palus <atler@pld-linux.org> 459ddd3
- up to 3.6.3 * Tue Sep 21 2021 Jan Palus <atler@pld-linux.org> 6399b72
- upstream patch for increasing precision of network speed * Tue Sep 21 2021 Jan Palus <atler@pld-linux.org> a3cde44
- up to 3.5.7 * Mon May 24 2021 Jan Palus <atler@pld-linux.org> d8099a7
- up to 3.5.6 * Sun Mar 14 2021 Jan Palus <atler@pld-linux.org> e8f4381
- up to 3.5.5 * Sun Feb 28 2021 Jan Rękorajski <baggins@pld-linux.org> c9e175a
- unconditional noarch subpackages * Fri Jan 08 2021 Jan Palus <atler@pld-linux.org> 2bccd74
- up to 3.5.4 * Thu Dec 31 2020 Jan Palus <atler@pld-linux.org> 45abc12
- add patches for reducing overhead of mpd plugin; rel 2 * Thu Dec 24 2020 Jan Palus <atler@pld-linux.org> eaba815
- up to 3.5.3 * Mon Dec 14 2020 Jan Palus <atler@pld-linux.org> 5ba8430
- up to 3.5.2 * Sat Dec 12 2020 Jan Palus <atler@pld-linux.org> ab58030
- up to 3.5.1 * Wed Dec 02 2020 Jan Palus <atler@pld-linux.org> d26473f
- up to 3.5.0 * Sat Jun 13 2020 Jan Palus <atler@pld-linux.org> d2e8211
- release 2 (by relup.sh) * Sat Jun 13 2020 Jan Palus <atler@pld-linux.org> 7759ced
- BR: i3, pulseaudio (for moronic support detection mechanism) * Mon May 18 2020 Jan Palus <atler@pld-linux.org> 1319050
- up to 3.4.3 * Wed Apr 08 2020 Jan Palus <atler@pld-linux.org> 8ae9a57
- package sample config * Tue Apr 07 2020 Jan Palus <atler@pld-linux.org> 3d06777
- new (version 3.4.2) + rpm -Uhv --nodeps --define '_topdir /tmp/B.dtjshvi2' --define '_specdir %{_topdir}' --define '_sourcedir %{_specdir}' --define '_rpmdir %{_topdir}/RPMS' --define '_builddir %{_topdir}/BUILD' polybar-3.6.3-1.src.rpm Updating / installing... polybar-3.6.3-1 ######################################## + rm -f polybar-3.6.3-1.src.rpm + install -m 700 -d /tmp/B.dtjshvi2/BUILD/tmp + TMPDIR=/tmp/B.dtjshvi2/BUILD/tmp + exec nice -n 0 rpmbuild -bp --short-circuit --nodeps --define '_topdir /tmp/B.dtjshvi2' --define '_specdir %{_topdir}' --define '_sourcedir %{_specdir}' --define '_rpmdir %{_topdir}/RPMS' --define '_builddir %{_topdir}/BUILD' --target x86_64-pld-linux --define 'prep exit 0' /tmp/B.dtjshvi2/polybar.spec warning: Could not canonicalize hostname: ymir Building target platforms: x86_64-pld-linux Building for target x86_64-pld-linux RPM build warnings: Could not canonicalize hostname: ymir checking BuildConflict-ing packages rpm: warning: Could not canonicalize hostname: ymir rpm: Building target platforms: x86_64-pld-linux rpm: Building for target x86_64-pld-linux rpm: rpm: RPM build warnings: rpm: Could not canonicalize hostname: ymir no BuildConflicts found checking BR rpm: warning: Could not canonicalize hostname: ymir rpm: Building target platforms: x86_64-pld-linux rpm: Building for target x86_64-pld-linux rpm: rpm: RPM build warnings: rpm: Could not canonicalize hostname: ymir no BR needed building RPM using: set -ex; : build-id: 85667e3a-cfc1-4b71-b08a-1fcf2c1695ef; TMPDIR=/tmp/B.dtjshvi2/BUILD/tmp exec nice -n 0 rpmbuild -bb --define '__jobs 28' --define '_smp_mflags -j28' --define '_make_opts -Otarget' --define '_pld_builder 1' --define '_topdir /tmp/B.dtjshvi2' --define '_specdir %{_topdir}' --define '_sourcedir %{_specdir}' --define '_rpmdir %{_topdir}/RPMS' --define '_builddir %{_topdir}/BUILD' --target x86_64-pld-linux /tmp/B.dtjshvi2/polybar.spec + : build-id: 85667e3a-cfc1-4b71-b08a-1fcf2c1695ef + TMPDIR=/tmp/B.dtjshvi2/BUILD/tmp + exec nice -n 0 rpmbuild -bb --define '__jobs 28' --define '_smp_mflags -j28' --define '_make_opts -Otarget' --define '_pld_builder 1' --define '_topdir /tmp/B.dtjshvi2' --define '_specdir %{_topdir}' --define '_sourcedir %{_specdir}' --define '_rpmdir %{_topdir}/RPMS' --define '_builddir %{_topdir}/BUILD' --target x86_64-pld-linux /tmp/B.dtjshvi2/polybar.spec warning: Could not canonicalize hostname: ymir Building target platforms: x86_64-pld-linux Building for target x86_64-pld-linux Executing(%prep): /bin/sh -e /tmp/B.dtjshvi2/BUILD/tmp/rpm-tmp.y3rqJP + umask 022 + cd /tmp/B.dtjshvi2/BUILD + cd /tmp/B.dtjshvi2/BUILD + rm -rf polybar-3.6.3 + /bin/gzip -dc /tmp/B.dtjshvi2/polybar-3.6.3.tar.gz + /bin/tar -xof - + STATUS=0 + '[' 0 -ne 0 ']' + cd polybar-3.6.3 + /bin/chmod -Rf a+rX,u+w,g-w,o-w . + RPM_EC=0 + jobs -p + exit 0 Executing(%build): /bin/sh -e /tmp/B.dtjshvi2/BUILD/tmp/rpm-tmp.Ktqqvg TMP=/home/users/builder/tmp HOME=/home/users/builder PATH=/home/users/builder/GNUstep/Tools:/bin:/usr/bin:/usr/local/bin:/home/users/builder/bin TMPDIR=/tmp/B.dtjshvi2/BUILD/tmp + umask 022 + cd /tmp/B.dtjshvi2/BUILD + cd polybar-3.6.3 + install -d build + cd build + CC=x86_64-pld-linux-gcc CXX=x86_64-pld-linux-g++ CPPFLAGS='' /usr/bin/cmake '-DCMAKE_VERBOSE_MAKEFILE:BOOL=ON' '-DCMAKE_BUILD_TYPE=PLD' '-DCMAKE_INSTALL_BINDIR:PATH=/usr/bin' '-DCMAKE_INSTALL_SBINDIR:PATH=/usr/sbin' '-DCMAKE_INSTALL_LIBEXECDIR:PATH=/usr/libexec' '-DCMAKE_INSTALL_SYSCONFDIR:PATH=/etc' '-DCMAKE_INSTALL_SHAREDSTATEDIRPATH:PATH=/var/lib' '-DCMAKE_INSTALL_LOCALSTATEDIRPATH:PATH=/var' '-DCMAKE_INSTALL_LIBDIR:PATH=/usr/lib64' '-DCMAKE_INSTALL_INCLUDEDIR:PATH=/usr/include' '-DCMAKE_INSTALL_OLDINCLUDEDIR:PATH=/usr/include' '-DCMAKE_INSTALL_DATAROOTDIR:PATH=/usr/share' '-DCMAKE_INSTALL_DATADIR:PATH=/usr/share' '-DCMAKE_INSTALL_INFODIR:PATH=/usr/share/info' '-DCMAKE_INSTALL_LOCALEDIR:PATH=/usr/share/locale' '-DCMAKE_INSTALL_MANDIR:PATH=/usr/share/man' '-DCMAKE_INSTALL_DOCDIR:PATH=/usr/share/doc' '-DCMAKE_INSTALL_PREFIX:PATH=/usr' '-DSYSCONF_INSTALL_DIR:PATH=/etc' '-DCMAKE_CXX_FLAGS_PLD=-O2 -fwrapv -pipe -Wformat -Werror=format-security -gdwarf-4 -fno-debug-types-section -fvar-tracking-assignments -g2 -Wp,-D_FORTIFY_SOURCE=2 -fstack-protector-strong --param=ssp-buffer-size=4 -Werror=trampolines -fPIC -march=x86-64 -mtune=generic -gdwarf-4 -fno-debug-types-section -fvar-tracking-assignments -g2 -DNDEBUG -DQT_NO_DEBUG' '-DCMAKE_C_FLAGS_PLD=-O2 -fwrapv -pipe -Wformat -Werror=format-security -gdwarf-4 -fno-debug-types-section -fvar-tracking-assignments -g2 -Wp,-D_FORTIFY_SOURCE=2 -fstack-protector-strong --param=ssp-buffer-size=4 -Werror=trampolines -fPIC -march=x86-64 -mtune=generic -gdwarf-4 -fno-debug-types-section -fvar-tracking-assignments -g2 -DNDEBUG -DQT_NO_DEBUG' '-DCMAKE_Fortran_FLAGS_PLD=-O2 -fwrapv -pipe -Wformat -Werror=format-security -gdwarf-4 -fno-debug-types-section -fvar-tracking-assignments -g2 -Wp,-D_FORTIFY_SOURCE=2 -fstack-protector-strong --param=ssp-buffer-size=4 -Werror=trampolines -fPIC -march=x86-64 -mtune=generic -gdwarf-4 -fno-debug-types-section -fvar-tracking-assignments -g2 -DNDEBUG -DQT_NO_DEBUG' '-DCMAKE_EXE_LINKER_FLAGS_PLD=-Wl,--as-needed -Wl,--no-copy-dt-needed-entries -Wl,-z,relro -Wl,-z,combreloc ' '-DCMAKE_SHARED_LINKER_FLAGS_PLD=-Wl,--as-needed -Wl,--no-copy-dt-needed-entries -Wl,-z,relro -Wl,-z,combreloc ' '-DCMAKE_MODULE_LINKER_FLAGS_PLD=-Wl,--as-needed -Wl,--no-copy-dt-needed-entries -Wl,-z,relro -Wl,-z,combreloc ' '-DLIB_SUFFIX=64' '-DBUILD_SHARED_LIBS:BOOL=ON' .. -- The CXX compiler identification is GNU 12.2.0 -- Detecting CXX compiler ABI info -- Detecting CXX compiler ABI info - done -- Check for working CXX compiler: /usr/bin/x86_64-pld-linux-g++ - skipped -- Detecting CXX compile features -- Detecting CXX compile features - done -- Could not detect version with git, falling back to built-in version information. -- Couldn't locate ccache, disabling ccache... -- Performing Test HAS_SUGGEST_OVERRIDE -- Performing Test HAS_SUGGEST_OVERRIDE - Success -- Using supported compiler GNU-12.2.0 -- Found PkgConfig: /usr/bin/pkg-config (found version "0.29.2") -- Performing Test CMAKE_HAVE_LIBC_PTHREAD -- Performing Test CMAKE_HAVE_LIBC_PTHREAD - Success -- Found Threads: TRUE -- Checking for module 'cairo-fc' -- Found cairo-fc, version 1.16.0 -- Found CairoFC: /usr/include/cairo;/usr/include/pixman-1;/usr/include/freetype2;/usr/include/libpng16;/usr/include/harfbuzz;/usr/include/glib-2.0;/usr/lib64/glib-2.0/include (found version "1.16.0") -- Checking for module 'libuv' -- Found libuv, version 1.44.2 -- Found LibUV: /usr/include (found suitable version "1.44.2", minimum required is "1.3.0") -- Checking for module 'alsa' -- Found alsa, version 1.2.8 -- Found ALSA: /usr/include (found version "1.2.8") -- Checking for module 'libcurl' -- Found libcurl, version 7.86.0 -- Found CURL: /usr/include (found version "7.86.0") -- Checking for module 'libmpdclient' -- Found libmpdclient, version 2.20 -- Found LibMPDClient: /usr/include (found version "2.20") -- Checking for module 'libnl-genl-3.0' -- Found libnl-genl-3.0, version 3.7.0 -- Found LibNlGenl3: /usr/include/libnl3 (found version "3.7.0") -- Checking for module 'libpulse' -- Found libpulse, version 16.1 -- Found LibPulse: /usr/include (found version "16.1") -- Checking for module 'xcb-randr' -- Found xcb-randr, version 1.15 -- Found Xcb_RANDR: /usr/include (found suitable version "1.15", minimum required is "1.12") -- Checking for module 'xcb-composite' -- Found xcb-composite, version 1.15 -- Found Xcb_COMPOSITE: /usr/include (found version "1.15") -- Checking for module 'xcb-xkb' -- Found xcb-xkb, version 1.15 -- Found Xcb_XKB: /usr/include (found version "1.15") -- Checking for module 'xcb-cursor' -- Found xcb-cursor, version 0.1.4 -- Found Xcb_CURSOR: /usr/include (found version "0.1.4") -- Checking for module 'xcb-xrm' -- Found xcb-xrm, version 1.3 -- Found Xcb_XRM: /usr/include (found version "1.3") -- The C compiler identification is GNU 12.2.0 -- Detecting C compiler ABI info -- Detecting C compiler ABI info - done -- Check for working C compiler: /usr/bin/x86_64-pld-linux-gcc - skipped -- Detecting C compile features -- Detecting C compile features - done -- Checking for module 'xcb-proto' -- Found xcb-proto, version 1.15.2 -- Found PythonInterp: /usr/bin/python3 (found suitable version "3.10.8", minimum required is "3.5") -- XCB[XCB]: Found component XCB -- Found XCB_XCB: /usr/lib64/libxcb.so -- XCB[ICCCM]: Found component ICCCM -- Found XCB_ICCCM: /usr/lib64/libxcb-icccm.so -- XCB[EWMH]: Found component EWMH -- Found XCB_EWMH: /usr/lib64/libxcb-ewmh.so -- XCB[UTIL]: Found component UTIL -- Found XCB_UTIL: /usr/lib64/libxcb-util.so -- XCB[IMAGE]: Found component IMAGE -- Found XCB_IMAGE: /usr/lib64/libxcb-image.so -- Found XCB: /usr/lib64/libxcb.so;/usr/lib64/libxcb-icccm.so;/usr/lib64/libxcb-ewmh.so;/usr/lib64/libxcb-util.so;/usr/lib64/libxcb-image.so -- Searching for xcbgen with /usr/bin/python3 -- Found xcbgen in /usr/share/python3.10/site-packages -- XCB[RANDR]: Found component RANDR -- Found XCB_RANDR: /usr/lib64/libxcb-randr.so -- Found XCB: /usr/lib64/libxcb.so;/usr/lib64/libxcb-icccm.so;/usr/lib64/libxcb-ewmh.so;/usr/lib64/libxcb-util.so;/usr/lib64/libxcb-image.so;/usr/lib64/libxcb-randr.so -- XCB[COMPOSITE]: Found component COMPOSITE -- Found XCB_COMPOSITE: /usr/lib64/libxcb-composite.so -- Found XCB: /usr/lib64/libxcb.so;/usr/lib64/libxcb-icccm.so;/usr/lib64/libxcb-ewmh.so;/usr/lib64/libxcb-util.so;/usr/lib64/libxcb-image.so;/usr/lib64/libxcb-randr.so;/usr/lib64/libxcb-composite.so -- XCB[XKB]: Found component XKB -- Found XCB_XKB: /usr/lib64/libxcb-xkb.so -- Found XCB: /usr/lib64/libxcb.so;/usr/lib64/libxcb-icccm.so;/usr/lib64/libxcb-ewmh.so;/usr/lib64/libxcb-util.so;/usr/lib64/libxcb-image.so;/usr/lib64/libxcb-randr.so;/usr/lib64/libxcb-composite.so;/usr/lib64/libxcb-xkb.so -- xpp: including xcb proto composite.xml -- xpp: including xcb proto randr.xml -- xpp: including xcb proto xkb.xml -- xpp: including xcb proto xproto.xml -- Checking for module 'jsoncpp' -- Found jsoncpp, version 1.9.5 -- Build: --  Version: 3.6.3 --  Type: PLD --  CXX: /usr/bin/x86_64-pld-linux-g++ -O2 -fwrapv -pipe -Wformat -Werror=format-security -gdwarf-4 -fno-debug-types-section -fvar-tracking-assignments -g2 -Wp,-D_FORTIFY_SOURCE=2 -fstack-protector-strong --param=ssp-buffer-size=4 -Werror=trampolines -fPIC -march=x86-64 -mtune=generic -gdwarf-4 -fno-debug-types-section -fvar-tracking-assignments -g2 -DNDEBUG -DQT_NO_DEBUG -Wall -Wextra -Wpedantic -Wsuggest-override --  LD: /usr/bin/ld -Wall -Wextra -Wpedantic -Wsuggest-override -Wl,--as-needed -Wl,--no-copy-dt-needed-entries -Wl,-z,relro -Wl,-z,combreloc -Wall -Wextra -Wpedantic -Wsuggest-override --  sphinx-build: /usr/bin/sphinx-build  -- Install Paths: --  PREFIX: /usr --  BINDIR: /usr/bin --  DATADIR: /usr/share --  DOCDIR: /usr/share/doc --  MANDIR: /usr/share/man -- Targets: -- [X] polybar -- [X] polybar-msg -- [ ] testsuite -- [X] documentation -- [X] html -- [X] man -- [X] default config -- [X] shell files -- Module support: -- [X] alsa (1.2.8) -- [X] curl (7.86.0) -- [X] i3 -- [X] mpd (2.20) -- [X] network (libnl) (3.7.0) -- [X] pulseaudio (16.1) -- [X] xkeyboard (1.15) -- X extensions: -- [X] xcb-randr (1.15) -- [X] xcb-randr (monitor support) (1.15) -- [X] xcb-composite (1.15) -- [X] xcb-xkb (1.15) -- [X] xcb-xrm (1.3) -- [X] xcb-cursor (0.1.4) -- Log options: -- [X] Trace logging -- Configuring done -- Generating done CMake Warning: Manually-specified variables were not used by the project: CMAKE_Fortran_FLAGS_PLD CMAKE_INSTALL_LOCALSTATEDIRPATH CMAKE_INSTALL_SHAREDSTATEDIRPATH LIB_SUFFIX SYSCONF_INSTALL_DIR -- Build files have been written to: /tmp/B.dtjshvi2/BUILD/polybar-3.6.3/build + RPM_EC=0 + jobs -p + exit 0 Executing(%install): /bin/sh -e /tmp/B.dtjshvi2/BUILD/tmp/rpm-tmp.NVEUEe TMP=/home/users/builder/tmp HOME=/home/users/builder PATH=/home/users/builder/GNUstep/Tools:/bin:/usr/bin:/usr/local/bin:/home/users/builder/bin TMPDIR=/tmp/B.dtjshvi2/BUILD/tmp + umask 022 + cd /tmp/B.dtjshvi2/BUILD + /bin/rm '--interactive=never' -rf /tmp/B.dtjshvi2/BUILD/tmp/polybar-3.6.3-x86_64-root-builder + /bin/mkdir -p /tmp/B.dtjshvi2/BUILD/tmp/polybar-3.6.3-x86_64-root-builder + cd polybar-3.6.3 + rm -rf /tmp/B.dtjshvi2/BUILD/tmp/polybar-3.6.3-x86_64-root-builder + /usr/bin/make -Otarget -j28 -C build install 'DESTDIR=/tmp/B.dtjshvi2/BUILD/tmp/polybar-3.6.3-x86_64-root-builder' make: Entering directory '/tmp/B.dtjshvi2/BUILD/polybar-3.6.3/build' /usr/bin/cmake -S/tmp/B.dtjshvi2/BUILD/polybar-3.6.3 -B/tmp/B.dtjshvi2/BUILD/polybar-3.6.3/build --check-build-system CMakeFiles/Makefile.cmake 0 make: Leaving directory '/tmp/B.dtjshvi2/BUILD/polybar-3.6.3/build' make: Entering directory '/tmp/B.dtjshvi2/BUILD/polybar-3.6.3/build' /usr/bin/cmake -E cmake_progress_start /tmp/B.dtjshvi2/BUILD/polybar-3.6.3/build/CMakeFiles /tmp/B.dtjshvi2/BUILD/polybar-3.6.3/build//CMakeFiles/progress.marks make: Leaving directory '/tmp/B.dtjshvi2/BUILD/polybar-3.6.3/build' /usr/bin/make -f CMakeFiles/Makefile2 all /usr/bin/make -f doc/CMakeFiles/doc_man.dir/build.make doc/CMakeFiles/doc_man.dir/depend /usr/bin/make -f doc/CMakeFiles/doc_html.dir/build.make doc/CMakeFiles/doc_html.dir/depend /usr/bin/make -f lib/xpp/CMakeFiles/xpp.dir/build.make lib/xpp/CMakeFiles/xpp.dir/depend /usr/bin/make -f lib/i3ipcpp/CMakeFiles/i3ipc++.dir/build.make lib/i3ipcpp/CMakeFiles/i3ipc++.dir/depend make[2]: Entering directory '/tmp/B.dtjshvi2/BUILD/polybar-3.6.3/build' cd /tmp/B.dtjshvi2/BUILD/polybar-3.6.3/build && /usr/bin/cmake -E cmake_depends "Unix Makefiles" /tmp/B.dtjshvi2/BUILD/polybar-3.6.3 /tmp/B.dtjshvi2/BUILD/polybar-3.6.3/doc /tmp/B.dtjshvi2/BUILD/polybar-3.6.3/build /tmp/B.dtjshvi2/BUILD/polybar-3.6.3/build/doc /tmp/B.dtjshvi2/BUILD/polybar-3.6.3/build/doc/CMakeFiles/doc_man.dir/DependInfo.cmake --color= make[2]: Leaving directory '/tmp/B.dtjshvi2/BUILD/polybar-3.6.3/build' make[2]: Entering directory '/tmp/B.dtjshvi2/BUILD/polybar-3.6.3/build' cd /tmp/B.dtjshvi2/BUILD/polybar-3.6.3/build && /usr/bin/cmake -E cmake_depends "Unix Makefiles" /tmp/B.dtjshvi2/BUILD/polybar-3.6.3 /tmp/B.dtjshvi2/BUILD/polybar-3.6.3/doc /tmp/B.dtjshvi2/BUILD/polybar-3.6.3/build /tmp/B.dtjshvi2/BUILD/polybar-3.6.3/build/doc /tmp/B.dtjshvi2/BUILD/polybar-3.6.3/build/doc/CMakeFiles/doc_html.dir/DependInfo.cmake --color= make[2]: Leaving directory '/tmp/B.dtjshvi2/BUILD/polybar-3.6.3/build' make[2]: Entering directory '/tmp/B.dtjshvi2/BUILD/polybar-3.6.3/build' cd /tmp/B.dtjshvi2/BUILD/polybar-3.6.3/build && /usr/bin/cmake -E cmake_depends "Unix Makefiles" /tmp/B.dtjshvi2/BUILD/polybar-3.6.3 /tmp/B.dtjshvi2/BUILD/polybar-3.6.3/lib/i3ipcpp /tmp/B.dtjshvi2/BUILD/polybar-3.6.3/build /tmp/B.dtjshvi2/BUILD/polybar-3.6.3/build/lib/i3ipcpp /tmp/B.dtjshvi2/BUILD/polybar-3.6.3/build/lib/i3ipcpp/CMakeFiles/i3ipc++.dir/DependInfo.cmake --color= make[2]: Leaving directory '/tmp/B.dtjshvi2/BUILD/polybar-3.6.3/build' /usr/bin/make -f doc/CMakeFiles/doc_man.dir/build.make doc/CMakeFiles/doc_man.dir/build /usr/bin/make -f doc/CMakeFiles/doc_html.dir/build.make doc/CMakeFiles/doc_html.dir/build /usr/bin/make -f lib/i3ipcpp/CMakeFiles/i3ipc++.dir/build.make lib/i3ipcpp/CMakeFiles/i3ipc++.dir/build make[2]: Entering directory '/tmp/B.dtjshvi2/BUILD/polybar-3.6.3/build' [ 3%] Generating generated-sources/include/xpp/proto/composite.hpp cd /tmp/B.dtjshvi2/BUILD/polybar-3.6.3/build/lib/xpp && /usr/bin/python3 /tmp/B.dtjshvi2/BUILD/polybar-3.6.3/lib/xpp/generators/cpp_client.py -p /usr/share/python3.10/site-packages //usr/share/xcb/composite.xml > /tmp/B.dtjshvi2/BUILD/polybar-3.6.3/build/lib/xpp/generated-sources/include/xpp/proto/composite.hpp make[2]: Leaving directory '/tmp/B.dtjshvi2/BUILD/polybar-3.6.3/build' make[2]: Entering directory '/tmp/B.dtjshvi2/BUILD/polybar-3.6.3/build' [ 2%] Generating generated-sources/include/xpp/proto/xkb.hpp cd /tmp/B.dtjshvi2/BUILD/polybar-3.6.3/build/lib/xpp && /usr/bin/python3 /tmp/B.dtjshvi2/BUILD/polybar-3.6.3/lib/xpp/generators/cpp_client.py -p /usr/share/python3.10/site-packages //usr/share/xcb/xkb.xml > /tmp/B.dtjshvi2/BUILD/polybar-3.6.3/build/lib/xpp/generated-sources/include/xpp/proto/xkb.hpp make[2]: Leaving directory '/tmp/B.dtjshvi2/BUILD/polybar-3.6.3/build' make[2]: Entering directory '/tmp/B.dtjshvi2/BUILD/polybar-3.6.3/build' [ 1%] Generating generated-sources/include/xpp/proto/randr.hpp cd /tmp/B.dtjshvi2/BUILD/polybar-3.6.3/build/lib/xpp && /usr/bin/python3 /tmp/B.dtjshvi2/BUILD/polybar-3.6.3/lib/xpp/generators/cpp_client.py -p /usr/share/python3.10/site-packages //usr/share/xcb/randr.xml > /tmp/B.dtjshvi2/BUILD/polybar-3.6.3/build/lib/xpp/generated-sources/include/xpp/proto/randr.hpp list: size, ['red', 'green', 'blue'] list: size, ['red', 'green', 'blue'] make[2]: Leaving directory '/tmp/B.dtjshvi2/BUILD/polybar-3.6.3/build' make[2]: Entering directory '/tmp/B.dtjshvi2/BUILD/polybar-3.6.3/build' [ 6%] Building CXX object lib/i3ipcpp/CMakeFiles/i3ipc++.dir/src/ipc-util.cpp.o cd /tmp/B.dtjshvi2/BUILD/polybar-3.6.3/build/lib/i3ipcpp && /usr/bin/x86_64-pld-linux-g++ -isystem /tmp/B.dtjshvi2/BUILD/polybar-3.6.3/lib/i3ipcpp/3rd/auss/include -isystem /tmp/B.dtjshvi2/BUILD/polybar-3.6.3/lib/i3ipcpp/include -isystem /usr/include/jsoncpp -O2 -fwrapv -pipe -Wformat -Werror=format-security -gdwarf-4 -fno-debug-types-section -fvar-tracking-assignments -g2 -Wp,-D_FORTIFY_SOURCE=2 -fstack-protector-strong --param=ssp-buffer-size=4 -Werror=trampolines -fPIC -march=x86-64 -mtune=generic -gdwarf-4 -fno-debug-types-section -fvar-tracking-assignments -g2 -DNDEBUG -DQT_NO_DEBUG -std=c++11 -Wall -Wextra -Wno-unused-parameter -Wno-deprecated-declarations -std=c++14 -MD -MT lib/i3ipcpp/CMakeFiles/i3ipc++.dir/src/ipc-util.cpp.o -MF CMakeFiles/i3ipc++.dir/src/ipc-util.cpp.o.d -o CMakeFiles/i3ipc++.dir/src/ipc-util.cpp.o -c /tmp/B.dtjshvi2/BUILD/polybar-3.6.3/lib/i3ipcpp/src/ipc-util.cpp make[2]: Leaving directory '/tmp/B.dtjshvi2/BUILD/polybar-3.6.3/build' make[2]: Entering directory '/tmp/B.dtjshvi2/BUILD/polybar-3.6.3/build' [ 5%] sphinx-build html: see doc/builder-html.log cd /tmp/B.dtjshvi2/BUILD/polybar-3.6.3/build/doc && /usr/bin/sphinx-build -b html -c /tmp/B.dtjshvi2/BUILD/polybar-3.6.3/build/doc -d /tmp/B.dtjshvi2/BUILD/polybar-3.6.3/build/doc/doctrees -n /tmp/B.dtjshvi2/BUILD/polybar-3.6.3/doc /tmp/B.dtjshvi2/BUILD/polybar-3.6.3/build/doc/html > builder-html.log /usr/share/python3.10/site-packages/sphinx/builders/html/__init__.py:619: FutureWarning: The configuration setting "embed_images" will be removed in Docutils 1.2. Use "image_loading: link". self.docwriter.write(doctree, destination) Exception occurred: File "/usr/share/python3.10/site-packages/sphinx/environment/__init__.py", line 512, in get_doctree doctree = pickle.load(f) EOFError: Ran out of input The full traceback has been saved in /tmp/B.dtjshvi2/BUILD/tmp/sphinx-err-8w8ztvsi.log, if you want to report the issue to the developers. Please also report this if it was a user error, so that a better error message can be provided next time. A bug report can be filed in the tracker at <https://github.com/sphinx-doc/sphinx/issues>. Thanks! make[2]: *** [doc/CMakeFiles/doc_html.dir/build.make:74: doc/CMakeFiles/doc_html] Error 2 make[2]: Leaving directory '/tmp/B.dtjshvi2/BUILD/polybar-3.6.3/build' make[1]: *** [CMakeFiles/Makefile2:391: doc/CMakeFiles/doc_html.dir/all] Error 2 make[1]: *** Waiting for unfinished jobs.... make[2]: Entering directory '/tmp/B.dtjshvi2/BUILD/polybar-3.6.3/build' [ 5%] sphinx-build man: see doc/builder-man.log cd /tmp/B.dtjshvi2/BUILD/polybar-3.6.3/build/doc && /usr/bin/sphinx-build -b man -c /tmp/B.dtjshvi2/BUILD/polybar-3.6.3/build/doc -d /tmp/B.dtjshvi2/BUILD/polybar-3.6.3/build/doc/doctrees -n /tmp/B.dtjshvi2/BUILD/polybar-3.6.3/doc /tmp/B.dtjshvi2/BUILD/polybar-3.6.3/build/doc/man > builder-man.log make[2]: Leaving directory '/tmp/B.dtjshvi2/BUILD/polybar-3.6.3/build' make[1]: Entering directory '/tmp/B.dtjshvi2/BUILD/polybar-3.6.3/build' [ 7%] Built target doc_man make[1]: Leaving directory '/tmp/B.dtjshvi2/BUILD/polybar-3.6.3/build' make[2]: Entering directory '/tmp/B.dtjshvi2/BUILD/polybar-3.6.3/build' [ 4%] Generating generated-sources/include/xpp/proto/x.hpp cd /tmp/B.dtjshvi2/BUILD/polybar-3.6.3/build/lib/xpp && /usr/bin/python3 /tmp/B.dtjshvi2/BUILD/polybar-3.6.3/lib/xpp/generators/cpp_client.py -p /usr/share/python3.10/site-packages //usr/share/xcb/xproto.xml > /tmp/B.dtjshvi2/BUILD/polybar-3.6.3/build/lib/xpp/generated-sources/include/xpp/proto/x.hpp make[2]: Leaving directory '/tmp/B.dtjshvi2/BUILD/polybar-3.6.3/build' make[2]: Entering directory '/tmp/B.dtjshvi2/BUILD/polybar-3.6.3/build' cd /tmp/B.dtjshvi2/BUILD/polybar-3.6.3/build && /usr/bin/cmake -E cmake_depends "Unix Makefiles" /tmp/B.dtjshvi2/BUILD/polybar-3.6.3 /tmp/B.dtjshvi2/BUILD/polybar-3.6.3/lib/xpp /tmp/B.dtjshvi2/BUILD/polybar-3.6.3/build /tmp/B.dtjshvi2/BUILD/polybar-3.6.3/build/lib/xpp /tmp/B.dtjshvi2/BUILD/polybar-3.6.3/build/lib/xpp/CMakeFiles/xpp.dir/DependInfo.cmake --color= make[2]: Leaving directory '/tmp/B.dtjshvi2/BUILD/polybar-3.6.3/build' /usr/bin/make -f lib/xpp/CMakeFiles/xpp.dir/build.make lib/xpp/CMakeFiles/xpp.dir/build make[2]: Entering directory '/tmp/B.dtjshvi2/BUILD/polybar-3.6.3/build' [ 8%] Linking CXX static library libxpp.a cd /tmp/B.dtjshvi2/BUILD/polybar-3.6.3/build/lib/xpp && /usr/bin/cmake -P CMakeFiles/xpp.dir/cmake_clean_target.cmake cd /tmp/B.dtjshvi2/BUILD/polybar-3.6.3/build/lib/xpp && /usr/bin/cmake -E cmake_link_script CMakeFiles/xpp.dir/link.txt --verbose=1 /usr/bin/ar qc libxpp.a /usr/bin/ranlib libxpp.a make[2]: Leaving directory '/tmp/B.dtjshvi2/BUILD/polybar-3.6.3/build' make[1]: Entering directory '/tmp/B.dtjshvi2/BUILD/polybar-3.6.3/build' [ 8%] Built target xpp make[1]: Leaving directory '/tmp/B.dtjshvi2/BUILD/polybar-3.6.3/build' make[2]: Entering directory '/tmp/B.dtjshvi2/BUILD/polybar-3.6.3/build' [ 7%] Building CXX object lib/i3ipcpp/CMakeFiles/i3ipc++.dir/src/ipc.cpp.o cd /tmp/B.dtjshvi2/BUILD/polybar-3.6.3/build/lib/i3ipcpp && /usr/bin/x86_64-pld-linux-g++ -isystem /tmp/B.dtjshvi2/BUILD/polybar-3.6.3/lib/i3ipcpp/3rd/auss/include -isystem /tmp/B.dtjshvi2/BUILD/polybar-3.6.3/lib/i3ipcpp/include -isystem /usr/include/jsoncpp -O2 -fwrapv -pipe -Wformat -Werror=format-security -gdwarf-4 -fno-debug-types-section -fvar-tracking-assignments -g2 -Wp,-D_FORTIFY_SOURCE=2 -fstack-protector-strong --param=ssp-buffer-size=4 -Werror=trampolines -fPIC -march=x86-64 -mtune=generic -gdwarf-4 -fno-debug-types-section -fvar-tracking-assignments -g2 -DNDEBUG -DQT_NO_DEBUG -std=c++11 -Wall -Wextra -Wno-unused-parameter -Wno-deprecated-declarations -std=c++14 -MD -MT lib/i3ipcpp/CMakeFiles/i3ipc++.dir/src/ipc.cpp.o -MF CMakeFiles/i3ipc++.dir/src/ipc.cpp.o.d -o CMakeFiles/i3ipc++.dir/src/ipc.cpp.o -c /tmp/B.dtjshvi2/BUILD/polybar-3.6.3/lib/i3ipcpp/src/ipc.cpp make[2]: Leaving directory '/tmp/B.dtjshvi2/BUILD/polybar-3.6.3/build' make[2]: Entering directory '/tmp/B.dtjshvi2/BUILD/polybar-3.6.3/build' [ 9%] Linking CXX static library libi3ipc++.a cd /tmp/B.dtjshvi2/BUILD/polybar-3.6.3/build/lib/i3ipcpp && /usr/bin/cmake -P CMakeFiles/i3ipc++.dir/cmake_clean_target.cmake cd /tmp/B.dtjshvi2/BUILD/polybar-3.6.3/build/lib/i3ipcpp && /usr/bin/cmake -E cmake_link_script CMakeFiles/i3ipc++.dir/link.txt --verbose=1 /usr/bin/ar qc libi3ipc++.a CMakeFiles/i3ipc++.dir/src/ipc.cpp.o "CMakeFiles/i3ipc++.dir/src/ipc-util.cpp.o" /usr/bin/ranlib libi3ipc++.a make[2]: Leaving directory '/tmp/B.dtjshvi2/BUILD/polybar-3.6.3/build' make[1]: Entering directory '/tmp/B.dtjshvi2/BUILD/polybar-3.6.3/build' [ 9%] Built target i3ipc++ make[1]: Leaving directory '/tmp/B.dtjshvi2/BUILD/polybar-3.6.3/build' make: *** [Makefile:139: all] Error 2 error: Bad exit status from /tmp/B.dtjshvi2/BUILD/tmp/rpm-tmp.NVEUEe (%install) RPM build warnings: Could not canonicalize hostname: ymir RPM build errors: Bad exit status from /tmp/B.dtjshvi2/BUILD/tmp/rpm-tmp.NVEUEe (%install) ended at: Thu Nov 3 12:10:33 2022, done in 0:00:09.532632 error: No files produced. + chmod -R u+rwX /tmp/B.dtjshvi2/BUILD + rm -rf /tmp/B.dtjshvi2/tmp /tmp/B.dtjshvi2/BUILD + rm -rf /tmp/B.dtjshvi2 Begin-PLD-Builder-Info Build-Time: user:14.44s sys:4.32s real:12.18s (faults io:2 non-io:547289) End-PLD-Builder-Info
[Back to list of logs] [View rpm -qa of builder]