FailedOk

th/SRPMS[OK]
th/x32[OK]
th/i686[OK]
th/x86_64[OK]

ac/SRPMS[OK]
ac/i386[OK]
ac/i586[OK]
ac/i686[OK]
ac/alpha[OK]
ac/amd64[OK]
ac/athlon[OK]
ac/ppc[OK]
ac/sparc[OK]
ac/sparc64[OK]

Advanced Search
main()
Powered by PLD Linux
(c) 2002-2023 PLD Team
$Revision: 1.37 $
Powered by synergy.
Your IP: 35.172.230.154

postgresql 01ba841c-2e59-44ce-af4c-b6d19c50d399

Status:Failed
Source URL:https://buildlogs.pld-linux.org/pld/th/x86_64/FAIL/postgresql,01ba841c-2e59-44ce-af4c-b6d19c50d399.bz2
text/plain URL:View!
full text:View!
rpm -qa of builder:View!
Date:2022/10/17 22:36:48
Runtime:0:01:50.081997

Toc:

  • error 1
  • llvmjit.c:1115:57: error: 'LLVMJITCSymbolMapPair' undeclared (first use in this function); did you mean 'LLVMOrcCSymbolMapPair'?
  • error 2
  • llvmjit.c:1233:19: error: too few arguments to function 'LLVMOrcCreateCustomCAPIDefinitionGenerator'
  • error 3
  • make[2]: *** [../../../../src/Makefile.global:940: llvmjit.o] Error 1
  • error 4
  • llvmjit_inline.cpp:771:37: error: incomplete type 'llvm::MemoryBuffer' used in nested name specifier
  • error 5
  • /usr/include/c++/12.2.0/bits/unique_ptr.h:93:23: error: invalid application of 'sizeof' to incomplete type 'llvm::MemoryBuffer'
  • error 6
  • make[2]: *** [../../../../src/Makefile.global:943: llvmjit_inline.o] Error 1
  • error 7
  • make[1]: *** [Makefile:42: all-backend/jit/llvm-recurse] Error 2
  • error 8
  • error: Bad exit status from /tmp/B.rg4cvw1m/BUILD/tmp/rpm-tmp.Km0joe (%build)
  • error 9
  • RPM build errors:
  • error 10
  • error: No files produced.

Content:

make[3]: Entering directory '/tmp/B.rg4cvw1m/BUILD/postgresql-14.3/contrib/spi'
x86_64-pld-linux-gcc -Wall -Wmissing-prototypes -Wpointer-arith -Wdeclaration-after-statement -Werror=vla -Wendif-labels -Wmissing-format-attribute -Wimplicit-fallthrough=3 -Wcast-function-type -Wformat-security -fno-strict-aliasing -fwrapv -fexcess-precision=standard -Wno-format-truncation -Wno-stringop-truncation -O2 -fwrapv -pipe -Wformat -Werror=format-security -gdwarf-4 -fno-debug-types-section -fvar-tracking-assignments -g2 -Wp,-D_FORTIFY_SOURCE=2 -fstack-protector-strong --param=ssp-buffer-size=4 -Werror=trampolines -fPIC -march=x86-64 -mtune=generic -gdwarf-4 -fno-debug-types-section -fvar-tracking-assignments -g2   -DNEED_REENTRANT_FUNCS -I/usr/include/ossp-uuid -fPIC -DREFINT_VERBOSE -I. -I. -I../../src/include  -D_GNU_SOURCE -I/usr/include/libxml2   -c -o insert_username.o insert_username.c -MMD -MP -MF .deps/insert_username.Po
make[3]: Leaving directory '/tmp/B.rg4cvw1m/BUILD/postgresql-14.3/contrib/spi'
make[3]: Entering directory '/tmp/B.rg4cvw1m/BUILD/postgresql-14.3/contrib/spi'
/usr/bin/clang -Wno-ignored-attributes -fno-strict-aliasing -fwrapv -Wno-unused-command-line-argument -Wno-compound-token-split-by-macro -O2  -DREFINT_VERBOSE -I. -I. -I../../src/include  -D_GNU_SOURCE -I/usr/include/libxml2  -flto=thin -emit-llvm -c -o autoinc.bc autoinc.c
make[3]: Leaving directory '/tmp/B.rg4cvw1m/BUILD/postgresql-14.3/contrib/spi'
make[3]: Entering directory '/tmp/B.rg4cvw1m/BUILD/postgresql-14.3/contrib/spi'
x86_64-pld-linux-gcc -Wall -Wmissing-prototypes -Wpointer-arith -Wdeclaration-after-statement -Werror=vla -Wendif-labels -Wmissing-format-attribute -Wimplicit-fallthrough=3 -Wcast-function-type -Wformat-security -fno-strict-aliasing -fwrapv -fexcess-precision=standard -Wno-format-truncation -Wno-stringop-truncation -O2 -fwrapv -pipe -Wformat -Werror=format-security -gdwarf-4 -fno-debug-types-section -fvar-tracking-assignments -g2 -Wp,-D_FORTIFY_SOURCE=2 -fstack-protector-strong --param=ssp-buffer-size=4 -Werror=trampolines -fPIC -march=x86-64 -mtune=generic -gdwarf-4 -fno-debug-types-section -fvar-tracking-assignments -g2   -DNEED_REENTRANT_FUNCS -I/usr/include/ossp-uuid -fPIC autoinc.o -L../../src/port -L../../src/common -Wl,--as-needed -Wl,--no-copy-dt-needed-entries -Wl,-z,relro -Wl,-z,combreloc  -L/usr/lib64  -Wl,--as-needed  -shared -o autoinc.so
make[3]: Leaving directory '/tmp/B.rg4cvw1m/BUILD/postgresql-14.3/contrib/spi'
make[3]: Entering directory '/tmp/B.rg4cvw1m/BUILD/postgresql-14.3/contrib/spi'
x86_64-pld-linux-gcc -Wall -Wmissing-prototypes -Wpointer-arith -Wdeclaration-after-statement -Werror=vla -Wendif-labels -Wmissing-format-attribute -Wimplicit-fallthrough=3 -Wcast-function-type -Wformat-security -fno-strict-aliasing -fwrapv -fexcess-precision=standard -Wno-format-truncation -Wno-stringop-truncation -O2 -fwrapv -pipe -Wformat -Werror=format-security -gdwarf-4 -fno-debug-types-section -fvar-tracking-assignments -g2 -Wp,-D_FORTIFY_SOURCE=2 -fstack-protector-strong --param=ssp-buffer-size=4 -Werror=trampolines -fPIC -march=x86-64 -mtune=generic -gdwarf-4 -fno-debug-types-section -fvar-tracking-assignments -g2   -DNEED_REENTRANT_FUNCS -I/usr/include/ossp-uuid -fPIC insert_username.o -L../../src/port -L../../src/common -Wl,--as-needed -Wl,--no-copy-dt-needed-entries -Wl,-z,relro -Wl,-z,combreloc  -L/usr/lib64  -Wl,--as-needed  -shared -o insert_username.so
make[3]: Leaving directory '/tmp/B.rg4cvw1m/BUILD/postgresql-14.3/contrib/spi'
make[3]: Entering directory '/tmp/B.rg4cvw1m/BUILD/postgresql-14.3/contrib/spi'
x86_64-pld-linux-gcc -Wall -Wmissing-prototypes -Wpointer-arith -Wdeclaration-after-statement -Werror=vla -Wendif-labels -Wmissing-format-attribute -Wimplicit-fallthrough=3 -Wcast-function-type -Wformat-security -fno-strict-aliasing -fwrapv -fexcess-precision=standard -Wno-format-truncation -Wno-stringop-truncation -O2 -fwrapv -pipe -Wformat -Werror=format-security -gdwarf-4 -fno-debug-types-section -fvar-tracking-assignments -g2 -Wp,-D_FORTIFY_SOURCE=2 -fstack-protector-strong --param=ssp-buffer-size=4 -Werror=trampolines -fPIC -march=x86-64 -mtune=generic -gdwarf-4 -fno-debug-types-section -fvar-tracking-assignments -g2   -DNEED_REENTRANT_FUNCS -I/usr/include/ossp-uuid -fPIC -DREFINT_VERBOSE -I. -I. -I../../src/include  -D_GNU_SOURCE -I/usr/include/libxml2   -c -o moddatetime.o moddatetime.c -MMD -MP -MF .deps/moddatetime.Po
make[3]: Leaving directory '/tmp/B.rg4cvw1m/BUILD/postgresql-14.3/contrib/spi'
make[3]: Entering directory '/tmp/B.rg4cvw1m/BUILD/postgresql-14.3/contrib/spi'
/usr/bin/clang -Wno-ignored-attributes -fno-strict-aliasing -fwrapv -Wno-unused-command-line-argument -Wno-compound-token-split-by-macro -O2  -DREFINT_VERBOSE -I. -I. -I../../src/include  -D_GNU_SOURCE -I/usr/include/libxml2  -flto=thin -emit-llvm -c -o moddatetime.bc moddatetime.c
make[3]: Leaving directory '/tmp/B.rg4cvw1m/BUILD/postgresql-14.3/contrib/spi'
make[3]: Entering directory '/tmp/B.rg4cvw1m/BUILD/postgresql-14.3/contrib/spi'
/usr/bin/clang -Wno-ignored-attributes -fno-strict-aliasing -fwrapv -Wno-unused-command-line-argument -Wno-compound-token-split-by-macro -O2  -DREFINT_VERBOSE -I. -I. -I../../src/include  -D_GNU_SOURCE -I/usr/include/libxml2  -flto=thin -emit-llvm -c -o refint.bc refint.c
make[3]: Leaving directory '/tmp/B.rg4cvw1m/BUILD/postgresql-14.3/contrib/spi'
make[3]: Entering directory '/tmp/B.rg4cvw1m/BUILD/postgresql-14.3/contrib/spi'
/usr/bin/clang -Wno-ignored-attributes -fno-strict-aliasing -fwrapv -Wno-unused-command-line-argument -Wno-compound-token-split-by-macro -O2  -DREFINT_VERBOSE -I. -I. -I../../src/include  -D_GNU_SOURCE -I/usr/include/libxml2  -flto=thin -emit-llvm -c -o insert_username.bc insert_username.c
make[3]: Leaving directory '/tmp/B.rg4cvw1m/BUILD/postgresql-14.3/contrib/spi'
make[3]: Entering directory '/tmp/B.rg4cvw1m/BUILD/postgresql-14.3/contrib/spi'
x86_64-pld-linux-gcc -Wall -Wmissing-prototypes -Wpointer-arith -Wdeclaration-after-statement -Werror=vla -Wendif-labels -Wmissing-format-attribute -Wimplicit-fallthrough=3 -Wcast-function-type -Wformat-security -fno-strict-aliasing -fwrapv -fexcess-precision=standard -Wno-format-truncation -Wno-stringop-truncation -O2 -fwrapv -pipe -Wformat -Werror=format-security -gdwarf-4 -fno-debug-types-section -fvar-tracking-assignments -g2 -Wp,-D_FORTIFY_SOURCE=2 -fstack-protector-strong --param=ssp-buffer-size=4 -Werror=trampolines -fPIC -march=x86-64 -mtune=generic -gdwarf-4 -fno-debug-types-section -fvar-tracking-assignments -g2   -DNEED_REENTRANT_FUNCS -I/usr/include/ossp-uuid -fPIC moddatetime.o -L../../src/port -L../../src/common -Wl,--as-needed -Wl,--no-copy-dt-needed-entries -Wl,-z,relro -Wl,-z,combreloc  -L/usr/lib64  -Wl,--as-needed  -shared -o moddatetime.so
make[3]: Leaving directory '/tmp/B.rg4cvw1m/BUILD/postgresql-14.3/contrib/spi'
make[3]: Entering directory '/tmp/B.rg4cvw1m/BUILD/postgresql-14.3/contrib/spi'
x86_64-pld-linux-gcc -Wall -Wmissing-prototypes -Wpointer-arith -Wdeclaration-after-statement -Werror=vla -Wendif-labels -Wmissing-format-attribute -Wimplicit-fallthrough=3 -Wcast-function-type -Wformat-security -fno-strict-aliasing -fwrapv -fexcess-precision=standard -Wno-format-truncation -Wno-stringop-truncation -O2 -fwrapv -pipe -Wformat -Werror=format-security -gdwarf-4 -fno-debug-types-section -fvar-tracking-assignments -g2 -Wp,-D_FORTIFY_SOURCE=2 -fstack-protector-strong --param=ssp-buffer-size=4 -Werror=trampolines -fPIC -march=x86-64 -mtune=generic -gdwarf-4 -fno-debug-types-section -fvar-tracking-assignments -g2   -DNEED_REENTRANT_FUNCS -I/usr/include/ossp-uuid -fPIC -DREFINT_VERBOSE -I. -I. -I../../src/include  -D_GNU_SOURCE -I/usr/include/libxml2   -c -o refint.o refint.c -MMD -MP -MF .deps/refint.Po
make[3]: Leaving directory '/tmp/B.rg4cvw1m/BUILD/postgresql-14.3/contrib/spi'
make[3]: Entering directory '/tmp/B.rg4cvw1m/BUILD/postgresql-14.3/contrib/spi'
x86_64-pld-linux-gcc -Wall -Wmissing-prototypes -Wpointer-arith -Wdeclaration-after-statement -Werror=vla -Wendif-labels -Wmissing-format-attribute -Wimplicit-fallthrough=3 -Wcast-function-type -Wformat-security -fno-strict-aliasing -fwrapv -fexcess-precision=standard -Wno-format-truncation -Wno-stringop-truncation -O2 -fwrapv -pipe -Wformat -Werror=format-security -gdwarf-4 -fno-debug-types-section -fvar-tracking-assignments -g2 -Wp,-D_FORTIFY_SOURCE=2 -fstack-protector-strong --param=ssp-buffer-size=4 -Werror=trampolines -fPIC -march=x86-64 -mtune=generic -gdwarf-4 -fno-debug-types-section -fvar-tracking-assignments -g2   -DNEED_REENTRANT_FUNCS -I/usr/include/ossp-uuid -fPIC refint.o -L../../src/port -L../../src/common -Wl,--as-needed -Wl,--no-copy-dt-needed-entries -Wl,-z,relro -Wl,-z,combreloc  -L/usr/lib64  -Wl,--as-needed  -shared -o refint.so
make[3]: Leaving directory '/tmp/B.rg4cvw1m/BUILD/postgresql-14.3/contrib/spi'
make[2]: Entering directory '/tmp/B.rg4cvw1m/BUILD/postgresql-14.3/src/test/regress'
cp ../../../contrib/spi/autoinc.so autoinc.so
make[2]: Leaving directory '/tmp/B.rg4cvw1m/BUILD/postgresql-14.3/src/test/regress'
make[2]: Entering directory '/tmp/B.rg4cvw1m/BUILD/postgresql-14.3/src/test/regress'
cp ../../../contrib/spi/refint.so refint.so
make[2]: Leaving directory '/tmp/B.rg4cvw1m/BUILD/postgresql-14.3/src/test/regress'
make[2]: Entering directory '/tmp/B.rg4cvw1m/BUILD/postgresql-14.3/src/test/regress'
x86_64-pld-linux-gcc -Wall -Wmissing-prototypes -Wpointer-arith -Wdeclaration-after-statement -Werror=vla -Wendif-labels -Wmissing-format-attribute -Wimplicit-fallthrough=3 -Wcast-function-type -Wformat-security -fno-strict-aliasing -fwrapv -fexcess-precision=standard -Wno-format-truncation -Wno-stringop-truncation -O2 -fwrapv -pipe -Wformat -Werror=format-security -gdwarf-4 -fno-debug-types-section -fvar-tracking-assignments -g2 -Wp,-D_FORTIFY_SOURCE=2 -fstack-protector-strong --param=ssp-buffer-size=4 -Werror=trampolines -fPIC -march=x86-64 -mtune=generic -gdwarf-4 -fno-debug-types-section -fvar-tracking-assignments -g2   -DNEED_REENTRANT_FUNCS -I/usr/include/ossp-uuid -fPIC -I../../../src/include  -D_GNU_SOURCE -I/usr/include/libxml2   -c -o regress.o regress.c -MMD -MP -MF .deps/regress.Po
make[2]: Leaving directory '/tmp/B.rg4cvw1m/BUILD/postgresql-14.3/src/test/regress'
make[2]: Entering directory '/tmp/B.rg4cvw1m/BUILD/postgresql-14.3/src/test/regress'
x86_64-pld-linux-gcc -Wall -Wmissing-prototypes -Wpointer-arith -Wdeclaration-after-statement -Werror=vla -Wendif-labels -Wmissing-format-attribute -Wimplicit-fallthrough=3 -Wcast-function-type -Wformat-security -fno-strict-aliasing -fwrapv -fexcess-precision=standard -Wno-format-truncation -Wno-stringop-truncation -O2 -fwrapv -pipe -Wformat -Werror=format-security -gdwarf-4 -fno-debug-types-section -fvar-tracking-assignments -g2 -Wp,-D_FORTIFY_SOURCE=2 -fstack-protector-strong --param=ssp-buffer-size=4 -Werror=trampolines -fPIC -march=x86-64 -mtune=generic -gdwarf-4 -fno-debug-types-section -fvar-tracking-assignments -g2   -DNEED_REENTRANT_FUNCS -I/usr/include/ossp-uuid -fPIC -shared -o regress.so  regress.o -L../../../src/port -L../../../src/common  -Wl,--as-needed -Wl,--no-copy-dt-needed-entries -Wl,-z,relro -Wl,-z,combreloc  -L/usr/lib64  -Wl,--as-needed  
make[2]: Leaving directory '/tmp/B.rg4cvw1m/BUILD/postgresql-14.3/src/test/regress'
make[2]: Entering directory '/tmp/B.rg4cvw1m/BUILD/postgresql-14.3/src/test/regress'
x86_64-pld-linux-gcc -Wall -Wmissing-prototypes -Wpointer-arith -Wdeclaration-after-statement -Werror=vla -Wendif-labels -Wmissing-format-attribute -Wimplicit-fallthrough=3 -Wcast-function-type -Wformat-security -fno-strict-aliasing -fwrapv -fexcess-precision=standard -Wno-format-truncation -Wno-stringop-truncation -O2 -fwrapv -pipe -Wformat -Werror=format-security -gdwarf-4 -fno-debug-types-section -fvar-tracking-assignments -g2 -Wp,-D_FORTIFY_SOURCE=2 -fstack-protector-strong --param=ssp-buffer-size=4 -Werror=trampolines -fPIC -march=x86-64 -mtune=generic -gdwarf-4 -fno-debug-types-section -fvar-tracking-assignments -g2   -DNEED_REENTRANT_FUNCS -I/usr/include/ossp-uuid -fPIC -I../../../src/include  -D_GNU_SOURCE -I/usr/include/libxml2  -I../../../src/port '-DHOST_TUPLE="x86_64-pld-linux-gnu"' '-DSHELLPROG="/bin/sh"' '-DDLSUFFIX=".so"'  -c -o pg_regress.o pg_regress.c -MMD -MP -MF .deps/pg_regress.Po
make[2]: Leaving directory '/tmp/B.rg4cvw1m/BUILD/postgresql-14.3/src/test/regress'
make[2]: Entering directory '/tmp/B.rg4cvw1m/BUILD/postgresql-14.3/src/test/regress'
x86_64-pld-linux-gcc -Wall -Wmissing-prototypes -Wpointer-arith -Wdeclaration-after-statement -Werror=vla -Wendif-labels -Wmissing-format-attribute -Wimplicit-fallthrough=3 -Wcast-function-type -Wformat-security -fno-strict-aliasing -fwrapv -fexcess-precision=standard -Wno-format-truncation -Wno-stringop-truncation -O2 -fwrapv -pipe -Wformat -Werror=format-security -gdwarf-4 -fno-debug-types-section -fvar-tracking-assignments -g2 -Wp,-D_FORTIFY_SOURCE=2 -fstack-protector-strong --param=ssp-buffer-size=4 -Werror=trampolines -fPIC -march=x86-64 -mtune=generic -gdwarf-4 -fno-debug-types-section -fvar-tracking-assignments -g2   -DNEED_REENTRANT_FUNCS -I/usr/include/ossp-uuid -fPIC pg_regress.o pg_regress_main.o -L../../../src/port -L../../../src/common  -Wl,--as-needed -Wl,--no-copy-dt-needed-entries -Wl,-z,relro -Wl,-z,combreloc  -L/usr/lib64  -Wl,--as-needed  -lpgcommon -lpgport -lselinux -lxslt -lxml2 -lpam -lssl -lcrypto -lgssapi -lz -lreadline -lm  -o pg_regress
make[2]: Leaving directory '/tmp/B.rg4cvw1m/BUILD/postgresql-14.3/src/test/regress'
/usr/bin/make -C test/isolation all
/usr/bin/make -C ../../../src/interfaces/libpq all
/usr/bin/make -C ../../../src/port all
/usr/bin/make -C ../../../src/test/regress pg_regress.o
make[2]: Entering directory '/tmp/B.rg4cvw1m/BUILD/postgresql-14.3/src/test/isolation'
/usr/bin/flex   -o'specscanner.c' specscanner.l
make[2]: Leaving directory '/tmp/B.rg4cvw1m/BUILD/postgresql-14.3/src/test/isolation'
/usr/bin/make -C ../../../src/port all
make[3]: Nothing to be done for 'all'.
/usr/bin/make -C ../../../src/common all
/usr/bin/make -C ../../../src/port all
make[4]: Nothing to be done for 'all'.
/usr/bin/make -C ../../../src/common all
make[4]: Nothing to be done for 'all'.
/usr/bin/make -C ../../../src/common all
make[3]: Nothing to be done for 'all'.
make[4]: Nothing to be done for 'all'.
make[4]: Nothing to be done for 'all'.
make[2]: Entering directory '/tmp/B.rg4cvw1m/BUILD/postgresql-14.3/src/test/isolation'
rm -f pg_regress.o && ln -s ../../../src/test/regress/pg_regress.o .
make[2]: Leaving directory '/tmp/B.rg4cvw1m/BUILD/postgresql-14.3/src/test/isolation'
make[2]: Entering directory '/tmp/B.rg4cvw1m/BUILD/postgresql-14.3/src/test/isolation'
/usr/bin/bison -Wno-deprecated  -o specparse.c specparse.y
make[2]: Leaving directory '/tmp/B.rg4cvw1m/BUILD/postgresql-14.3/src/test/isolation'
make[2]: Entering directory '/tmp/B.rg4cvw1m/BUILD/postgresql-14.3/src/test/isolation'
x86_64-pld-linux-gcc -Wall -Wmissing-prototypes -Wpointer-arith -Wdeclaration-after-statement -Werror=vla -Wendif-labels -Wmissing-format-attribute -Wimplicit-fallthrough=3 -Wcast-function-type -Wformat-security -fno-strict-aliasing -fwrapv -fexcess-precision=standard -Wno-format-truncation -Wno-stringop-truncation -O2 -fwrapv -pipe -Wformat -Werror=format-security -gdwarf-4 -fno-debug-types-section -fvar-tracking-assignments -g2 -Wp,-D_FORTIFY_SOURCE=2 -fstack-protector-strong --param=ssp-buffer-size=4 -Werror=trampolines -fPIC -march=x86-64 -mtune=generic -gdwarf-4 -fno-debug-types-section -fvar-tracking-assignments -g2   -DNEED_REENTRANT_FUNCS -I/usr/include/ossp-uuid -I. -I. -I../../../src/interfaces/libpq -I./../regress -I../../../src/include  -D_GNU_SOURCE -I/usr/include/libxml2   -c -o isolation_main.o isolation_main.c -MMD -MP -MF .deps/isolation_main.Po
make[2]: Leaving directory '/tmp/B.rg4cvw1m/BUILD/postgresql-14.3/src/test/isolation'
make[2]: Entering directory '/tmp/B.rg4cvw1m/BUILD/postgresql-14.3/src/test/isolation'
x86_64-pld-linux-gcc -Wall -Wmissing-prototypes -Wpointer-arith -Wdeclaration-after-statement -Werror=vla -Wendif-labels -Wmissing-format-attribute -Wimplicit-fallthrough=3 -Wcast-function-type -Wformat-security -fno-strict-aliasing -fwrapv -fexcess-precision=standard -Wno-format-truncation -Wno-stringop-truncation -O2 -fwrapv -pipe -Wformat -Werror=format-security -gdwarf-4 -fno-debug-types-section -fvar-tracking-assignments -g2 -Wp,-D_FORTIFY_SOURCE=2 -fstack-protector-strong --param=ssp-buffer-size=4 -Werror=trampolines -fPIC -march=x86-64 -mtune=generic -gdwarf-4 -fno-debug-types-section -fvar-tracking-assignments -g2   -DNEED_REENTRANT_FUNCS -I/usr/include/ossp-uuid isolation_main.o pg_regress.o -L../../../src/port -L../../../src/common -Wl,--as-needed -Wl,--no-copy-dt-needed-entries -Wl,-z,relro -Wl,-z,combreloc  -L/usr/lib64  -Wl,--as-needed  -lpgcommon -lpgport -lselinux -lxslt -lxml2 -lpam -lssl -lcrypto -lgssapi -lz -lreadline -lm  -o pg_isolation_regress
make[2]: Leaving directory '/tmp/B.rg4cvw1m/BUILD/postgresql-14.3/src/test/isolation'
make[2]: Entering directory '/tmp/B.rg4cvw1m/BUILD/postgresql-14.3/src/test/isolation'
x86_64-pld-linux-gcc -Wall -Wmissing-prototypes -Wpointer-arith -Wdeclaration-after-statement -Werror=vla -Wendif-labels -Wmissing-format-attribute -Wimplicit-fallthrough=3 -Wcast-function-type -Wformat-security -fno-strict-aliasing -fwrapv -fexcess-precision=standard -Wno-format-truncation -Wno-stringop-truncation -O2 -fwrapv -pipe -Wformat -Werror=format-security -gdwarf-4 -fno-debug-types-section -fvar-tracking-assignments -g2 -Wp,-D_FORTIFY_SOURCE=2 -fstack-protector-strong --param=ssp-buffer-size=4 -Werror=trampolines -fPIC -march=x86-64 -mtune=generic -gdwarf-4 -fno-debug-types-section -fvar-tracking-assignments -g2   -DNEED_REENTRANT_FUNCS -I/usr/include/ossp-uuid -I. -I. -I../../../src/interfaces/libpq -I./../regress -I../../../src/include  -D_GNU_SOURCE -I/usr/include/libxml2   -c -o isolationtester.o isolationtester.c -MMD -MP -MF .deps/isolationtester.Po
make[2]: Leaving directory '/tmp/B.rg4cvw1m/BUILD/postgresql-14.3/src/test/isolation'
make[2]: Entering directory '/tmp/B.rg4cvw1m/BUILD/postgresql-14.3/src/test/isolation'
x86_64-pld-linux-gcc -Wall -Wmissing-prototypes -Wpointer-arith -Wdeclaration-after-statement -Werror=vla -Wendif-labels -Wmissing-format-attribute -Wimplicit-fallthrough=3 -Wcast-function-type -Wformat-security -fno-strict-aliasing -fwrapv -fexcess-precision=standard -Wno-format-truncation -Wno-stringop-truncation -O2 -fwrapv -pipe -Wformat -Werror=format-security -gdwarf-4 -fno-debug-types-section -fvar-tracking-assignments -g2 -Wp,-D_FORTIFY_SOURCE=2 -fstack-protector-strong --param=ssp-buffer-size=4 -Werror=trampolines -fPIC -march=x86-64 -mtune=generic -gdwarf-4 -fno-debug-types-section -fvar-tracking-assignments -g2   -DNEED_REENTRANT_FUNCS -I/usr/include/ossp-uuid -I. -I. -I../../../src/interfaces/libpq -I./../regress -I../../../src/include  -D_GNU_SOURCE -I/usr/include/libxml2   -c -o specparse.o specparse.c -MMD -MP -MF .deps/specparse.Po
make[2]: Leaving directory '/tmp/B.rg4cvw1m/BUILD/postgresql-14.3/src/test/isolation'
make[2]: Entering directory '/tmp/B.rg4cvw1m/BUILD/postgresql-14.3/src/test/isolation'
x86_64-pld-linux-gcc -Wall -Wmissing-prototypes -Wpointer-arith -Wdeclaration-after-statement -Werror=vla -Wendif-labels -Wmissing-format-attribute -Wimplicit-fallthrough=3 -Wcast-function-type -Wformat-security -fno-strict-aliasing -fwrapv -fexcess-precision=standard -Wno-format-truncation -Wno-stringop-truncation -O2 -fwrapv -pipe -Wformat -Werror=format-security -gdwarf-4 -fno-debug-types-section -fvar-tracking-assignments -g2 -Wp,-D_FORTIFY_SOURCE=2 -fstack-protector-strong --param=ssp-buffer-size=4 -Werror=trampolines -fPIC -march=x86-64 -mtune=generic -gdwarf-4 -fno-debug-types-section -fvar-tracking-assignments -g2   -DNEED_REENTRANT_FUNCS -I/usr/include/ossp-uuid isolationtester.o specparse.o -L../../../src/common -lpgcommon -L../../../src/port -lpgport -L../../../src/interfaces/libpq -lpq -L../../../src/port -L../../../src/common -Wl,--as-needed -Wl,--no-copy-dt-needed-entries -Wl,-z,relro -Wl,-z,combreloc  -L/usr/lib64  -Wl,--as-needed  -lpgcommon -lpgport -lselinux -lxslt -lxml2 -lpam -lssl -lcrypto -lgssapi -lz -lreadline -lm  -o isolationtester
make[2]: Leaving directory '/tmp/B.rg4cvw1m/BUILD/postgresql-14.3/src/test/isolation'
/usr/bin/make -C test/perl all
make[2]: Nothing to be done for 'all'.
/usr/bin/make -C backend/jit/llvm all
make[2]: Entering directory '/tmp/B.rg4cvw1m/BUILD/postgresql-14.3/src/backend/jit/llvm'
x86_64-pld-linux-g++ -Wall -Wpointer-arith -Wendif-labels -Wmissing-format-attribute -Wimplicit-fallthrough=3 -Wcast-function-type -Wformat-security -fno-strict-aliasing -fwrapv -O2 -fwrapv -pipe -Wformat -Werror=format-security -gdwarf-4 -fno-debug-types-section -fvar-tracking-assignments -g2 -Wp,-D_FORTIFY_SOURCE=2 -fstack-protector-strong --param=ssp-buffer-size=4 -Werror=trampolines -fPIC -march=x86-64 -mtune=generic -gdwarf-4 -fno-debug-types-section -fvar-tracking-assignments -g2   -std=c++14 -fPIC -D__STDC_LIMIT_MACROS -D__STDC_FORMAT_MACROS -D__STDC_CONSTANT_MACROS -D_GNU_SOURCE -I/usr/include  -I../../../../src/include  -D_GNU_SOURCE -I/usr/include/libxml2   -c -o llvmjit_error.o llvmjit_error.cpp -MMD -MP -MF .deps/llvmjit_error.Po
make[2]: Leaving directory '/tmp/B.rg4cvw1m/BUILD/postgresql-14.3/src/backend/jit/llvm'
make[2]: Entering directory '/tmp/B.rg4cvw1m/BUILD/postgresql-14.3/src/backend/jit/llvm'
x86_64-pld-linux-gcc -Wall -Wmissing-prototypes -Wpointer-arith -Wdeclaration-after-statement -Werror=vla -Wendif-labels -Wmissing-format-attribute -Wimplicit-fallthrough=3 -Wcast-function-type -Wformat-security -fno-strict-aliasing -fwrapv -fexcess-precision=standard -Wno-format-truncation -Wno-stringop-truncation -O2 -fwrapv -pipe -Wformat -Werror=format-security -gdwarf-4 -fno-debug-types-section -fvar-tracking-assignments -g2 -Wp,-D_FORTIFY_SOURCE=2 -fstack-protector-strong --param=ssp-buffer-size=4 -Werror=trampolines -fPIC -march=x86-64 -mtune=generic -gdwarf-4 -fno-debug-types-section -fvar-tracking-assignments -g2   -DNEED_REENTRANT_FUNCS -I/usr/include/ossp-uuid -Wno-deprecated-declarations -fPIC -D__STDC_LIMIT_MACROS -D__STDC_FORMAT_MACROS -D__STDC_CONSTANT_MACROS -D_GNU_SOURCE -I/usr/include  -I../../../../src/include  -D_GNU_SOURCE -I/usr/include/libxml2   -c -o llvmjit.o llvmjit.c -MMD -MP -MF .deps/llvmjit.Po
llvmjit.c: In function 'llvm_resolve_symbols':
llvmjit.c:1115:57: error: 'LLVMJITCSymbolMapPair' undeclared (first use in this function); did you mean 'LLVMOrcCSymbolMapPair'?
 1115 |         LLVMOrcCSymbolMapPairs symbols = palloc0(sizeof(LLVMJITCSymbolMapPair) * LookupSetSize);
      |                                                         ^~~~~~~~~~~~~~~~~~~~~
      |                                                         LLVMOrcCSymbolMapPair
llvmjit.c:1115:57: note: each undeclared identifier is reported only once for each function it appears in
llvmjit.c: In function 'llvm_create_jit_instance':
llvmjit.c:1233:19: error: too few arguments to function 'LLVMOrcCreateCustomCAPIDefinitionGenerator'
 1233 |         ref_gen = LLVMOrcCreateCustomCAPIDefinitionGenerator(llvm_resolve_symbols, NULL);
      |                   ^~~~~~~~~~~~~~~~~~~~~~~~~~~~~~~~~~~~~~~~~~
In file included from llvmjit.c:22:
/usr/include/llvm-c/Orc.h:997:31: note: declared here
  997 | LLVMOrcDefinitionGeneratorRef LLVMOrcCreateCustomCAPIDefinitionGenerator(
      |                               ^~~~~~~~~~~~~~~~~~~~~~~~~~~~~~~~~~~~~~~~~~
make[2]: *** [../../../../src/Makefile.global:940: llvmjit.o] Error 1
make[2]: Leaving directory '/tmp/B.rg4cvw1m/BUILD/postgresql-14.3/src/backend/jit/llvm'
make[2]: *** Waiting for unfinished jobs....
make[2]: Entering directory '/tmp/B.rg4cvw1m/BUILD/postgresql-14.3/src/backend/jit/llvm'
/usr/bin/clang -Wno-ignored-attributes -fno-strict-aliasing -fwrapv -Wno-unused-command-line-argument -Wno-compound-token-split-by-macro -O2  -D__STDC_LIMIT_MACROS -D__STDC_FORMAT_MACROS -D__STDC_CONSTANT_MACROS -D_GNU_SOURCE -I/usr/include  -I../../../../src/include  -D_GNU_SOURCE -I/usr/include/libxml2  -flto=thin -emit-llvm -c -o llvmjit_types.bc llvmjit_types.c
make[2]: Leaving directory '/tmp/B.rg4cvw1m/BUILD/postgresql-14.3/src/backend/jit/llvm'
make[2]: Entering directory '/tmp/B.rg4cvw1m/BUILD/postgresql-14.3/src/backend/jit/llvm'
x86_64-pld-linux-gcc -Wall -Wmissing-prototypes -Wpointer-arith -Wdeclaration-after-statement -Werror=vla -Wendif-labels -Wmissing-format-attribute -Wimplicit-fallthrough=3 -Wcast-function-type -Wformat-security -fno-strict-aliasing -fwrapv -fexcess-precision=standard -Wno-format-truncation -Wno-stringop-truncation -O2 -fwrapv -pipe -Wformat -Werror=format-security -gdwarf-4 -fno-debug-types-section -fvar-tracking-assignments -g2 -Wp,-D_FORTIFY_SOURCE=2 -fstack-protector-strong --param=ssp-buffer-size=4 -Werror=trampolines -fPIC -march=x86-64 -mtune=generic -gdwarf-4 -fno-debug-types-section -fvar-tracking-assignments -g2   -DNEED_REENTRANT_FUNCS -I/usr/include/ossp-uuid -Wno-deprecated-declarations -fPIC -D__STDC_LIMIT_MACROS -D__STDC_FORMAT_MACROS -D__STDC_CONSTANT_MACROS -D_GNU_SOURCE -I/usr/include  -I../../../../src/include  -D_GNU_SOURCE -I/usr/include/libxml2   -c -o llvmjit_deform.o llvmjit_deform.c -MMD -MP -MF .deps/llvmjit_deform.Po
make[2]: Leaving directory '/tmp/B.rg4cvw1m/BUILD/postgresql-14.3/src/backend/jit/llvm'
make[2]: Entering directory '/tmp/B.rg4cvw1m/BUILD/postgresql-14.3/src/backend/jit/llvm'
x86_64-pld-linux-gcc -Wall -Wmissing-prototypes -Wpointer-arith -Wdeclaration-after-statement -Werror=vla -Wendif-labels -Wmissing-format-attribute -Wimplicit-fallthrough=3 -Wcast-function-type -Wformat-security -fno-strict-aliasing -fwrapv -fexcess-precision=standard -Wno-format-truncation -Wno-stringop-truncation -O2 -fwrapv -pipe -Wformat -Werror=format-security -gdwarf-4 -fno-debug-types-section -fvar-tracking-assignments -g2 -Wp,-D_FORTIFY_SOURCE=2 -fstack-protector-strong --param=ssp-buffer-size=4 -Werror=trampolines -fPIC -march=x86-64 -mtune=generic -gdwarf-4 -fno-debug-types-section -fvar-tracking-assignments -g2   -DNEED_REENTRANT_FUNCS -I/usr/include/ossp-uuid -Wno-deprecated-declarations -fPIC -D__STDC_LIMIT_MACROS -D__STDC_FORMAT_MACROS -D__STDC_CONSTANT_MACROS -D_GNU_SOURCE -I/usr/include  -I../../../../src/include  -D_GNU_SOURCE -I/usr/include/libxml2   -c -o llvmjit_expr.o llvmjit_expr.c -MMD -MP -MF .deps/llvmjit_expr.Po
make[2]: Leaving directory '/tmp/B.rg4cvw1m/BUILD/postgresql-14.3/src/backend/jit/llvm'
make[2]: Entering directory '/tmp/B.rg4cvw1m/BUILD/postgresql-14.3/src/backend/jit/llvm'
x86_64-pld-linux-g++ -Wall -Wpointer-arith -Wendif-labels -Wmissing-format-attribute -Wimplicit-fallthrough=3 -Wcast-function-type -Wformat-security -fno-strict-aliasing -fwrapv -O2 -fwrapv -pipe -Wformat -Werror=format-security -gdwarf-4 -fno-debug-types-section -fvar-tracking-assignments -g2 -Wp,-D_FORTIFY_SOURCE=2 -fstack-protector-strong --param=ssp-buffer-size=4 -Werror=trampolines -fPIC -march=x86-64 -mtune=generic -gdwarf-4 -fno-debug-types-section -fvar-tracking-assignments -g2   -std=c++14 -fPIC -D__STDC_LIMIT_MACROS -D__STDC_FORMAT_MACROS -D__STDC_CONSTANT_MACROS -D_GNU_SOURCE -I/usr/include  -I../../../../src/include  -D_GNU_SOURCE -I/usr/include/libxml2   -c -o llvmjit_wrap.o llvmjit_wrap.cpp -MMD -MP -MF .deps/llvmjit_wrap.Po
make[2]: Leaving directory '/tmp/B.rg4cvw1m/BUILD/postgresql-14.3/src/backend/jit/llvm'
make[2]: Entering directory '/tmp/B.rg4cvw1m/BUILD/postgresql-14.3/src/backend/jit/llvm'
x86_64-pld-linux-g++ -Wall -Wpointer-arith -Wendif-labels -Wmissing-format-attribute -Wimplicit-fallthrough=3 -Wcast-function-type -Wformat-security -fno-strict-aliasing -fwrapv -O2 -fwrapv -pipe -Wformat -Werror=format-security -gdwarf-4 -fno-debug-types-section -fvar-tracking-assignments -g2 -Wp,-D_FORTIFY_SOURCE=2 -fstack-protector-strong --param=ssp-buffer-size=4 -Werror=trampolines -fPIC -march=x86-64 -mtune=generic -gdwarf-4 -fno-debug-types-section -fvar-tracking-assignments -g2   -std=c++14 -fPIC -D__STDC_LIMIT_MACROS -D__STDC_FORMAT_MACROS -D__STDC_CONSTANT_MACROS -D_GNU_SOURCE -I/usr/include  -I../../../../src/include  -D_GNU_SOURCE -I/usr/include/libxml2   -c -o llvmjit_inline.o llvmjit_inline.cpp -MMD -MP -MF .deps/llvmjit_inline.Po
llvmjit_inline.cpp: In function 'std::unique_ptr<llvm::ModuleSummaryIndex> llvm_load_summary(llvm::StringRef)':
llvmjit_inline.cpp:771:37: error: incomplete type 'llvm::MemoryBuffer' used in nested name specifier
  771 |                 llvm::MemoryBuffer::getFile(path);
      |                                     ^~~~~~~
In file included from /usr/include/c++/12.2.0/memory:76,
                 from /usr/include/llvm/ADT/SmallVector.h:28,
                 from /usr/include/llvm/ADT/ArrayRef.h:14,
                 from /usr/include/llvm/ADT/SetVector.h:23,
                 from llvmjit_inline.cpp:48:
/usr/include/c++/12.2.0/bits/unique_ptr.h: In instantiation of 'void std::default_delete<_Tp>::operator()(_Tp*) const [with _Tp = llvm::MemoryBuffer]':
/usr/include/c++/12.2.0/bits/unique_ptr.h:396:17:   required from 'std::unique_ptr<_Tp, _Dp>::~unique_ptr() [with _Tp = llvm::MemoryBuffer; _Dp = std::default_delete<llvm::MemoryBuffer>]'
/usr/include/llvm/Support/ErrorOr.h:142:34:   required from 'llvm::ErrorOr<T>::~ErrorOr() [with T = std::unique_ptr<llvm::MemoryBuffer>]'
llvmjit_inline.cpp:771:35:   required from here
/usr/include/c++/12.2.0/bits/unique_ptr.h:93:23: error: invalid application of 'sizeof' to incomplete type 'llvm::MemoryBuffer'
   93 |         static_assert(sizeof(_Tp)>0,
      |                       ^~~~~~~~~~~
make[2]: *** [../../../../src/Makefile.global:943: llvmjit_inline.o] Error 1
make[2]: Leaving directory '/tmp/B.rg4cvw1m/BUILD/postgresql-14.3/src/backend/jit/llvm'
make[1]: *** [Makefile:42: all-backend/jit/llvm-recurse] Error 2
make: *** [GNUmakefile:11: all-src-recurse] Error 2
error: Bad exit status from /tmp/B.rg4cvw1m/BUILD/tmp/rpm-tmp.Km0joe (%build)

RPM build warnings:
    line 113: It's not recommended to have unversioned Obsoletes: Obsoletes:	postgresql-module-plpgsql
    line 114: It's not recommended to have unversioned Obsoletes: Obsoletes:	postgresql-module-tsearch2
    line 115: It's not recommended to have unversioned Obsoletes: Obsoletes:	postgresql-server
    line 116: It's not recommended to have unversioned Obsoletes: Obsoletes:	postgresql-test
    Could not canonicalize hostname: ymir

RPM build errors:
    Bad exit status from /tmp/B.rg4cvw1m/BUILD/tmp/rpm-tmp.Km0joe (%build)
ended at: Mon Oct 17 22:36:47 2022, done in 0:01:50.081997
error: No files produced.
+ chmod -R u+rwX /tmp/B.rg4cvw1m/BUILD
+ rm -rf /tmp/B.rg4cvw1m/tmp /tmp/B.rg4cvw1m/BUILD
+ rm -rf /tmp/B.rg4cvw1m
Begin-PLD-Builder-Info
Build-Time: user:871.42s sys:121.90s real:114.87s (faults io:4317 non-io:16900054)

End-PLD-Builder-Info
[Back to list of logs] [View rpm -qa of builder]