FailedOk

th/SRPMS[OK]
th/x32[OK]
th/i686[OK]
th/x86_64[OK]

ac/SRPMS[OK]
ac/i386[OK]
ac/i586[OK]
ac/i686[OK]
ac/alpha[OK]
ac/amd64[OK]
ac/athlon[OK]
ac/ppc[OK]
ac/sparc[OK]
ac/sparc64[OK]

Advanced Search
main()
Powered by PLD Linux
(c) 2002-2024 PLD Team
$Revision: 1.37 $
Powered by The Bad Thing.
Your IP: 44.192.94.177

postgresql 7baac286-dd5e-416e-8d98-70ad2a7873e0

Status:Failed
Source URL:https://buildlogs.pld-linux.org/pld/th/x86_64/FAIL/postgresql,7baac286-dd5e-416e-8d98-70ad2a7873e0.bz2
text/plain URL:View!
full text:View!
rpm -qa of builder:View!
Date:2024/06/30 14:02:13
Runtime:0:02:12.713901

Toc:

  • error 1
  • make[1]: *** [GNUmakefile:118: check] Error 1
  • error 2
  • error: Bad exit status from /tmp/B.nea2_o0c/BUILD/tmp/rpm-tmp.3NsCBx (%build)
  • error 3
  • RPM build errors:
  • error 4
  • error: No files produced.

Content:

     alter_generic                ... ok           93 ms
     alter_operator               ... ok           26 ms
     misc                         ... ok           95 ms
     async                        ... ok           15 ms
     dbsize                       ... ok           19 ms
     merge                        ... ok          265 ms
     misc_functions               ... ok           69 ms
     sysviews                     ... ok           58 ms
     tsrf                         ... ok           41 ms
     tid                          ... ok           43 ms
     tidscan                      ... ok           43 ms
     tidrangescan                 ... ok           36 ms
     collate.icu.utf8             ... ok           16 ms
     incremental_sort             ... ok          115 ms
     create_role                  ... ok           52 ms
parallel group (6 tests):  collate.linux.utf8 amutils psql_crosstab psql rules stats_ext
     rules                        ... ok          348 ms
     psql                         ... ok          332 ms
     psql_crosstab                ... ok           39 ms
     amutils                      ... ok           27 ms
     stats_ext                    ... ok         1060 ms
     collate.linux.utf8           ... ok           13 ms
test select_parallel              ... ok         1137 ms
test write_parallel               ... ok          121 ms
test vacuum_parallel              ... ok          108 ms
parallel group (2 tests):  subscription publication
     publication                  ... ok          433 ms
     subscription                 ... ok           58 ms
parallel group (17 tests):  portals_p2 advisory_lock xmlmap combocid tsdicts equivclass functional_deps guc dependency select_views window indirect_toast bitmapops tsearch cluster foreign_data foreign_key
     select_views                 ... ok          104 ms
     portals_p2                   ... ok           27 ms
     foreign_key                  ... ok         1060 ms
     cluster                      ... ok          338 ms
     dependency                   ... ok           95 ms
     guc                          ... ok           89 ms
     bitmapops                    ... ok          245 ms
     combocid                     ... ok           42 ms
     tsearch                      ... ok          272 ms
     tsdicts                      ... ok           47 ms
     foreign_data                 ... ok          446 ms
     window                       ... ok          205 ms
     xmlmap                       ... ok           40 ms
     functional_deps              ... ok           57 ms
     advisory_lock                ... ok           33 ms
     indirect_toast               ... ok          227 ms
     equivclass                   ... ok           55 ms
parallel group (6 tests):  jsonpath_encoding json_encoding jsonpath jsonb_jsonpath json jsonb
     json                         ... ok          104 ms
     jsonb                        ... ok          256 ms
     json_encoding                ... ok           21 ms
     jsonpath                     ... ok           39 ms
     jsonpath_encoding            ... ok           19 ms
     jsonb_jsonpath               ... ok           91 ms
parallel group (18 tests):  prepare returning limit conversion plancache temp copy2 rowtypes polymorphism largeobject sequence with rangefuncs domain truncate plpgsql xml alter_table
     plancache                    ... ok           92 ms
     limit                        ... ok           67 ms
     plpgsql                      ... ok          595 ms
     copy2                        ... ok          153 ms
     temp                         ... ok          140 ms
     domain                       ... ok          254 ms
     rangefuncs                   ... ok          227 ms
     prepare                      ... ok           36 ms
     conversion                   ... ok           88 ms
     truncate                     ... ok          332 ms
     alter_table                  ... ok         1806 ms
     sequence                     ... ok          201 ms
     polymorphism                 ... ok          153 ms
     rowtypes                     ... ok          152 ms
     returning                    ... ok           54 ms
     largeobject                  ... ok          200 ms
     with                         ... ok          200 ms
     xml                          ... FAILED      731 ms
parallel group (12 tests):  hash_part explain reloptions partition_info memoize compression stats partition_aggregate tuplesort partition_join partition_prune indexing
     partition_join               ... ok          895 ms
     partition_prune              ... ok          928 ms
     reloptions                   ... ok           63 ms
     hash_part                    ... ok           50 ms
     indexing                     ... ok          977 ms
     partition_aggregate          ... ok          646 ms
     partition_info               ... ok           70 ms
     tuplesort                    ... ok          701 ms
     explain                      ... ok           53 ms
     compression                  ... ok          129 ms
     memoize                      ... ok          106 ms
     stats                        ... ok          623 ms
parallel group (2 tests):  event_trigger oidjoins
     event_trigger                ... ok          167 ms
     oidjoins                     ... ok          339 ms
test fast_default                 ... ok          223 ms
============== shutting down postmaster               ==============

========================
 1 of 212 tests failed. 
========================

The differences that caused some tests to fail can be viewed in the
file "/tmp/B.nea2_o0c/BUILD/postgresql-15.6/src/test/regress/regression.diffs".  A copy of the test summary that you see
above is saved in the file "/tmp/B.nea2_o0c/BUILD/postgresql-15.6/src/test/regress/regression.out".

make[1]: *** [GNUmakefile:118: check] Error 1
make[1]: Leaving directory '/tmp/B.nea2_o0c/BUILD/postgresql-15.6/src/test/regress'
make: *** [GNUmakefile:69: check] Error 2
error: Bad exit status from /tmp/B.nea2_o0c/BUILD/tmp/rpm-tmp.3NsCBx (%build)

RPM build warnings:
    line 119: It's not recommended to have unversioned Obsoletes: Obsoletes:	postgresql-server
    line 120: It's not recommended to have unversioned Obsoletes: Obsoletes:	postgresql-test
    Could not canonicalize hostname: ymir

RPM build errors:
    Bad exit status from /tmp/B.nea2_o0c/BUILD/tmp/rpm-tmp.3NsCBx (%build)
ended at: Sun Jun 30 14:02:11 2024, done in 0:02:12.713901
error: No files produced.
+ chmod -R u+rwX /tmp/B.nea2_o0c/BUILD
+ rm -rf /tmp/B.nea2_o0c/tmp /tmp/B.nea2_o0c/BUILD
+ rm -rf /tmp/B.nea2_o0c
Begin-PLD-Builder-Info
Build-Time: user:595.63s sys:73.29s real:137.66s (faults io:316 non-io:8192731)

End-PLD-Builder-Info
[Back to list of logs] [View rpm -qa of builder]