FailedOk

th/SRPMS[OK]
th/x32[OK]
th/i686[OK]
th/x86_64[OK]

ac/SRPMS[OK]
ac/i386[OK]
ac/i586[OK]
ac/i686[OK]
ac/alpha[OK]
ac/amd64[OK]
ac/athlon[OK]
ac/ppc[OK]
ac/sparc[OK]
ac/sparc64[OK]

Advanced Search
main()
Powered by PLD Linux
(c) 2002-2024 PLD Team
$Revision: 1.37 $
Powered by voodoo magic.
Your IP: 35.172.230.21

python afdf9b67-453d-430e-b8e3-3cd50b98a809

Status:Failed
Source URL:https://buildlogs.pld-linux.org/pld/th/x86_64/FAIL/python,afdf9b67-453d-430e-b8e3-3cd50b98a809.bz2
text/plain URL:View!
full text:View!
rpm -qa of builder:View!
Date:2024/05/18 10:27:28
Runtime:0:14:57.679335

Toc:

  • error 1
  • error: [Errno 104] Connection reset by peer
  • error 2
  • error: [Errno 104] Connection reset by peer
  • error 3
  • error: [Errno 104] Connection reset by peer
  • error 4
  • error: [Errno 104] Connection reset by peer
  • error 5
  • SSLError: [SSL] internal error (_ssl.c:733)
  • error 6
  • error: [Errno 104] Connection reset by peer
  • error 7
  • error: [Errno 104] Connection reset by peer
  • error 8
  • error: [Errno 104] Connection reset by peer
  • error 9
  • SSLError: [SSL: TLSV1_ALERT_UNKNOWN_CA] tlsv1 alert unknown ca (_ssl.c:733)
  • error 10
  • SSLError: [SSL: NO_SHARED_CIPHER] no shared cipher (_ssl.c:733)
  • error 11
  • error: [Errno 104] Connection reset by peer
  • error 12
  • SSLError: [SSL] internal error (_ssl.c:733)
  • error 13
  • ERROR: test_subclass (test.test_ssl.SSLErrorTests)
  • error 14
  • SSLError: [SSL] internal error (_ssl.c:733)
  • error 15
  • error: [Errno 104] Connection reset by peer
  • error 16
  • error: [Errno 104] Connection reset by peer
  • error 17
  • SSLError: [SSL] internal error (_ssl.c:733)
  • error 18
  • error: [Errno 104] Connection reset by peer
  • error 19
  • error: [Errno 104] Connection reset by peer
  • error 20
  • error: [Errno 104] Connection reset by peer
  • error 21
  • error: [Errno 104] Connection reset by peer
  • error 22
  • SSLError: [SSL: TLSV1_ALERT_UNKNOWN_CA] tlsv1 alert unknown ca (_ssl.c:733)
  • error 23
  • error: [Errno 104] Connection reset by peer
  • error 24
  • SSLError: [SSL: NO_SHARED_CIPHER] no shared cipher (_ssl.c:733)
  • error 25
  • error: [Errno 104] Connection reset by peer
  • error 26
  • SSLError: [SSL] internal error (_ssl.c:733)
  • error 27
  • ERROR: test_subclass (test.test_ssl.SSLErrorTests)
  • error 28
  • SSLError: [SSL] internal error (_ssl.c:733)
  • error 29
  • error: Bad exit status from /tmp/B.ny5_gl9e/BUILD/tmp/rpm-tmp.DBBEHb (%build)
  • error 30
  • RPM build errors:
  • error 31
  • error: No files produced.

Content:

0:02:21 load avg: 0.84 [218/390] test_msilib
test_msilib skipped -- No module named _msi
0:02:21 load avg: 0.84 [219/390] test_multibytecodec -- test_msilib skipped
0:02:21 load avg: 0.84 [220/390] test_multifile
0:02:21 load avg: 0.84 [221/390] test_multiprocessing
0:02:46 load avg: 0.62 [222/390] test_mutants
0:02:46 load avg: 0.62 [223/390] test_mutex
0:02:46 load avg: 0.62 [224/390] test_netrc
0:02:46 load avg: 0.62 [225/390] test_new
0:02:47 load avg: 0.62 [226/390] test_nntplib
0:02:47 load avg: 0.62 [227/390] test_normalization
0:02:47 load avg: 0.62 [228/390] test_ntpath
0:02:47 load avg: 0.62 [229/390] test_old_mailbox
0:02:47 load avg: 0.62 [230/390] test_operator
0:02:47 load avg: 0.62 [231/390] test_optparse
0:02:47 load avg: 0.65 [232/390] test_ordered_dict
0:02:48 load avg: 0.65 [233/390] test_os
0:02:48 load avg: 0.65 [234/390] test_ossaudiodev
test_ossaudiodev skipped -- Use of the `audio' resource not enabled
0:02:48 load avg: 0.65 [235/390] test_parser -- test_ossaudiodev skipped (resource denied)
0:02:48 load avg: 0.65 [236/390] test_pdb
0:02:49 load avg: 0.65 [237/390] test_peepholer
0:02:49 load avg: 0.65 [238/390] test_pep247
0:02:49 load avg: 0.65 [239/390] test_pep277
0:02:49 load avg: 0.65 [240/390] test_pep352
0:02:49 load avg: 0.65 [241/390] test_pickle
0:02:50 load avg: 0.65 [242/390] test_pickletools
0:02:51 load avg: 0.65 [243/390] test_pipes
0:02:51 load avg: 0.65 [244/390] test_pkg
0:02:51 load avg: 0.65 [245/390] test_pkgimport
0:02:51 load avg: 0.65 [246/390] test_pkgutil
0:02:51 load avg: 0.65 [247/390] test_platform
0:02:51 load avg: 0.65 [248/390] test_plistlib
0:02:51 load avg: 0.65 [249/390] test_poll
0:03:02 load avg: 0.50 [250/390] test_popen
0:03:03 load avg: 0.50 [251/390] test_popen2
0:03:03 load avg: 0.50 [252/390] test_poplib
0:03:05 load avg: 0.50 [253/390] test_posixpath
0:03:05 load avg: 0.50 [254/390] test_pow
0:03:06 load avg: 0.50 [255/390] test_pprint
0:03:06 load avg: 0.50 [256/390] test_print
0:03:06 load avg: 0.50 [257/390] test_profile
0:03:06 load avg: 0.50 [258/390] test_property
0:03:06 load avg: 0.50 [259/390] test_pstats
0:03:06 load avg: 0.50 [260/390] test_pwd
0:03:06 load avg: 0.50 [261/390] test_py3kwarn
test_py3kwarn skipped -- test.test_py3kwarn must be run with the -3 flag
0:03:06 load avg: 0.50 [262/390] test_py_compile -- test_py3kwarn skipped
0:03:06 load avg: 0.50 [263/390] test_pyclbr
0:03:07 load avg: 0.50 [264/390] test_pyexpat
0:03:07 load avg: 0.50 [265/390] test_queue
0:03:11 load avg: 0.46 [266/390] test_quopri
0:03:11 load avg: 0.46 [267/390] test_random
0:03:11 load avg: 0.46 [268/390] test_re
0:03:12 load avg: 0.46 [269/390] test_readline
0:03:12 load avg: 0.46 [270/390] test_regrtest
0:03:15 load avg: 0.51 [271/390] test_repr
0:03:15 load avg: 0.51 [272/390] test_rfc822
0:03:15 load avg: 0.51 [273/390] test_richcmp
0:03:15 load avg: 0.51 [274/390] test_rlcompleter
0:03:15 load avg: 0.51 [275/390] test_robotparser
0:03:15 load avg: 0.51 [276/390] test_runpy
0:03:19 load avg: 0.55 [277/390] test_sax
0:03:19 load avg: 0.55 [278/390] test_scope
0:03:19 load avg: 0.55 [279/390] test_scriptpackages
test_scriptpackages skipped -- No module named aetools
0:03:19 load avg: 0.55 [280/390] test_select -- test_scriptpackages skipped
0:03:30 load avg: 0.46 [281/390] test_set
0:03:31 load avg: 0.46 [282/390] test_setcomps
0:03:31 load avg: 0.46 [283/390] test_sets
0:03:31 load avg: 0.46 [284/390] test_sgmllib
0:03:31 load avg: 0.46 [285/390] test_sha
0:03:31 load avg: 0.46 [286/390] test_shelve
0:03:32 load avg: 0.50 [287/390] test_shlex
0:03:33 load avg: 0.50 [288/390] test_shutil
0:03:33 load avg: 0.50 [289/390] test_signal
0:03:41 load avg: 0.46 [290/390] test_site
0:03:41 load avg: 0.46 [291/390] test_slice
0:03:42 load avg: 0.46 [292/390] test_smtplib
0:03:42 load avg: 0.46 [293/390] test_smtpnet
test_smtpnet skipped -- Use of the `network' resource not enabled
0:03:42 load avg: 0.46 [294/390] test_socketserver -- test_smtpnet skipped (resource denied)
test_socketserver skipped -- Use of the `network' resource not enabled
0:03:42 load avg: 0.46 [295/390] test_softspace -- test_socketserver skipped (resource denied)
0:03:42 load avg: 0.46 [296/390] test_sort
0:03:42 load avg: 0.51 [297/390] test_source_encoding
0:03:43 load avg: 0.51 [298/390] test_spwd
0:03:43 load avg: 0.51 [299/390] test_sqlite
0:03:44 load avg: 0.51 [300/390] test_ssl
Exception in thread Thread-577:
Traceback (most recent call last):
  File "/tmp/B.ny5_gl9e/BUILD/Python-2.7.18/Lib/threading.py", line 801, in __bootstrap_inner
    self.run()
  File "/tmp/B.ny5_gl9e/BUILD/Python-2.7.18/Lib/test/test_ssl.py", line 1801, in run
    msg = self.read()
  File "/tmp/B.ny5_gl9e/BUILD/Python-2.7.18/Lib/test/test_ssl.py", line 1778, in read
    return self.sslconn.read()
  File "/tmp/B.ny5_gl9e/BUILD/Python-2.7.18/Lib/ssl.py", line 641, in read
    v = self._sslobj.read(len)
error: [Errno 104] Connection reset by peer

Exception in thread Thread-579:
Traceback (most recent call last):
  File "/tmp/B.ny5_gl9e/BUILD/Python-2.7.18/Lib/threading.py", line 801, in __bootstrap_inner
    self.run()
  File "/tmp/B.ny5_gl9e/BUILD/Python-2.7.18/Lib/test/test_ssl.py", line 1801, in run
    msg = self.read()
  File "/tmp/B.ny5_gl9e/BUILD/Python-2.7.18/Lib/test/test_ssl.py", line 1778, in read
    return self.sslconn.read()
  File "/tmp/B.ny5_gl9e/BUILD/Python-2.7.18/Lib/ssl.py", line 641, in read
    v = self._sslobj.read(len)
error: [Errno 104] Connection reset by peer

Exception in thread Thread-586:
Traceback (most recent call last):
  File "/tmp/B.ny5_gl9e/BUILD/Python-2.7.18/Lib/threading.py", line 801, in __bootstrap_inner
    self.run()
  File "/tmp/B.ny5_gl9e/BUILD/Python-2.7.18/Lib/test/test_ssl.py", line 1801, in run
    msg = self.read()
  File "/tmp/B.ny5_gl9e/BUILD/Python-2.7.18/Lib/test/test_ssl.py", line 1778, in read
    return self.sslconn.read()
  File "/tmp/B.ny5_gl9e/BUILD/Python-2.7.18/Lib/ssl.py", line 641, in read
    v = self._sslobj.read(len)
error: [Errno 104] Connection reset by peer

Exception in thread Thread-653:
Traceback (most recent call last):
  File "/tmp/B.ny5_gl9e/BUILD/Python-2.7.18/Lib/threading.py", line 801, in __bootstrap_inner
    self.run()
  File "/tmp/B.ny5_gl9e/BUILD/Python-2.7.18/Lib/test/test_ssl.py", line 1801, in run
    msg = self.read()
  File "/tmp/B.ny5_gl9e/BUILD/Python-2.7.18/Lib/test/test_ssl.py", line 1778, in read
    return self.sslconn.read()
  File "/tmp/B.ny5_gl9e/BUILD/Python-2.7.18/Lib/ssl.py", line 641, in read
    v = self._sslobj.read(len)
error: [Errno 104] Connection reset by peer

test test_ssl failed -- Traceback (most recent call last):
  File "/tmp/B.ny5_gl9e/BUILD/Python-2.7.18/Lib/test/test_ssl.py", line 1382, in test_subclass
    c.do_handshake()
  File "/tmp/B.ny5_gl9e/BUILD/Python-2.7.18/Lib/ssl.py", line 828, in do_handshake
    self._sslobj.do_handshake()
SSLError: [SSL] internal error (_ssl.c:733)

0:03:46 load avg: 0.51 [301/390/1] test_startfile -- test_ssl failed
test_startfile skipped -- module 'os' has no attribute 'startfile'
0:03:46 load avg: 0.51 [302/390/1] test_stat -- test_startfile skipped
0:03:46 load avg: 0.51 [303/390/1] test_str
0:03:47 load avg: 0.51 [304/390/1] test_strftime
0:03:47 load avg: 0.51 [305/390/1] test_string
0:03:48 load avg: 0.55 [306/390/1] test_stringprep
0:03:48 load avg: 0.55 [307/390/1] test_strop
0:03:48 load avg: 0.55 [308/390/1] test_strptime
0:03:48 load avg: 0.55 [309/390/1] test_strtod
0:03:49 load avg: 0.55 [310/390/1] test_struct
0:03:49 load avg: 0.55 [311/390/1] test_structmembers
0:03:49 load avg: 0.55 [312/390/1] test_structseq
0:03:49 load avg: 0.55 [313/390/1] test_subprocess
0:04:33 load avg: 0.49 [314/390/1] test_sunau -- test_subprocess passed in 43 sec 395 ms
0:04:33 load avg: 0.49 [315/390/1] test_sunaudiodev
test_sunaudiodev skipped -- No module named sunaudiodev
0:04:33 load avg: 0.49 [316/390/1] test_sundry -- test_sunaudiodev skipped
0:04:33 load avg: 0.49 [317/390/1] test_symtable
0:04:33 load avg: 0.49 [318/390/1] test_syntax
0:04:33 load avg: 0.49 [319/390/1] test_sys
0:04:34 load avg: 0.49 [320/390/1] test_sys_setprofile
0:04:34 load avg: 0.49 [321/390/1] test_sys_settrace
0:04:34 load avg: 0.49 [322/390/1] test_sysconfig
0:04:34 load avg: 0.49 [323/390/1] test_tarfile
0:04:36 load avg: 0.49 [324/390/1] test_tcl
0:04:36 load avg: 0.49 [325/390/1] test_telnetlib
0:04:41 load avg: 0.53 [326/390/1] test_tempfile
0:04:42 load avg: 0.53 [327/390/1] test_test_support
0:04:42 load avg: 0.53 [328/390/1] test_textwrap
0:04:42 load avg: 0.53 [329/390/1] test_thread
0:04:43 load avg: 0.57 [330/390/1] test_threaded_import
0:04:43 load avg: 0.57 [331/390/1] test_threadedtempfile
0:04:43 load avg: 0.57 [332/390/1] test_threading
0:04:47 load avg: 0.57 [333/390/1] test_threading_local
0:04:48 load avg: 0.61 [334/390/1] test_threadsignals
0:04:48 load avg: 0.61 [335/390/1] test_time
0:04:49 load avg: 0.61 [336/390/1] test_timeit
0:04:49 load avg: 0.61 [337/390/1] test_timeout
test_timeout skipped -- Use of the `network' resource not enabled
0:04:49 load avg: 0.61 [338/390/1] test_tk -- test_timeout skipped (resource denied)
test_tk skipped -- Use of the `gui' resource not enabled
0:04:49 load avg: 0.61 [339/390/1] test_tokenize -- test_tk skipped (resource denied)
0:04:50 load avg: 0.61 [340/390/1] test_tools
0:04:51 load avg: 0.61 [341/390/1] test_trace
0:04:52 load avg: 0.61 [342/390/1] test_traceback
0:04:56 load avg: 0.56 [343/390/1] test_transformer
0:04:56 load avg: 0.56 [344/390/1] test_ttk_guionly
test_ttk_guionly skipped -- Use of the `gui' resource not enabled
0:04:56 load avg: 0.56 [345/390/1] test_ttk_textonly -- test_ttk_guionly skipped (resource denied)
0:04:57 load avg: 0.56 [346/390/1] test_tuple
0:05:01 load avg: 0.59 [347/390/1] test_turtle
0:05:01 load avg: 0.59 [348/390/1] test_typechecks
0:05:02 load avg: 0.59 [349/390/1] test_ucn
0:05:02 load avg: 0.59 [350/390/1] test_unary
0:05:02 load avg: 0.59 [351/390/1] test_undocumented_details
0:05:02 load avg: 0.59 [352/390/1] test_unicode
0:05:09 load avg: 0.66 [353/390/1] test_unicode_file
0:05:09 load avg: 0.66 [354/390/1] test_unicodedata
0:05:11 load avg: 0.66 [355/390/1] test_univnewlines
0:05:11 load avg: 0.66 [356/390/1] test_univnewlines2k
0:05:11 load avg: 0.66 [357/390/1] test_unpack
0:05:11 load avg: 0.66 [358/390/1] test_urllib
0:05:11 load avg: 0.66 [359/390/1] test_urllib2_localnet
0:05:12 load avg: 0.66 [360/390/1] test_urllib2net
test_urllib2net skipped -- Use of the `network' resource not enabled
0:05:12 load avg: 0.68 [361/390/1] test_urllibnet -- test_urllib2net skipped (resource denied)
test_urllibnet skipped -- Use of the `network' resource not enabled
0:05:13 load avg: 0.68 [362/390/1] test_urlparse -- test_urllibnet skipped (resource denied)
0:05:14 load avg: 0.68 [363/390/1] test_userdict
0:05:14 load avg: 0.68 [364/390/1] test_userlist
0:05:14 load avg: 0.68 [365/390/1] test_userstring
0:05:16 load avg: 0.68 [366/390/1] test_uu
0:05:16 load avg: 0.68 [367/390/1] test_uuid
0:05:17 load avg: 0.68 [368/390/1] test_wait3
0:05:22 load avg: 0.63 [369/390/1] test_wait4
0:05:28 load avg: 0.53 [370/390/1] test_warnings
0:05:28 load avg: 0.53 [371/390/1] test_wave
0:05:28 load avg: 0.53 [372/390/1] test_weakref
0:06:25 load avg: 0.81 [373/390/1] test_weakset -- test_weakref passed in 56 sec 84 ms
0:06:25 load avg: 0.81 [374/390/1] test_whichdb
0:06:26 load avg: 0.81 [375/390/1] test_winreg
test_winreg skipped -- No module named _winreg
0:06:26 load avg: 0.81 [376/390/1] test_winsound -- test_winreg skipped
test_winsound skipped -- Use of the `audio' resource not enabled
0:06:26 load avg: 0.81 [377/390/1] test_with -- test_winsound skipped (resource denied)
0:06:26 load avg: 0.81 [378/390/1] test_wsgiref
0:06:26 load avg: 0.81 [379/390/1] test_xdrlib
0:06:26 load avg: 0.81 [380/390/1] test_xml_etree
0:06:26 load avg: 0.81 [381/390/1] test_xml_etree_c
0:06:27 load avg: 0.81 [382/390/1] test_xmllib
0:06:27 load avg: 0.81 [383/390/1] test_xmlrpc
0:06:30 load avg: 0.75 [384/390/1] test_xpickle
0:06:30 load avg: 0.75 [385/390/1] test_xrange
0:06:31 load avg: 0.75 [386/390/1] test_zipfile
0:06:33 load avg: 0.77 [387/390/1] test_zipfile64
test_zipfile64 skipped -- test requires loads of disk-space bytes and a long time to run
0:06:33 load avg: 0.77 [388/390/1] test_zipimport -- test_zipfile64 skipped (resource denied)
0:06:33 load avg: 0.77 [389/390/1] test_zipimport_support
0:06:34 load avg: 0.77 [390/390/1] test_zlib

== Tests result: FAILURE ==

352 tests OK.

1 test failed:
    test_ssl

37 tests skipped:
    test_aepack test_al test_applesingle test_bsddb185 test_bsddb3
    test_cd test_cl test_codecmaps_cn test_codecmaps_hk
    test_codecmaps_jp test_codecmaps_kr test_codecmaps_tw test_curses
    test_dl test_gl test_imgfile test_ioctl test_kqueue
    test_linuxaudiodev test_macos test_macostools test_msilib
    test_ossaudiodev test_py3kwarn test_scriptpackages test_smtpnet
    test_socketserver test_startfile test_sunaudiodev test_timeout
    test_tk test_ttk_guionly test_urllib2net test_urllibnet
    test_winreg test_winsound test_zipfile64
1 skip unexpected on linux2:
    test_ioctl

Re-running failed tests in verbose mode
Re-running test 'test_ssl' in verbose mode
test_ssl: testing with 'OpenSSL 3.3.0 9 Apr 2024' (3, 3, 0, 0, 0)
          under Linux ('PLD Linux (Th)', '3.0', '')
          HAS_SNI = True
          OP_ALL = 0x80000050
          OP_NO_TLSv1_1 = 0x10000000
test__create_stdlib_context (test.test_ssl.ContextTests) ... ok
test__https_verify_certificates (test.test_ssl.ContextTests) ... ok
test__https_verify_envvar (test.test_ssl.ContextTests) ... ok
test_cert_store_stats (test.test_ssl.ContextTests) ... ok
test_check_hostname (test.test_ssl.ContextTests) ... ok
test_ciphers (test.test_ssl.ContextTests) ... ok
test_constructor (test.test_ssl.ContextTests) ... ok
test_create_default_context (test.test_ssl.ContextTests) ... ok
test_get_ca_certs (test.test_ssl.ContextTests) ... ok
test_load_cert_chain (test.test_ssl.ContextTests) ... ok
test_load_default_certs (test.test_ssl.ContextTests) ... ok
test_load_default_certs_env (test.test_ssl.ContextTests) ... ok
test_load_default_certs_env_windows (test.test_ssl.ContextTests) ... skipped 'Windows specific'
test_load_dh_params (test.test_ssl.ContextTests) ... ok
test_load_verify_cadata (test.test_ssl.ContextTests) ... ok
test_load_verify_locations (test.test_ssl.ContextTests) ... ok
test_options (test.test_ssl.ContextTests) ... ok
test_protocol (test.test_ssl.ContextTests) ... ok
test_session_stats (test.test_ssl.ContextTests) ... ok
test_set_default_verify_paths (test.test_ssl.ContextTests) ... ok
test_set_ecdh_curve (test.test_ssl.ContextTests) ... ok
test_sni_callback (test.test_ssl.ContextTests) ... ok
test_sni_callback_refcycle (test.test_ssl.ContextTests) ... ok
test_verify_flags (test.test_ssl.ContextTests) ... ok
test_verify_mode (test.test_ssl.ContextTests) ... ok
test_sslwrap_simple (test.test_ssl.BasicTests) ... ok
test_DER_to_PEM (test.test_ssl.BasicSocketTests) ... ok
test_asn1object (test.test_ssl.BasicSocketTests) ... ok
test_cert_time_to_seconds (test.test_ssl.BasicSocketTests) ... ok
test_cert_time_to_seconds_locale (test.test_ssl.BasicSocketTests) ... skipped 'locale-specific month name needs to be different from C locale'
test_cert_time_to_seconds_timezone (test.test_ssl.BasicSocketTests) ... ok
test_constants (test.test_ssl.BasicSocketTests) ... ok
test_empty_cert (test.test_ssl.BasicSocketTests)
Wrapping with an empty cert file ... ok
test_enum_certificates (test.test_ssl.BasicSocketTests) ... skipped 'Windows specific'
test_enum_crls (test.test_ssl.BasicSocketTests) ... skipped 'Windows specific'
test_errors (test.test_ssl.BasicSocketTests) ... ok
test_get_default_verify_paths (test.test_ssl.BasicSocketTests) ... ok
test_malformed_cert (test.test_ssl.BasicSocketTests)
Wrapping with a badly formatted certificate (syntax error) ... ok
test_malformed_key (test.test_ssl.BasicSocketTests)
Wrapping with a badly formatted key (syntax error) ... ok
test_match_hostname (test.test_ssl.BasicSocketTests) ... ok
test_openssl_version (test.test_ssl.BasicSocketTests) ... ok
test_parse_all_sans (test.test_ssl.BasicSocketTests) ... ok
test_parse_cert (test.test_ssl.BasicSocketTests) ... 
{'issuer': ((('countryName', u'XY'),),
            (('localityName', u'Castle Anthrax'),),
            (('organizationName', u'Python Software Foundation'),),
            (('commonName', u'localhost'),)),
 'notAfter': 'Aug 26 14:23:15 2028 GMT',
 'notBefore': u'Aug 29 14:23:15 2018 GMT',
 'serialNumber': u'98A7CF88C74A32ED',
 'subject': ((('countryName', u'XY'),),
             (('localityName', u'Castle Anthrax'),),
             (('organizationName', u'Python Software Foundation'),),
             (('commonName', u'localhost'),)),
 'subjectAltName': (('DNS', 'localhost'),),
 'version': 3L}

{'OCSP': (u'http://ocsp.verisign.com',),
 'caIssuers': (u'http://SVRIntl-G3-aia.verisign.com/SVRIntlG3.cer',),
 'crlDistributionPoints': (u'http://SVRIntl-G3-crl.verisign.com/SVRIntlG3.crl',),
 'issuer': ((('countryName', u'US'),),
            (('organizationName', u'VeriSign, Inc.'),),
            (('organizationalUnitName', u'VeriSign Trust Network'),),
            (('organizationalUnitName',
              u'Terms of use at https://www.verisign.com/rpa (c)10'),),
            (('commonName',
              u'VeriSign Class 3 International Server CA - G3'),)),
 'notAfter': 'Sep 20 23:59:59 2012 GMT',
 'notBefore': u'Sep 21 00:00:00 2011 GMT',
 'serialNumber': u'2EE6EA7640A075CEE5005F4D7C79549A',
 'subject': ((('countryName', u'FI'),),
             (('stateOrProvinceName', u'Espoo'),),
             (('localityName', u'Espoo'),),
             (('organizationName', u'Nokia'),),
             (('organizationalUnitName', u'BI'),),
             (('commonName', u'projects.developer.nokia.com'),)),
 'subjectAltName': (('DNS', 'projects.developer.nokia.com'),
                    ('DNS', 'projects.forum.nokia.com')),
 'version': 3L}
ok
test_parse_cert_CVE_2013_4238 (test.test_ssl.BasicSocketTests) ... 
{'issuer': ((('countryName', u'US'),),
            (('stateOrProvinceName', u'Oregon'),),
            (('localityName', u'Beaverton'),),
            (('organizationName', u'Python Software Foundation'),),
            (('organizationalUnitName', u'Python Core Development'),),
            (('commonName', u'null.python.org\x00example.org'),),
            (('emailAddress', u'python-dev@python.org'),)),
 'notAfter': 'Aug  7 13:12:52 2013 GMT',
 'notBefore': u'Aug  7 13:11:52 2013 GMT',
 'serialNumber': u'00',
 'subject': ((('countryName', u'US'),),
             (('stateOrProvinceName', u'Oregon'),),
             (('localityName', u'Beaverton'),),
             (('organizationName', u'Python Software Foundation'),),
             (('organizationalUnitName', u'Python Core Development'),),
             (('commonName', u'null.python.org\x00example.org'),),
             (('emailAddress', u'python-dev@python.org'),)),
 'subjectAltName': (('DNS', 'altnull.python.org\x00example.com'),
                    ('email', 'null@python.org\x00user@example.org'),
                    ('URI', 'http://null.python.org\x00http://example.org'),
                    ('IP Address', '192.0.2.1'),
                    ('IP Address', '2001:DB8:0:0:0:0:0:1')),
 'version': 3L}
ok
test_parse_cert_CVE_2019_5010 (test.test_ssl.BasicSocketTests) ... 
{'issuer': ((('countryName', u'UK'),), (('commonName', u'cody-ca'),)),
 'notAfter': 'Jun 14 18:00:58 2028 GMT',
 'notBefore': u'Jun 18 18:00:58 2018 GMT',
 'serialNumber': u'02',
 'subject': ((('countryName', u'UK'),),
             (('commonName', u'codenomicon-vm-2.test.lal.cisco.com'),)),
 'subjectAltName': (('DNS', 'codenomicon-vm-2.test.lal.cisco.com'),),
 'version': 3L}
ok
test_purpose_enum (test.test_ssl.BasicSocketTests) ... ok
test_random (test.test_ssl.BasicSocketTests) ... 
 RAND_status is 1 (sufficient randomness)
ok
test_refcycle (test.test_ssl.BasicSocketTests) ... ok
test_server_side (test.test_ssl.BasicSocketTests) ... ok
test_timeout (test.test_ssl.BasicSocketTests) ... ok
test_tls_unique_channel_binding (test.test_ssl.BasicSocketTests) ... ok
test_unknown_channel_binding (test.test_ssl.BasicSocketTests) ... ok
test_unsupported_dtls (test.test_ssl.BasicSocketTests) ... ok
test_wrapped_unconnected (test.test_ssl.BasicSocketTests) ... ok
test_lib_reason (test.test_ssl.SSLErrorTests) ... ok
test_str (test.test_ssl.SSLErrorTests) ... ok
test_subclass (test.test_ssl.SSLErrorTests) ... ERROR
test_alpn_protocols (test.test_ssl.ThreadedTests) ...  server:  new connection from ('127.0.0.1', 46234)
 server: connection cipher is now ('ECDHE-RSA-AES256-GCM-SHA384', 'TLSv1.2', 256)
 server: selected protocol is now None
 client:  sending 'FOO\n'...
 client:  read 'foo\n'
 client:  sending 'FOO\n'...
 client:  read 'foo\n'
 client:  sending 'FOO\n'...
 client:  read 'foo\n'
 client:  closing connection.
 server:  new connection from ('127.0.0.1', 51064)
 server: connection cipher is now ('ECDHE-RSA-AES256-GCM-SHA384', 'TLSv1.2', 256)
 server: selected protocol is now None
 client:  sending 'FOO\n'...
 client:  read 'foo\n'
 client:  sending 'FOO\n'...
 client:  read 'foo\n'
 client:  sending 'FOO\n'...
 client:  read 'foo\n'
 client:  closing connection.
 server:  new connection from ('127.0.0.1', 40472)
 server: connection cipher is now ('ECDHE-RSA-AES256-GCM-SHA384', 'TLSv1.2', 256)
 server: selected protocol is now None
 client:  sending 'FOO\n'...
 client:  read 'foo\n'
 client:  sending 'FOO\n'...
 client:  read 'foo\n'
 client:  sending 'FOO\n'...
 client:  read 'foo\n'
 client:  closing connection.
 server:  new connection from ('127.0.0.1', 43850)
 server: connection cipher is now ('ECDHE-RSA-AES256-GCM-SHA384', 'TLSv1.2', 256)
 server: selected protocol is now None
 client:  sending 'FOO\n'...
 client:  read 'foo\n'
 client:  sending 'FOO\n'...
 client:  read 'foo\n'
 client:  sending 'FOO\n'...
 client:  read 'foo\n'
 client:  closing connection.
ok
test_asyncore_server (test.test_ssl.ThreadedTests)
Check the example asyncore integration. ... 
 server:  new connection from 127.0.0.1:37122
 client:  sending 'FOO\n'...
 server:  read 'FOO\n' from client
 client:  read 'foo\n'
 client:  closing connection.
 client:  connection closed.
 cleanup: stopping server.
 cleanup: joining server thread.
 server:  read 'over\n' from client
 server:  closed connection <ssl.SSLSocket object at 0x7f014c89ebd0>
 server:  read '' from client
 cleanup: successfully joined.
ok
test_check_hostname (test.test_ssl.ThreadedTests) ... Exception in thread Thread-1413:
Traceback (most recent call last):
  File "/tmp/B.ny5_gl9e/BUILD/Python-2.7.18/Lib/threading.py", line 801, in __bootstrap_inner
    self.run()
  File "/tmp/B.ny5_gl9e/BUILD/Python-2.7.18/Lib/test/test_ssl.py", line 1801, in run
    msg = self.read()
  File "/tmp/B.ny5_gl9e/BUILD/Python-2.7.18/Lib/test/test_ssl.py", line 1778, in read
    return self.sslconn.read()
  File "/tmp/B.ny5_gl9e/BUILD/Python-2.7.18/Lib/ssl.py", line 641, in read
    v = self._sslobj.read(len)
error: [Errno 104] Connection reset by peer

Exception in thread Thread-1415:
Traceback (most recent call last):
  File "/tmp/B.ny5_gl9e/BUILD/Python-2.7.18/Lib/threading.py", line 801, in __bootstrap_inner
    self.run()
  File "/tmp/B.ny5_gl9e/BUILD/Python-2.7.18/Lib/test/test_ssl.py", line 1801, in run
    msg = self.read()
  File "/tmp/B.ny5_gl9e/BUILD/Python-2.7.18/Lib/test/test_ssl.py", line 1778, in read
    return self.sslconn.read()
  File "/tmp/B.ny5_gl9e/BUILD/Python-2.7.18/Lib/ssl.py", line 641, in read
    v = self._sslobj.read(len)
error: [Errno 104] Connection reset by peer


 server:  new connection from ('127.0.0.1', 52740)
 server: connection cipher is now ('TLS_AES_256_GCM_SHA384', 'TLSv1.3', 256)
 server: selected protocol is now None
 server:  new connection from ('127.0.0.1', 54774)
 server: connection cipher is now ('TLS_AES_256_GCM_SHA384', 'TLSv1.3', 256)
 server: selected protocol is now None
ok
test_compression (test.test_ssl.ThreadedTests) ...  server:  new connection from ('127.0.0.1', 50388)
 client:  sending 'FOO\n'...
 server: connection cipher is now ('TLS_AES_256_GCM_SHA384', 'TLSv1.3', 256)
 server: selected protocol is now None
 client:  read 'foo\n'
 client:  sending 'FOO\n'...
 client:  read 'foo\n'
 client:  sending 'FOO\n'...
 client:  read 'foo\n'
 client:  closing connection.
 got compression: None
ok
test_compression_disabled (test.test_ssl.ThreadedTests) ...  server:  new connection from ('127.0.0.1', 50296)
 client:  sending 'FOO\n'...
 server: connection cipher is now ('TLS_AES_256_GCM_SHA384', 'TLSv1.3', 256)
 server: selected protocol is now None
 client:  read 'foo\n'
 client:  sending 'FOO\n'...
 client:  read 'foo\n'
 client:  sending 'FOO\n'...
 client:  read 'foo\n'
 client:  closing connection.
ok
test_crl_check (test.test_ssl.ThreadedTests) ... Exception in thread Thread-1422:
Traceback (most recent call last):
  File "/tmp/B.ny5_gl9e/BUILD/Python-2.7.18/Lib/threading.py", line 801, in __bootstrap_inner
    self.run()
  File "/tmp/B.ny5_gl9e/BUILD/Python-2.7.18/Lib/test/test_ssl.py", line 1801, in run
    msg = self.read()
  File "/tmp/B.ny5_gl9e/BUILD/Python-2.7.18/Lib/test/test_ssl.py", line 1778, in read
    return self.sslconn.read()
  File "/tmp/B.ny5_gl9e/BUILD/Python-2.7.18/Lib/ssl.py", line 641, in read
    v = self._sslobj.read(len)
error: [Errno 104] Connection reset by peer


 server:  new connection from ('127.0.0.1', 52608)
 server: connection cipher is now ('TLS_AES_256_GCM_SHA384', 'TLSv1.3', 256)
 server: selected protocol is now None
 server:  new connection from ('127.0.0.1', 52144)

 server:  bad connection attempt from ('127.0.0.1', 52144):
Traceback (most recent call last):
   File "/tmp/B.ny5_gl9e/BUILD/Python-2.7.18/Lib/test/test_ssl.py", line 1721, in wrap_conn
    self.sock, server_side=True)
   File "/tmp/B.ny5_gl9e/BUILD/Python-2.7.18/Lib/ssl.py", line 369, in wrap_socket
    _context=self)
   File "/tmp/B.ny5_gl9e/BUILD/Python-2.7.18/Lib/ssl.py", line 599, in __init__
    self.do_handshake()
   File "/tmp/B.ny5_gl9e/BUILD/Python-2.7.18/Lib/ssl.py", line 828, in do_handshake
    self._sslobj.do_handshake()
 SSLError: [SSL: TLSV1_ALERT_UNKNOWN_CA] tlsv1 alert unknown ca (_ssl.c:733)
 server:  new connection from ('127.0.0.1', 48890)
 server: connection cipher is now ('TLS_AES_256_GCM_SHA384', 'TLSv1.3', 256)
 server: selected protocol is now None
ok
test_default_ecdh_curve (test.test_ssl.ThreadedTests) ...  server:  new connection from ('127.0.0.1', 40086)
 server: connection cipher is now ('ECDHE-RSA-AES256-GCM-SHA384', 'TLSv1.2', 256)
 server: selected protocol is now None
ok
test_dh_params (test.test_ssl.ThreadedTests) ...  server:  new connection from ('127.0.0.1', 41990)
 server: connection cipher is now ('DHE-RSA-AES256-GCM-SHA384', 'TLSv1.2', 256)
 server: selected protocol is now None
 client:  sending 'FOO\n'...
 client:  read 'foo\n'
 client:  sending 'FOO\n'...
 client:  read 'foo\n'
 client:  sending 'FOO\n'...
 client:  read 'foo\n'
 client:  closing connection.
ok
test_do_handshake_enotconn (test.test_ssl.ThreadedTests) ... ok
test_echo (test.test_ssl.ThreadedTests)
Basic test of an SSL client connecting to a server ... 
 server:  new connection from ('127.0.0.1', 46094)
 client:  sending 'FOO\n'...
 server: connection cipher is now ('TLS_AES_256_GCM_SHA384', 'TLSv1.3', 256)
 server: selected protocol is now None
 client:  read 'foo\n'
 client:  sending 'FOO\n'...
 client:  read 'foo\n'
 client:  sending 'FOO\n'...
 client:  read 'foo\n'
 client:  closing connection.
 server:  new connection from ('127.0.0.1', 55938)
 server: connection cipher is now ('ECDHE-RSA-AES256-GCM-SHA384', 'TLSv1.2', 256)
 server: selected protocol is now None
 client:  sending 'FOO\n'...
 client:  read 'foo\n'
 client:  sending 'FOO\n'...
 client:  read 'foo\n'
 client:  sending 'FOO\n'...
 client:  read 'foo\n'
 client:  closing connection.
ok
test_getpeercert (test.test_ssl.ThreadedTests) ... 
{'issuer': ((('countryName', u'XY'),),
            (('localityName', u'Castle Anthrax'),),
            (('organizationName', u'Python Software Foundation'),),
            (('commonName', u'localhost'),)),
 'notAfter': 'Aug 26 14:23:15 2028 GMT',
 'notBefore': u'Aug 29 14:23:15 2018 GMT',
 'serialNumber': u'98A7CF88C74A32ED',
 'subject': ((('countryName', u'XY'),),
             (('localityName', u'Castle Anthrax'),),
             (('organizationName', u'Python Software Foundation'),),
             (('commonName', u'localhost'),)),
 'subjectAltName': (('DNS', 'localhost'),),
 'version': 3L}
Connection cipher is ('TLS_AES_256_GCM_SHA384', 'TLSv1.3', 256).
ok
test_getpeercert_enotconn (test.test_ssl.ThreadedTests) ... ok
test_handshake_timeout (test.test_ssl.ThreadedTests) ... ok
test_no_shared_ciphers (test.test_ssl.ThreadedTests) ...  server:  new connection from ('127.0.0.1', 37058)

 server:  bad connection attempt from ('127.0.0.1', 37058):
Traceback (most recent call last):
   File "/tmp/B.ny5_gl9e/BUILD/Python-2.7.18/Lib/test/test_ssl.py", line 1721, in wrap_conn
    self.sock, server_side=True)
   File "/tmp/B.ny5_gl9e/BUILD/Python-2.7.18/Lib/ssl.py", line 369, in wrap_socket
    _context=self)
   File "/tmp/B.ny5_gl9e/BUILD/Python-2.7.18/Lib/ssl.py", line 599, in __init__
    self.do_handshake()
   File "/tmp/B.ny5_gl9e/BUILD/Python-2.7.18/Lib/ssl.py", line 828, in do_handshake
    self._sslobj.do_handshake()
 SSLError: [SSL: NO_SHARED_CIPHER] no shared cipher (_ssl.c:733)
ok
test_npn_protocols (test.test_ssl.ThreadedTests) ... skipped 'NPN support needed for this test'
test_protocol_sslv2 (test.test_ssl.ThreadedTests)
Connecting to an SSLv2 server with various client options ... skipped 'OpenSSL is compiled without SSLv2 support'
test_protocol_sslv23 (test.test_ssl.ThreadedTests)
Connecting to an SSLv23 server with various client options ... skipped 'OpenSSL 3 supports only protocols > TLSv1.'
test_protocol_sslv3 (test.test_ssl.ThreadedTests)
Connecting to an SSLv3 server with various client options ... skipped 'OpenSSL is compiled without SSLv3 support'
test_protocol_tlsv1_2 (test.test_ssl.ThreadedTests)
Connecting to a TLSv1.2 server with various client options. ... 
 PROTOCOL_TLSv1_2->PROTOCOL_TLSv1_2 CERT_NONE
 {PROTOCOL_TLS->PROTOCOL_TLSv1_2} CERT_NONE
 PROTOCOL_TLSv1_2->PROTOCOL_TLS CERT_NONE
 {PROTOCOL_TLSv1->PROTOCOL_TLSv1_2} CERT_NONE
 {PROTOCOL_TLSv1_2->PROTOCOL_TLSv1} CERT_NONE
 {PROTOCOL_TLSv1_1->PROTOCOL_TLSv1_2} CERT_NONE
 {PROTOCOL_TLSv1_2->PROTOCOL_TLSv1_1} CERT_NONE
ok
test_read_write_after_close_raises_valuerror (test.test_ssl.ThreadedTests) ... ok
test_recv_send (test.test_ssl.ThreadedTests)
Test recv(), send() and friends. ... 
 server:  new connection from ('127.0.0.1', 41276)
 server: connection cipher is now ('TLS_AES_256_GCM_SHA384', 'TLSv1.3', 256)
 server: selected protocol is now None
ok
test_recv_zero (test.test_ssl.ThreadedTests) ...  server:  new connection from ('127.0.0.1', 45868)
 server: connection cipher is now ('TLS_AES_256_GCM_SHA384', 'TLSv1.3', 256)
 server: selected protocol is now None
ok
test_rude_shutdown (test.test_ssl.ThreadedTests)
A brutal shutdown of an SSL server should raise an OSError ... ok
test_selected_alpn_protocol (test.test_ssl.ThreadedTests) ...  server:  new connection from ('127.0.0.1', 41806)
 client:  sending 'FOO\n'...
 server: connection cipher is now ('TLS_AES_256_GCM_SHA384', 'TLSv1.3', 256)
 server: selected protocol is now None
 client:  read 'foo\n'
 client:  sending 'FOO\n'...
 client:  read 'foo\n'
 client:  sending 'FOO\n'...
 client:  read 'foo\n'
 client:  closing connection.
ok
test_selected_alpn_protocol_if_server_uses_alpn (test.test_ssl.ThreadedTests) ...  server:  new connection from ('127.0.0.1', 56912)
 client:  sending 'FOO\n'...
 server: connection cipher is now ('TLS_AES_256_GCM_SHA384', 'TLSv1.3', 256)
 server: selected protocol is now None
 client:  read 'foo\n'
 client:  sending 'FOO\n'...
 client:  read 'foo\n'
 client:  sending 'FOO\n'...
 client:  read 'foo\n'
 client:  closing connection.
ok
test_selected_npn_protocol (test.test_ssl.ThreadedTests) ...  server:  new connection from ('127.0.0.1', 58166)
 client:  sending 'FOO\n'...
 server: connection cipher is now ('TLS_AES_256_GCM_SHA384', 'TLSv1.3', 256)
 server: selected protocol is now None
 client:  read 'foo\n'
 client:  sending 'FOO\n'...
 client:  read 'foo\n'
 client:  sending 'FOO\n'...
 client:  read 'foo\n'
 client:  closing connection.
ok
test_server_accept (test.test_ssl.ThreadedTests) ... ok
test_sni_callback (test.test_ssl.ThreadedTests) ...  server:  new connection from ('127.0.0.1', 38768)
 server: connection cipher is now ('TLS_AES_256_GCM_SHA384', 'TLSv1.3', 256)
 server: selected protocol is now None
 server:  new connection from ('127.0.0.1', 54388)
 server: connection cipher is now ('TLS_AES_256_GCM_SHA384', 'TLSv1.3', 256)
 server: selected protocol is now None
 server:  new connection from ('127.0.0.1', 39732)
 server: connection cipher is now ('TLS_AES_256_GCM_SHA384', 'TLSv1.3', 256)
 server: selected protocol is now None
ok
test_sni_callback_alert (test.test_ssl.ThreadedTests) ... ok
test_sni_callback_raising (test.test_ssl.ThreadedTests) ... ok
test_sni_callback_wrong_return_type (test.test_ssl.ThreadedTests) ... ok
test_socketserver (test.test_ssl.ThreadedTests)
Using a SocketServer to create and manage SSL connections. ... 
 server (('127.0.0.1', 32995):32995 ('TLS_AES_256_GCM_SHA384', 'TLSv1.3', 256)):
   [18/May/2024 10:20:39] "GET /keycert.pem HTTP/1.1" 200 -
 client: read 4058 bytes from remote server '<HTTPSServerThread <HTTPSServer localhost:32995>>'
stopping HTTPS server
joining HTTPS thread
ok
test_starttls (test.test_ssl.ThreadedTests)
Switching from clear text to encrypted and back again. ... 
 client:  sending 'msg 1'...
 server:  new connection from ('127.0.0.1', 45310)
 server: read 'msg 1' (unencrypted), sending back 'msg 1' (unencrypted)...
 client:  read 'msg 1' from server
 client:  sending 'MSG 2'...
 server: read 'MSG 2' (unencrypted), sending back 'msg 2' (unencrypted)...
 client:  read 'msg 2' from server
 client:  sending 'STARTTLS'...
 server: read STARTTLS from client, sending OK...
 client:  read 'ok' from server, starting TLS...
 client:  sending 'MSG 3'...
 server: connection cipher is now ('TLS_AES_256_GCM_SHA384', 'TLSv1.3', 256)
 server: selected protocol is now None
 server: read 'MSG 3' (encrypted), sending back 'msg 3' (encrypted)...
 client:  read 'msg 3' from server
 client:  sending 'msg 4'...
 server: read 'msg 4' (encrypted), sending back 'msg 4' (encrypted)...
 client:  read 'msg 4' from server
 client:  sending 'ENDTLS'...
 server: read ENDTLS from client, sending OK...
 client:  read 'ok' from server, ending TLS...
 server: connection is now unencrypted...
 client:  sending 'msg 5'...
 server: read 'msg 5' (unencrypted), sending back 'msg 5' (unencrypted)...
 client:  read 'msg 5' from server
 client:  sending 'msg 6'...
 server: read 'msg 6' (unencrypted), sending back 'msg 6' (unencrypted)...
 client:  read 'msg 6' from server
 client:  closing connection.
 server: client closed connection
ok
test_tls1_3 (test.test_ssl.ThreadedTests) ... Exception in thread Thread-1484:
Traceback (most recent call last):
  File "/tmp/B.ny5_gl9e/BUILD/Python-2.7.18/Lib/threading.py", line 801, in __bootstrap_inner
    self.run()
  File "/tmp/B.ny5_gl9e/BUILD/Python-2.7.18/Lib/test/test_ssl.py", line 1801, in run
    msg = self.read()
  File "/tmp/B.ny5_gl9e/BUILD/Python-2.7.18/Lib/test/test_ssl.py", line 1778, in read
    return self.sslconn.read()
  File "/tmp/B.ny5_gl9e/BUILD/Python-2.7.18/Lib/ssl.py", line 641, in read
    v = self._sslobj.read(len)
error: [Errno 104] Connection reset by peer

 server:  new connection from ('127.0.0.1', 59384)
 server: connection cipher is now ('TLS_AES_256_GCM_SHA384', 'TLSv1.3', 256)
 server: selected protocol is now None
ok
test_tls_unique_channel_binding (test.test_ssl.ThreadedTests)
Test tls-unique channel binding. ... 
 server:  new connection from ('127.0.0.1', 60714)
 server: connection cipher is now ('ECDHE-RSA-AES256-GCM-SHA384', 'TLSv1.2', 256)
 server: selected protocol is now None
 got channel binding data: '\x10\xa1\xaa7e\x14K\xf6tX\x840'
 server:  new connection from ('127.0.0.1', 60720)
 server: connection cipher is now ('ECDHE-RSA-AES256-GCM-SHA384', 'TLSv1.2', 256)
 server: selected protocol is now None
 got another channel binding data: '*\xaa\xa6\x0eb\xb9g\xe0O\x02\xdd\x8d'
ok
test_version_basic (test.test_ssl.ThreadedTests) ... ok
test_wrong_cert (test.test_ssl.ThreadedTests)
Connecting when the server rejects the client's certificate ... test test_ssl failed -- Traceback (most recent call last):
  File "/tmp/B.ny5_gl9e/BUILD/Python-2.7.18/Lib/test/test_ssl.py", line 1382, in test_subclass
    c.do_handshake()
  File "/tmp/B.ny5_gl9e/BUILD/Python-2.7.18/Lib/ssl.py", line 828, in do_handshake
    self._sslobj.do_handshake()
SSLError: [SSL] internal error (_ssl.c:733)


SSLError is SSLError(1, u'[SSL] internal error (_ssl.c:733)')
ok

======================================================================
ERROR: test_subclass (test.test_ssl.SSLErrorTests)
----------------------------------------------------------------------
Traceback (most recent call last):
  File "/tmp/B.ny5_gl9e/BUILD/Python-2.7.18/Lib/test/test_ssl.py", line 1382, in test_subclass
    c.do_handshake()
  File "/tmp/B.ny5_gl9e/BUILD/Python-2.7.18/Lib/ssl.py", line 828, in do_handshake
    self._sslobj.do_handshake()
SSLError: [SSL] internal error (_ssl.c:733)

----------------------------------------------------------------------
Ran 94 tests in 2.186s

FAILED (errors=1, skipped=8)
1 test failed again:
    test_ssl

== Tests result: FAILURE then FAILURE ==

352 tests OK.

1 test failed:
    test_ssl

37 tests skipped:
    test_aepack test_al test_applesingle test_bsddb185 test_bsddb3
    test_cd test_cl test_codecmaps_cn test_codecmaps_hk
    test_codecmaps_jp test_codecmaps_kr test_codecmaps_tw test_curses
    test_dl test_gl test_imgfile test_ioctl test_kqueue
    test_linuxaudiodev test_macos test_macostools test_msilib
    test_ossaudiodev test_py3kwarn test_scriptpackages test_smtpnet
    test_socketserver test_startfile test_sunaudiodev test_timeout
    test_tk test_ttk_guionly test_urllib2net test_urllibnet
    test_winreg test_winsound test_zipfile64
1 skip unexpected on linux2:
    test_ioctl

1 re-run test:
    test_ssl

Total duration: 6 min 37 sec
Tests result: FAILURE then FAILURE
make: [Makefile:886: test] Error 2 (ignored)
LD_LIBRARY_PATH=/tmp/B.ny5_gl9e/BUILD/Python-2.7.18 PYTHONHOME=/tmp/B.ny5_gl9e/BUILD/Python-2.7.18 PYTHONPATH=/tmp/B.ny5_gl9e/BUILD/Python-2.7.18/Lib:/tmp/B.ny5_gl9e/BUILD/Python-2.7.18/Lib/lib-tk:/tmp/B.ny5_gl9e/BUILD/Python-2.7.18/build/lib.linux-x86_64-2.7 ./python -tt ./Lib/test/regrtest.py -w -l -x test_resource test_openpty test_socket test_nis test_posix test_locale test_pty test_urllib2 test_doctest test_pydoc test_distutils test_gdb test_audioop test_rgbimg test_imageop
== CPython 2.7.18 (default, May 18 2024, 10:13:07) [GCC 13.2.0 20230727 (release)]
==   Linux-6.8.6-1-x86_64-Common_KVM_processor-with-pld-3.0 little-endian
==   /tmp/B.ny5_gl9e/BUILD/Python-2.7.18/build/test_python_35280
== CPU count: 56
Run tests sequentially
0:00:00 load avg: 0.71 [  1/390] test_grammar
0:00:00 load avg: 0.71 [  2/390] test_opcodes
0:00:00 load avg: 0.71 [  3/390] test_dict
0:00:00 load avg: 0.71 [  4/390] test_builtin
0:00:00 load avg: 0.71 [  5/390] test_exceptions
0:00:00 load avg: 0.71 [  6/390] test_types
0:00:00 load avg: 0.71 [  7/390] test_unittest
0:00:00 load avg: 0.71 [  8/390] test_doctest2
0:00:00 load avg: 0.71 [  9/390] test_MimeWriter
0:00:00 load avg: 0.71 [ 10/390] test_SimpleHTTPServer
0:00:00 load avg: 0.71 [ 11/390] test_StringIO
0:00:00 load avg: 0.71 [ 12/390] test___all__
0:00:00 load avg: 0.71 [ 13/390] test___future__
0:00:00 load avg: 0.71 [ 14/390] test__locale
0:00:00 load avg: 0.71 [ 15/390] test__osx_support
0:00:00 load avg: 0.71 [ 16/390] test_abc
0:00:01 load avg: 0.71 [ 17/390] test_abstract_numbers
0:00:01 load avg: 0.71 [ 18/390] test_aepack
test_aepack skipped -- No module named aetypes
0:00:01 load avg: 0.71 [ 19/390] test_aifc -- test_aepack skipped
0:00:01 load avg: 0.71 [ 20/390] test_al
test_al skipped -- No module named al
0:00:01 load avg: 0.71 [ 21/390] test_anydbm -- test_al skipped
0:00:01 load avg: 0.71 [ 22/390] test_applesingle
test_applesingle skipped -- No module named MacOS
0:00:01 load avg: 0.71 [ 23/390] test_argparse -- test_applesingle skipped
0:00:03 load avg: 0.71 [ 24/390] test_array
0:00:03 load avg: 0.71 [ 25/390] test_ascii_formatd
0:00:03 load avg: 0.71 [ 26/390] test_ast
0:00:03 load avg: 0.71 [ 27/390] test_asynchat
0:00:05 load avg: 0.73 [ 28/390] test_asyncore
0:00:06 load avg: 0.73 [ 29/390] test_atexit
0:00:06 load avg: 0.73 [ 30/390] test_augassign
0:00:06 load avg: 0.73 [ 31/390] test_base64
0:00:06 load avg: 0.73 [ 32/390] test_bastion
0:00:06 load avg: 0.73 [ 33/390] test_bdb
0:00:06 load avg: 0.73 [ 34/390] test_bigaddrspace
0:00:06 load avg: 0.73 [ 35/390] test_bigmem
0:00:06 load avg: 0.73 [ 36/390] test_binascii
0:00:07 load avg: 0.73 [ 37/390] test_binhex
0:00:07 load avg: 0.73 [ 38/390] test_binop
0:00:07 load avg: 0.73 [ 39/390] test_bisect
0:00:07 load avg: 0.73 [ 40/390] test_bool
0:00:07 load avg: 0.73 [ 41/390] test_bsddb
0:00:08 load avg: 0.73 [ 42/390] test_bsddb185
test_bsddb185 skipped -- No module named bsddb185
0:00:08 load avg: 0.73 [ 43/390] test_bsddb3 -- test_bsddb185 skipped
test_bsddb3 skipped -- Use of the `bsddb' resource not enabled
0:00:08 load avg: 0.73 [ 44/390] test_buffer -- test_bsddb3 skipped (resource denied)
0:00:08 load avg: 0.73 [ 45/390] test_bufio
0:00:09 load avg: 0.73 [ 46/390] test_bytes
0:00:09 load avg: 0.73 [ 47/390] test_bz2
0:00:10 load avg: 0.75 [ 48/390] test_calendar
0:00:12 load avg: 0.75 [ 49/390] test_call
0:00:12 load avg: 0.75 [ 50/390] test_capi
0:00:14 load avg: 0.69 [ 51/390] test_cd
test_cd skipped -- No module named cd
0:00:14 load avg: 0.69 [ 52/390] test_cfgparser -- test_cd skipped
0:00:15 load avg: 0.69 [ 53/390] test_cgi
0:00:15 load avg: 0.69 [ 54/390] test_charmapcodec
0:00:15 load avg: 0.69 [ 55/390] test_cl
test_cl skipped -- No module named cl
0:00:15 load avg: 0.69 [ 56/390] test_class -- test_cl skipped
0:00:15 load avg: 0.69 [ 57/390] test_cmath
0:00:15 load avg: 0.69 [ 58/390] test_cmd
0:00:15 load avg: 0.69 [ 59/390] test_cmd_line
0:00:15 load avg: 0.69 [ 60/390] test_cmd_line_script
0:00:16 load avg: 0.69 [ 61/390] test_code
0:00:16 load avg: 0.69 [ 62/390] test_codeccallbacks
0:00:16 load avg: 0.69 [ 63/390] test_codecencodings_cn
0:00:16 load avg: 0.69 [ 64/390] test_codecencodings_hk
0:00:16 load avg: 0.69 [ 65/390] test_codecencodings_iso2022
0:00:17 load avg: 0.69 [ 66/390] test_codecencodings_jp
0:00:17 load avg: 0.69 [ 67/390] test_codecencodings_kr
0:00:17 load avg: 0.69 [ 68/390] test_codecencodings_tw
0:00:17 load avg: 0.69 [ 69/390] test_codecmaps_cn
test_codecmaps_cn skipped -- Use of the `urlfetch' resource not enabled
0:00:17 load avg: 0.69 [ 70/390] test_codecmaps_hk -- test_codecmaps_cn skipped (resource denied)
test_codecmaps_hk skipped -- Use of the `urlfetch' resource not enabled
0:00:17 load avg: 0.69 [ 71/390] test_codecmaps_jp -- test_codecmaps_hk skipped (resource denied)
test_codecmaps_jp skipped -- Use of the `urlfetch' resource not enabled
0:00:17 load avg: 0.69 [ 72/390] test_codecmaps_kr -- test_codecmaps_jp skipped (resource denied)
test_codecmaps_kr skipped -- Use of the `urlfetch' resource not enabled
0:00:17 load avg: 0.69 [ 73/390] test_codecmaps_tw -- test_codecmaps_kr skipped (resource denied)
test_codecmaps_tw skipped -- Use of the `urlfetch' resource not enabled
0:00:17 load avg: 0.69 [ 74/390] test_codecs -- test_codecmaps_tw skipped (resource denied)
0:00:18 load avg: 0.69 [ 75/390] test_codeop
0:00:18 load avg: 0.69 [ 76/390] test_coercion
0:00:18 load avg: 0.69 [ 77/390] test_collections
0:00:19 load avg: 0.69 [ 78/390] test_colorsys
0:00:19 load avg: 0.69 [ 79/390] test_commands
0:00:19 load avg: 0.69 [ 80/390] test_compare
0:00:19 load avg: 0.69 [ 81/390] test_compile
0:00:19 load avg: 0.69 [ 82/390] test_compileall
0:00:19 load avg: 0.69 [ 83/390] test_compiler
0:00:19 load avg: 0.69 [ 84/390] test_complex
0:00:19 load avg: 0.72 [ 85/390] test_complex_args
0:00:19 load avg: 0.72 [ 86/390] test_contains
0:00:19 load avg: 0.72 [ 87/390] test_contextlib
0:00:19 load avg: 0.72 [ 88/390] test_cookie
0:00:20 load avg: 0.72 [ 89/390] test_cookielib
0:00:20 load avg: 0.72 [ 90/390] test_copy
0:00:20 load avg: 0.72 [ 91/390] test_copy_reg
0:00:20 load avg: 0.72 [ 92/390] test_cpickle
0:00:21 load avg: 0.72 [ 93/390] test_cprofile
0:00:22 load avg: 0.72 [ 94/390] test_crypt
0:00:22 load avg: 0.72 [ 95/390] test_csv
0:00:22 load avg: 0.72 [ 96/390] test_ctypes
0:00:22 load avg: 0.72 [ 97/390] test_curses
test_curses skipped -- Use of the `curses' resource not enabled
0:00:22 load avg: 0.72 [ 98/390] test_datetime -- test_curses skipped (resource denied)
0:00:23 load avg: 0.72 [ 99/390] test_dbm
0:00:23 load avg: 0.72 [100/390] test_decimal
0:00:24 load avg: 0.72 [101/390] test_decorators
0:00:24 load avg: 0.72 [102/390] test_defaultdict
0:00:24 load avg: 0.72 [103/390] test_deque
0:00:25 load avg: 0.74 [104/390] test_descr
0:00:27 load avg: 0.74 [105/390] test_descrtut
0:00:27 load avg: 0.74 [106/390] test_dictcomps
0:00:27 load avg: 0.74 [107/390] test_dictviews
0:00:27 load avg: 0.74 [108/390] test_difflib
0:00:27 load avg: 0.74 [109/390] test_dircache
0:00:28 load avg: 0.74 [110/390] test_dis
0:00:29 load avg: 0.74 [111/390] test_dl
test_dl skipped -- No module named dl
0:00:29 load avg: 0.74 [112/390] test_docxmlrpc -- test_dl skipped
0:00:32 load avg: 0.68 [113/390] test_dumbdbm
0:00:32 load avg: 0.68 [114/390] test_dummy_thread
0:00:32 load avg: 0.68 [115/390] test_dummy_threading
0:00:32 load avg: 0.68 [116/390] test_email
0:00:36 load avg: 1.03 [117/390] test_email_codecs
0:00:36 load avg: 1.03 [118/390] test_email_renamed
0:00:36 load avg: 1.03 [119/390] test_ensurepip
0:00:36 load avg: 1.03 [120/390] test_enumerate
0:00:36 load avg: 1.03 [121/390] test_eof
0:00:36 load avg: 1.03 [122/390] test_epoll
0:00:38 load avg: 1.03 [123/390] test_errno
0:00:39 load avg: 1.03 [124/390] test_exception_variations
0:00:39 load avg: 1.03 [125/390] test_extcall
0:00:39 load avg: 1.03 [126/390] test_fcntl
0:00:39 load avg: 1.03 [127/390] test_file
0:00:39 load avg: 1.03 [128/390] test_file2k
0:00:46 load avg: 1.31 [129/390] test_file_eintr
0:00:47 load avg: 1.31 [130/390] test_filecmp
0:00:47 load avg: 1.31 [131/390] test_fileinput
0:00:47 load avg: 1.31 [132/390] test_fileio
0:00:47 load avg: 1.31 [133/390] test_float
0:00:47 load avg: 1.31 [134/390] test_fnmatch
0:00:47 load avg: 1.31 [135/390] test_fork1
0:00:54 load avg: 1.21 [136/390] test_format
0:00:54 load avg: 1.21 [137/390] test_fpformat
0:00:54 load avg: 1.19 [138/390] test_fractions
0:00:54 load avg: 1.19 [139/390] test_frozen
0:00:54 load avg: 1.19 [140/390] test_ftplib
0:00:58 load avg: 1.19 [141/390] test_funcattrs
0:00:58 load avg: 1.19 [142/390] test_functools
0:00:58 load avg: 1.19 [143/390] test_future
0:00:59 load avg: 1.19 [144/390] test_future3
0:00:59 load avg: 1.19 [145/390] test_future4
0:00:59 load avg: 1.19 [146/390] test_future5
0:00:59 load avg: 1.19 [147/390] test_future_builtins
0:00:59 load avg: 1.19 [148/390] test_gc
0:01:01 load avg: 1.17 [149/390] test_gdbm
0:01:01 load avg: 1.17 [150/390] test_generators
0:01:01 load avg: 1.17 [151/390] test_genericpath
0:01:01 load avg: 1.17 [152/390] test_genexps
0:01:01 load avg: 1.17 [153/390] test_getargs
0:01:01 load avg: 1.17 [154/390] test_getargs2
0:01:01 load avg: 1.17 [155/390] test_getopt
0:01:01 load avg: 1.17 [156/390] test_gettext
0:01:02 load avg: 1.17 [157/390] test_gl
test_gl skipped -- No module named gl
0:01:02 load avg: 1.17 [158/390] test_glob -- test_gl skipped
0:01:02 load avg: 1.17 [159/390] test_global
0:01:02 load avg: 1.17 [160/390] test_grp
0:01:02 load avg: 1.17 [161/390] test_gzip
0:01:02 load avg: 1.17 [162/390] test_hash
0:01:02 load avg: 1.17 [163/390] test_hashlib
0:01:03 load avg: 1.17 [164/390] test_heapq
0:01:03 load avg: 1.17 [165/390] test_hmac
0:01:03 load avg: 1.17 [166/390] test_hotshot
0:01:03 load avg: 1.17 [167/390] test_htmllib
0:01:03 load avg: 1.17 [168/390] test_htmlparser
0:01:03 load avg: 1.17 [169/390] test_httplib
0:01:04 load avg: 1.17 [170/390] test_httpservers
0:01:06 load avg: 1.08 [171/390] test_idle
0:01:06 load avg: 1.08 [172/390] test_imaplib
0:01:06 load avg: 1.08 [173/390] test_imgfile
test_imgfile skipped -- No module named imgfile
0:01:06 load avg: 1.08 [174/390] test_imghdr -- test_imgfile skipped
0:01:06 load avg: 1.08 [175/390] test_imp
0:01:06 load avg: 1.08 [176/390] test_import
0:01:07 load avg: 1.08 [177/390] test_import_magic
0:01:07 load avg: 1.08 [178/390] test_importhooks
0:01:07 load avg: 1.08 [179/390] test_importlib
0:01:07 load avg: 1.08 [180/390] test_index
0:01:07 load avg: 1.08 [181/390] test_inspect
0:01:07 load avg: 1.08 [182/390] test_int
0:01:08 load avg: 1.08 [183/390] test_int_literal
0:01:08 load avg: 1.08 [184/390] test_io
0:01:39 load avg: 0.90 [185/390] test_ioctl -- test_io passed in 30 sec 987 ms
test_ioctl skipped -- Unable to open /dev/tty
0:01:39 load avg: 0.90 [186/390] test_isinstance -- test_ioctl skipped
0:01:39 load avg: 0.90 [187/390] test_iter
0:01:39 load avg: 0.90 [188/390] test_iterlen
0:01:39 load avg: 0.90 [189/390] test_itertools
0:01:42 load avg: 0.91 [190/390] test_json
0:01:43 load avg: 0.91 [191/390] test_kqueue
test_kqueue skipped -- test works only on BSD
0:01:44 load avg: 0.91 [192/390] test_largefile -- test_kqueue skipped
0:01:44 load avg: 0.91 [193/390] test_lib2to3
0:01:57 load avg: 0.85 [194/390] test_linecache
0:01:57 load avg: 0.85 [195/390] test_linuxaudiodev
test_linuxaudiodev skipped -- Use of the `audio' resource not enabled
0:01:57 load avg: 0.85 [196/390] test_list -- test_linuxaudiodev skipped (resource denied)
0:01:57 load avg: 0.85 [197/390] test_logging
0:02:08 load avg: 0.72 [198/390] test_long
0:02:09 load avg: 0.72 [199/390] test_long_future
0:02:10 load avg: 0.74 [200/390] test_longexp
0:02:10 load avg: 0.74 [201/390] test_macos
test_macos skipped -- No module named MacOS
0:02:10 load avg: 0.74 [202/390] test_macostools -- test_macos skipped
test_macostools skipped -- No module named MacOS
0:02:10 load avg: 0.74 [203/390] test_macpath -- test_macostools skipped
0:02:10 load avg: 0.74 [204/390] test_macurl2path
0:02:10 load avg: 0.74 [205/390] test_mailbox
0:02:14 load avg: 0.74 [206/390] test_marshal
0:02:15 load avg: 0.76 [207/390] test_math
0:02:16 load avg: 0.76 [208/390] test_md5
0:02:16 load avg: 0.76 [209/390] test_memoryio
0:02:16 load avg: 0.76 [210/390] test_memoryview
0:02:16 load avg: 0.76 [211/390] test_mhlib
0:02:16 load avg: 0.76 [212/390] test_mimetools
0:02:16 load avg: 0.76 [213/390] test_mimetypes
0:02:16 load avg: 0.76 [214/390] test_minidom
0:02:16 load avg: 0.76 [215/390] test_mmap
0:02:17 load avg: 0.76 [216/390] test_module
0:02:17 load avg: 0.76 [217/390] test_modulefinder
0:02:17 load avg: 0.76 [218/390] test_msilib
test_msilib skipped -- No module named _msi
0:02:17 load avg: 0.76 [219/390] test_multibytecodec -- test_msilib skipped
0:02:18 load avg: 0.76 [220/390] test_multifile
0:02:18 load avg: 0.76 [221/390] test_multiprocessing
0:02:43 load avg: 0.65 [222/390] test_mutants
0:02:43 load avg: 0.65 [223/390] test_mutex
0:02:43 load avg: 0.65 [224/390] test_netrc
0:02:43 load avg: 0.65 [225/390] test_new
0:02:43 load avg: 0.65 [226/390] test_nntplib
0:02:43 load avg: 0.65 [227/390] test_normalization
0:02:44 load avg: 0.65 [228/390] test_ntpath
0:02:44 load avg: 0.65 [229/390] test_old_mailbox
0:02:44 load avg: 0.65 [230/390] test_operator
0:02:44 load avg: 0.65 [231/390] test_optparse
0:02:44 load avg: 0.65 [232/390] test_ordered_dict
0:02:44 load avg: 0.68 [233/390] test_os
0:02:45 load avg: 0.68 [234/390] test_ossaudiodev
test_ossaudiodev skipped -- Use of the `audio' resource not enabled
0:02:45 load avg: 0.68 [235/390] test_parser -- test_ossaudiodev skipped (resource denied)
0:02:45 load avg: 0.68 [236/390] test_pdb
0:02:45 load avg: 0.68 [237/390] test_peepholer
0:02:45 load avg: 0.68 [238/390] test_pep247
0:02:46 load avg: 0.68 [239/390] test_pep277
0:02:46 load avg: 0.68 [240/390] test_pep352
0:02:46 load avg: 0.68 [241/390] test_pickle
0:02:47 load avg: 0.68 [242/390] test_pickletools
0:02:47 load avg: 0.68 [243/390] test_pipes
0:02:47 load avg: 0.68 [244/390] test_pkg
0:02:48 load avg: 0.68 [245/390] test_pkgimport
0:02:48 load avg: 0.68 [246/390] test_pkgutil
0:02:48 load avg: 0.68 [247/390] test_platform
0:02:48 load avg: 0.68 [248/390] test_plistlib
0:02:48 load avg: 0.68 [249/390] test_poll
0:02:59 load avg: 0.57 [250/390] test_popen
0:02:59 load avg: 0.57 [251/390] test_popen2
0:03:00 load avg: 0.53 [252/390] test_poplib
0:03:02 load avg: 0.53 [253/390] test_posixpath
0:03:02 load avg: 0.53 [254/390] test_pow
0:03:02 load avg: 0.53 [255/390] test_pprint
0:03:02 load avg: 0.53 [256/390] test_print
0:03:03 load avg: 0.53 [257/390] test_profile
0:03:03 load avg: 0.53 [258/390] test_property
0:03:03 load avg: 0.53 [259/390] test_pstats
0:03:03 load avg: 0.53 [260/390] test_pwd
0:03:03 load avg: 0.53 [261/390] test_py3kwarn
test_py3kwarn skipped -- test.test_py3kwarn must be run with the -3 flag
0:03:03 load avg: 0.53 [262/390] test_py_compile -- test_py3kwarn skipped
0:03:03 load avg: 0.53 [263/390] test_pyclbr
0:03:04 load avg: 0.53 [264/390] test_pyexpat
0:03:04 load avg: 0.53 [265/390] test_queue
0:03:08 load avg: 0.48 [266/390] test_quopri
0:03:08 load avg: 0.48 [267/390] test_random
0:03:08 load avg: 0.48 [268/390] test_re
0:03:09 load avg: 0.48 [269/390] test_readline
0:03:09 load avg: 0.48 [270/390] test_regrtest
0:03:12 load avg: 0.53 [271/390] test_repr
0:03:12 load avg: 0.53 [272/390] test_rfc822
0:03:12 load avg: 0.53 [273/390] test_richcmp
0:03:12 load avg: 0.53 [274/390] test_rlcompleter
0:03:12 load avg: 0.53 [275/390] test_robotparser
0:03:12 load avg: 0.53 [276/390] test_runpy
0:03:16 load avg: 0.56 [277/390] test_sax
0:03:16 load avg: 0.56 [278/390] test_scope
0:03:16 load avg: 0.56 [279/390] test_scriptpackages
test_scriptpackages skipped -- No module named aetools
0:03:16 load avg: 0.56 [280/390] test_select -- test_scriptpackages skipped
0:03:27 load avg: 0.48 [281/390] test_set
0:03:28 load avg: 0.48 [282/390] test_setcomps
0:03:28 load avg: 0.48 [283/390] test_sets
0:03:28 load avg: 0.48 [284/390] test_sgmllib
0:03:28 load avg: 0.48 [285/390] test_sha
0:03:28 load avg: 0.48 [286/390] test_shelve
0:03:29 load avg: 0.52 [287/390] test_shlex
0:03:30 load avg: 0.52 [288/390] test_shutil
0:03:30 load avg: 0.52 [289/390] test_signal
0:03:38 load avg: 0.48 [290/390] test_site
0:03:39 load avg: 0.48 [291/390] test_slice
0:03:39 load avg: 0.48 [292/390] test_smtplib
0:03:39 load avg: 0.48 [293/390] test_smtpnet
test_smtpnet skipped -- Use of the `network' resource not enabled
0:03:39 load avg: 0.48 [294/390] test_socketserver -- test_smtpnet skipped (resource denied)
test_socketserver skipped -- Use of the `network' resource not enabled
0:03:39 load avg: 0.48 [295/390] test_softspace -- test_socketserver skipped (resource denied)
0:03:39 load avg: 0.48 [296/390] test_sort
0:03:39 load avg: 0.48 [297/390] test_source_encoding
0:03:40 load avg: 0.52 [298/390] test_spwd
0:03:40 load avg: 0.52 [299/390] test_sqlite
0:03:41 load avg: 0.52 [300/390] test_ssl
Exception in thread Thread-586:
Traceback (most recent call last):
  File "/tmp/B.ny5_gl9e/BUILD/Python-2.7.18/Lib/threading.py", line 801, in __bootstrap_inner
    self.run()
  File "/tmp/B.ny5_gl9e/BUILD/Python-2.7.18/Lib/test/test_ssl.py", line 1801, in run
    msg = self.read()
  File "/tmp/B.ny5_gl9e/BUILD/Python-2.7.18/Lib/test/test_ssl.py", line 1778, in read
    return self.sslconn.read()
  File "/tmp/B.ny5_gl9e/BUILD/Python-2.7.18/Lib/ssl.py", line 641, in read
    v = self._sslobj.read(len)
error: [Errno 104] Connection reset by peer

Exception in thread Thread-590:
Traceback (most recent call last):
  File "/tmp/B.ny5_gl9e/BUILD/Python-2.7.18/Lib/threading.py", line 801, in __bootstrap_inner
    self.run()
  File "/tmp/B.ny5_gl9e/BUILD/Python-2.7.18/Lib/test/test_ssl.py", line 1801, in run
    msg = self.read()
  File "/tmp/B.ny5_gl9e/BUILD/Python-2.7.18/Lib/test/test_ssl.py", line 1778, in read
    return self.sslconn.read()
  File "/tmp/B.ny5_gl9e/BUILD/Python-2.7.18/Lib/ssl.py", line 641, in read
    v = self._sslobj.read(len)
error: [Errno 104] Connection reset by peer

test test_ssl failed -- Traceback (most recent call last):
  File "/tmp/B.ny5_gl9e/BUILD/Python-2.7.18/Lib/test/test_ssl.py", line 1382, in test_subclass
    c.do_handshake()
  File "/tmp/B.ny5_gl9e/BUILD/Python-2.7.18/Lib/ssl.py", line 828, in do_handshake
    self._sslobj.do_handshake()
SSLError: [SSL] internal error (_ssl.c:733)

0:03:43 load avg: 0.52 [301/390/1] test_startfile -- test_ssl failed
test_startfile skipped -- module 'os' has no attribute 'startfile'
0:03:43 load avg: 0.52 [302/390/1] test_stat -- test_startfile skipped
0:03:43 load avg: 0.52 [303/390/1] test_str
0:03:44 load avg: 0.52 [304/390/1] test_strftime
0:03:44 load avg: 0.52 [305/390/1] test_string
0:03:45 load avg: 0.56 [306/390/1] test_stringprep
0:03:45 load avg: 0.56 [307/390/1] test_strop
0:03:45 load avg: 0.56 [308/390/1] test_strptime
0:03:45 load avg: 0.56 [309/390/1] test_strtod
0:03:46 load avg: 0.56 [310/390/1] test_struct
0:03:46 load avg: 0.56 [311/390/1] test_structmembers
0:03:46 load avg: 0.56 [312/390/1] test_structseq
0:03:46 load avg: 0.56 [313/390/1] test_subprocess
0:04:30 load avg: 0.68 [314/390/1] test_sunau -- test_subprocess passed in 43 sec 267 ms
0:04:30 load avg: 0.68 [315/390/1] test_sunaudiodev
test_sunaudiodev skipped -- No module named sunaudiodev
0:04:30 load avg: 0.68 [316/390/1] test_sundry -- test_sunaudiodev skipped
0:04:30 load avg: 0.68 [317/390/1] test_symtable
0:04:30 load avg: 0.68 [318/390/1] test_syntax
0:04:30 load avg: 0.68 [319/390/1] test_sys
0:04:31 load avg: 0.68 [320/390/1] test_sys_setprofile
0:04:31 load avg: 0.68 [321/390/1] test_sys_settrace
0:04:31 load avg: 0.68 [322/390/1] test_sysconfig
0:04:31 load avg: 0.68 [323/390/1] test_tarfile
0:04:33 load avg: 0.68 [324/390/1] test_tcl
0:04:33 load avg: 0.68 [325/390/1] test_telnetlib
0:04:38 load avg: 0.62 [326/390/1] test_tempfile
0:04:38 load avg: 0.62 [327/390/1] test_test_support
0:04:39 load avg: 0.62 [328/390/1] test_textwrap
0:04:39 load avg: 0.62 [329/390/1] test_thread
0:04:39 load avg: 0.62 [330/390/1] test_threaded_import
0:04:39 load avg: 0.62 [331/390/1] test_threadedtempfile
0:04:40 load avg: 0.65 [332/390/1] test_threading
0:04:43 load avg: 0.65 [333/390/1] test_threading_local
0:04:44 load avg: 0.65 [334/390/1] test_threadsignals
0:04:44 load avg: 0.65 [335/390/1] test_time
0:04:46 load avg: 0.60 [336/390/1] test_timeit
0:04:46 load avg: 0.60 [337/390/1] test_timeout
test_timeout skipped -- Use of the `network' resource not enabled
0:04:46 load avg: 0.60 [338/390/1] test_tk -- test_timeout skipped (resource denied)
test_tk skipped -- Use of the `gui' resource not enabled
0:04:46 load avg: 0.60 [339/390/1] test_tokenize -- test_tk skipped (resource denied)
0:04:46 load avg: 0.60 [340/390/1] test_tools
0:04:48 load avg: 0.60 [341/390/1] test_trace
0:04:49 load avg: 0.60 [342/390/1] test_traceback
0:04:53 load avg: 0.55 [343/390/1] test_transformer
0:04:53 load avg: 0.55 [344/390/1] test_ttk_guionly
test_ttk_guionly skipped -- Use of the `gui' resource not enabled
0:04:53 load avg: 0.55 [345/390/1] test_ttk_textonly -- test_ttk_guionly skipped (resource denied)
0:04:53 load avg: 0.55 [346/390/1] test_tuple
0:04:58 load avg: 0.59 [347/390/1] test_turtle
0:04:58 load avg: 0.59 [348/390/1] test_typechecks
0:04:58 load avg: 0.59 [349/390/1] test_ucn
0:04:58 load avg: 0.59 [350/390/1] test_unary
0:04:58 load avg: 0.59 [351/390/1] test_undocumented_details
0:04:59 load avg: 0.59 [352/390/1] test_unicode
0:05:05 load avg: 0.65 [353/390/1] test_unicode_file
0:05:05 load avg: 0.65 [354/390/1] test_unicodedata
0:05:07 load avg: 0.65 [355/390/1] test_univnewlines
0:05:07 load avg: 0.65 [356/390/1] test_univnewlines2k
0:05:07 load avg: 0.65 [357/390/1] test_unpack
0:05:08 load avg: 0.65 [358/390/1] test_urllib
0:05:08 load avg: 0.65 [359/390/1] test_urllib2_localnet
0:05:09 load avg: 0.65 [360/390/1] test_urllib2net
test_urllib2net skipped -- Use of the `network' resource not enabled
0:05:09 load avg: 0.65 [361/390/1] test_urllibnet -- test_urllib2net skipped (resource denied)
test_urllibnet skipped -- Use of the `network' resource not enabled
0:05:09 load avg: 0.65 [362/390/1] test_urlparse -- test_urllibnet skipped (resource denied)
0:05:10 load avg: 0.68 [363/390/1] test_userdict
0:05:10 load avg: 0.68 [364/390/1] test_userlist
0:05:11 load avg: 0.68 [365/390/1] test_userstring
0:05:12 load avg: 0.68 [366/390/1] test_uu
0:05:13 load avg: 0.68 [367/390/1] test_uuid
0:05:13 load avg: 0.68 [368/390/1] test_wait3
0:05:19 load avg: 0.62 [369/390/1] test_wait4
0:05:24 load avg: 0.57 [370/390/1] test_warnings
0:05:25 load avg: 0.69 [371/390/1] test_wave
0:05:25 load avg: 0.69 [372/390/1] test_weakref
0:06:35 load avg: 0.91 [373/390/1] test_weakset -- test_weakref passed in 1 min 9 sec
0:06:35 load avg: 0.91 [374/390/1] test_whichdb
0:06:35 load avg: 0.91 [375/390/1] test_winreg
test_winreg skipped -- No module named _winreg
0:06:36 load avg: 0.91 [376/390/1] test_winsound -- test_winreg skipped
test_winsound skipped -- Use of the `audio' resource not enabled
0:06:36 load avg: 0.91 [377/390/1] test_with -- test_winsound skipped (resource denied)
0:06:36 load avg: 0.91 [378/390/1] test_wsgiref
0:06:36 load avg: 0.91 [379/390/1] test_xdrlib
0:06:36 load avg: 0.91 [380/390/1] test_xml_etree
0:06:37 load avg: 0.91 [381/390/1] test_xml_etree_c
0:06:37 load avg: 0.91 [382/390/1] test_xmllib
0:06:37 load avg: 0.91 [383/390/1] test_xmlrpc
0:06:41 load avg: 0.83 [384/390/1] test_xpickle
0:06:41 load avg: 0.83 [385/390/1] test_xrange
0:06:41 load avg: 0.83 [386/390/1] test_zipfile
0:06:43 load avg: 0.83 [387/390/1] test_zipfile64
test_zipfile64 skipped -- test requires loads of disk-space bytes and a long time to run
0:06:43 load avg: 0.83 [388/390/1] test_zipimport -- test_zipfile64 skipped (resource denied)
0:06:44 load avg: 0.83 [389/390/1] test_zipimport_support
0:06:44 load avg: 0.83 [390/390/1] test_zlib

== Tests result: FAILURE ==

352 tests OK.

1 test failed:
    test_ssl

37 tests skipped:
    test_aepack test_al test_applesingle test_bsddb185 test_bsddb3
    test_cd test_cl test_codecmaps_cn test_codecmaps_hk
    test_codecmaps_jp test_codecmaps_kr test_codecmaps_tw test_curses
    test_dl test_gl test_imgfile test_ioctl test_kqueue
    test_linuxaudiodev test_macos test_macostools test_msilib
    test_ossaudiodev test_py3kwarn test_scriptpackages test_smtpnet
    test_socketserver test_startfile test_sunaudiodev test_timeout
    test_tk test_ttk_guionly test_urllib2net test_urllibnet
    test_winreg test_winsound test_zipfile64
1 skip unexpected on linux2:
    test_ioctl

Re-running failed tests in verbose mode
Re-running test 'test_ssl' in verbose mode
test_ssl: testing with 'OpenSSL 3.3.0 9 Apr 2024' (3, 3, 0, 0, 0)
          under Linux ('PLD Linux (Th)', '3.0', '')
          HAS_SNI = True
          OP_ALL = 0x80000050
          OP_NO_TLSv1_1 = 0x10000000
test__create_stdlib_context (test.test_ssl.ContextTests) ... ok
test__https_verify_certificates (test.test_ssl.ContextTests) ... ok
test__https_verify_envvar (test.test_ssl.ContextTests) ... ok
test_cert_store_stats (test.test_ssl.ContextTests) ... ok
test_check_hostname (test.test_ssl.ContextTests) ... ok
test_ciphers (test.test_ssl.ContextTests) ... ok
test_constructor (test.test_ssl.ContextTests) ... ok
test_create_default_context (test.test_ssl.ContextTests) ... ok
test_get_ca_certs (test.test_ssl.ContextTests) ... ok
test_load_cert_chain (test.test_ssl.ContextTests) ... ok
test_load_default_certs (test.test_ssl.ContextTests) ... ok
test_load_default_certs_env (test.test_ssl.ContextTests) ... ok
test_load_default_certs_env_windows (test.test_ssl.ContextTests) ... skipped 'Windows specific'
test_load_dh_params (test.test_ssl.ContextTests) ... ok
test_load_verify_cadata (test.test_ssl.ContextTests) ... ok
test_load_verify_locations (test.test_ssl.ContextTests) ... ok
test_options (test.test_ssl.ContextTests) ... ok
test_protocol (test.test_ssl.ContextTests) ... ok
test_session_stats (test.test_ssl.ContextTests) ... ok
test_set_default_verify_paths (test.test_ssl.ContextTests) ... ok
test_set_ecdh_curve (test.test_ssl.ContextTests) ... ok
test_sni_callback (test.test_ssl.ContextTests) ... ok
test_sni_callback_refcycle (test.test_ssl.ContextTests) ... ok
test_verify_flags (test.test_ssl.ContextTests) ... ok
test_verify_mode (test.test_ssl.ContextTests) ... ok
test_sslwrap_simple (test.test_ssl.BasicTests) ... ok
test_DER_to_PEM (test.test_ssl.BasicSocketTests) ... ok
test_asn1object (test.test_ssl.BasicSocketTests) ... ok
test_cert_time_to_seconds (test.test_ssl.BasicSocketTests) ... ok
test_cert_time_to_seconds_locale (test.test_ssl.BasicSocketTests) ... skipped 'locale-specific month name needs to be different from C locale'
test_cert_time_to_seconds_timezone (test.test_ssl.BasicSocketTests) ... ok
test_constants (test.test_ssl.BasicSocketTests) ... ok
test_empty_cert (test.test_ssl.BasicSocketTests)
Wrapping with an empty cert file ... ok
test_enum_certificates (test.test_ssl.BasicSocketTests) ... skipped 'Windows specific'
test_enum_crls (test.test_ssl.BasicSocketTests) ... skipped 'Windows specific'
test_errors (test.test_ssl.BasicSocketTests) ... ok
test_get_default_verify_paths (test.test_ssl.BasicSocketTests) ... ok
test_malformed_cert (test.test_ssl.BasicSocketTests)
Wrapping with a badly formatted certificate (syntax error) ... ok
test_malformed_key (test.test_ssl.BasicSocketTests)
Wrapping with a badly formatted key (syntax error) ... ok
test_match_hostname (test.test_ssl.BasicSocketTests) ... ok
test_openssl_version (test.test_ssl.BasicSocketTests) ... ok
test_parse_all_sans (test.test_ssl.BasicSocketTests) ... ok
test_parse_cert (test.test_ssl.BasicSocketTests) ... 
{'issuer': ((('countryName', u'XY'),),
            (('localityName', u'Castle Anthrax'),),
            (('organizationName', u'Python Software Foundation'),),
            (('commonName', u'localhost'),)),
 'notAfter': 'Aug 26 14:23:15 2028 GMT',
 'notBefore': u'Aug 29 14:23:15 2018 GMT',
 'serialNumber': u'98A7CF88C74A32ED',
 'subject': ((('countryName', u'XY'),),
             (('localityName', u'Castle Anthrax'),),
             (('organizationName', u'Python Software Foundation'),),
             (('commonName', u'localhost'),)),
 'subjectAltName': (('DNS', 'localhost'),),
 'version': 3L}

{'OCSP': (u'http://ocsp.verisign.com',),
 'caIssuers': (u'http://SVRIntl-G3-aia.verisign.com/SVRIntlG3.cer',),
 'crlDistributionPoints': (u'http://SVRIntl-G3-crl.verisign.com/SVRIntlG3.crl',),
 'issuer': ((('countryName', u'US'),),
            (('organizationName', u'VeriSign, Inc.'),),
            (('organizationalUnitName', u'VeriSign Trust Network'),),
            (('organizationalUnitName',
              u'Terms of use at https://www.verisign.com/rpa (c)10'),),
            (('commonName',
              u'VeriSign Class 3 International Server CA - G3'),)),
 'notAfter': 'Sep 20 23:59:59 2012 GMT',
 'notBefore': u'Sep 21 00:00:00 2011 GMT',
 'serialNumber': u'2EE6EA7640A075CEE5005F4D7C79549A',
 'subject': ((('countryName', u'FI'),),
             (('stateOrProvinceName', u'Espoo'),),
             (('localityName', u'Espoo'),),
             (('organizationName', u'Nokia'),),
             (('organizationalUnitName', u'BI'),),
             (('commonName', u'projects.developer.nokia.com'),)),
 'subjectAltName': (('DNS', 'projects.developer.nokia.com'),
                    ('DNS', 'projects.forum.nokia.com')),
 'version': 3L}
ok
test_parse_cert_CVE_2013_4238 (test.test_ssl.BasicSocketTests) ... 
{'issuer': ((('countryName', u'US'),),
            (('stateOrProvinceName', u'Oregon'),),
            (('localityName', u'Beaverton'),),
            (('organizationName', u'Python Software Foundation'),),
            (('organizationalUnitName', u'Python Core Development'),),
            (('commonName', u'null.python.org\x00example.org'),),
            (('emailAddress', u'python-dev@python.org'),)),
 'notAfter': 'Aug  7 13:12:52 2013 GMT',
 'notBefore': u'Aug  7 13:11:52 2013 GMT',
 'serialNumber': u'00',
 'subject': ((('countryName', u'US'),),
             (('stateOrProvinceName', u'Oregon'),),
             (('localityName', u'Beaverton'),),
             (('organizationName', u'Python Software Foundation'),),
             (('organizationalUnitName', u'Python Core Development'),),
             (('commonName', u'null.python.org\x00example.org'),),
             (('emailAddress', u'python-dev@python.org'),)),
 'subjectAltName': (('DNS', 'altnull.python.org\x00example.com'),
                    ('email', 'null@python.org\x00user@example.org'),
                    ('URI', 'http://null.python.org\x00http://example.org'),
                    ('IP Address', '192.0.2.1'),
                    ('IP Address', '2001:DB8:0:0:0:0:0:1')),
 'version': 3L}
ok
test_parse_cert_CVE_2019_5010 (test.test_ssl.BasicSocketTests) ... 
{'issuer': ((('countryName', u'UK'),), (('commonName', u'cody-ca'),)),
 'notAfter': 'Jun 14 18:00:58 2028 GMT',
 'notBefore': u'Jun 18 18:00:58 2018 GMT',
 'serialNumber': u'02',
 'subject': ((('countryName', u'UK'),),
             (('commonName', u'codenomicon-vm-2.test.lal.cisco.com'),)),
 'subjectAltName': (('DNS', 'codenomicon-vm-2.test.lal.cisco.com'),),
 'version': 3L}
ok
test_purpose_enum (test.test_ssl.BasicSocketTests) ... ok
test_random (test.test_ssl.BasicSocketTests) ... 
 RAND_status is 1 (sufficient randomness)
ok
test_refcycle (test.test_ssl.BasicSocketTests) ... ok
test_server_side (test.test_ssl.BasicSocketTests) ... ok
test_timeout (test.test_ssl.BasicSocketTests) ... ok
test_tls_unique_channel_binding (test.test_ssl.BasicSocketTests) ... ok
test_unknown_channel_binding (test.test_ssl.BasicSocketTests) ... ok
test_unsupported_dtls (test.test_ssl.BasicSocketTests) ... ok
test_wrapped_unconnected (test.test_ssl.BasicSocketTests) ... ok
test_lib_reason (test.test_ssl.SSLErrorTests) ... ok
test_str (test.test_ssl.SSLErrorTests) ... ok
test_subclass (test.test_ssl.SSLErrorTests) ... ERROR
test_alpn_protocols (test.test_ssl.ThreadedTests) ...  server:  new connection from ('127.0.0.1', 50114)
 server: connection cipher is now ('ECDHE-RSA-AES256-GCM-SHA384', 'TLSv1.2', 256)
 server: selected protocol is now None
 client:  sending 'FOO\n'...
 client:  read 'foo\n'
 client:  sending 'FOO\n'...
 client:  read 'foo\n'
 client:  sending 'FOO\n'...
 client:  read 'foo\n'
 client:  closing connection.
 server:  new connection from ('127.0.0.1', 33910)
 server: connection cipher is now ('ECDHE-RSA-AES256-GCM-SHA384', 'TLSv1.2', 256)
 server: selected protocol is now None
 client:  sending 'FOO\n'...
 client:  read 'foo\n'
 client:  sending 'FOO\n'...
 client:  read 'foo\n'
 client:  sending 'FOO\n'...
 client:  read 'foo\n'
 client:  closing connection.
 server:  new connection from ('127.0.0.1', 40494)
 server: connection cipher is now ('ECDHE-RSA-AES256-GCM-SHA384', 'TLSv1.2', 256)
 server: selected protocol is now None
 client:  sending 'FOO\n'...
 client:  read 'foo\n'
 client:  sending 'FOO\n'...
 client:  read 'foo\n'
 client:  sending 'FOO\n'...
 client:  read 'foo\n'
 client:  closing connection.
 server:  new connection from ('127.0.0.1', 48502)
 server: connection cipher is now ('ECDHE-RSA-AES256-GCM-SHA384', 'TLSv1.2', 256)
 server: selected protocol is now None
 client:  sending 'FOO\n'...
 client:  read 'foo\n'
 client:  sending 'FOO\n'...
 client:  read 'foo\n'
 client:  sending 'FOO\n'...
 client:  read 'foo\n'
 client:  closing connection.
ok
test_asyncore_server (test.test_ssl.ThreadedTests)
Check the example asyncore integration. ... 
 server:  new connection from 127.0.0.1:56588
 client:  sending 'FOO\n'...
 server:  read 'FOO\n' from client
 client:  read 'foo\n'
 client:  closing connection.
 client:  connection closed.
 cleanup: stopping server.
 cleanup: joining server thread.
 server:  read 'over\n' from client
 server:  closed connection <ssl.SSLSocket object at 0x7f4db9a3e1d0>
 server:  read '' from client
 cleanup: successfully joined.
ok
test_check_hostname (test.test_ssl.ThreadedTests) ... Exception in thread Thread-1413:
Traceback (most recent call last):
  File "/tmp/B.ny5_gl9e/BUILD/Python-2.7.18/Lib/threading.py", line 801, in __bootstrap_inner
    self.run()
  File "/tmp/B.ny5_gl9e/BUILD/Python-2.7.18/Lib/test/test_ssl.py", line 1801, in run
    msg = self.read()
  File "/tmp/B.ny5_gl9e/BUILD/Python-2.7.18/Lib/test/test_ssl.py", line 1778, in read
    return self.sslconn.read()
  File "/tmp/B.ny5_gl9e/BUILD/Python-2.7.18/Lib/ssl.py", line 641, in read
    v = self._sslobj.read(len)
error: [Errno 104] Connection reset by peer

Exception in thread Thread-1415:
Traceback (most recent call last):
  File "/tmp/B.ny5_gl9e/BUILD/Python-2.7.18/Lib/threading.py", line 801, in __bootstrap_inner
    self.run()
  File "/tmp/B.ny5_gl9e/BUILD/Python-2.7.18/Lib/test/test_ssl.py", line 1801, in run
    msg = self.read()
  File "/tmp/B.ny5_gl9e/BUILD/Python-2.7.18/Lib/test/test_ssl.py", line 1778, in read
    return self.sslconn.read()
  File "/tmp/B.ny5_gl9e/BUILD/Python-2.7.18/Lib/ssl.py", line 641, in read
    v = self._sslobj.read(len)
error: [Errno 104] Connection reset by peer


 server:  new connection from ('127.0.0.1', 51538)
 server: connection cipher is now ('TLS_AES_256_GCM_SHA384', 'TLSv1.3', 256)
 server: selected protocol is now None
 server:  new connection from ('127.0.0.1', 38916)
 server: connection cipher is now ('TLS_AES_256_GCM_SHA384', 'TLSv1.3', 256)
 server: selected protocol is now None
ok
test_compression (test.test_ssl.ThreadedTests) ...  server:  new connection from ('127.0.0.1', 56010)
 client:  sending 'FOO\n'...
 server: connection cipher is now ('TLS_AES_256_GCM_SHA384', 'TLSv1.3', 256)
 server: selected protocol is now None
 client:  read 'foo\n'
 client:  sending 'FOO\n'...
 client:  read 'foo\n'
 client:  sending 'FOO\n'...
 client:  read 'foo\n'
 client:  closing connection.
 got compression: None
ok
test_compression_disabled (test.test_ssl.ThreadedTests) ...  server:  new connection from ('127.0.0.1', 60108)
 client:  sending 'FOO\n'...
 server: connection cipher is now ('TLS_AES_256_GCM_SHA384', 'TLSv1.3', 256)
 server: selected protocol is now None
 client:  read 'foo\n'
 client:  sending 'FOO\n'...
 client:  read 'foo\n'
 client:  sending 'FOO\n'...
 client:  read 'foo\n'
 client:  closing connection.
ok
test_crl_check (test.test_ssl.ThreadedTests) ... Exception in thread Thread-1422:
Traceback (most recent call last):
  File "/tmp/B.ny5_gl9e/BUILD/Python-2.7.18/Lib/threading.py", line 801, in __bootstrap_inner
    self.run()
  File "/tmp/B.ny5_gl9e/BUILD/Python-2.7.18/Lib/test/test_ssl.py", line 1801, in run
    msg = self.read()
  File "/tmp/B.ny5_gl9e/BUILD/Python-2.7.18/Lib/test/test_ssl.py", line 1778, in read
    return self.sslconn.read()
  File "/tmp/B.ny5_gl9e/BUILD/Python-2.7.18/Lib/ssl.py", line 641, in read
    v = self._sslobj.read(len)
error: [Errno 104] Connection reset by peer

Exception in thread Thread-1426:
Traceback (most recent call last):
  File "/tmp/B.ny5_gl9e/BUILD/Python-2.7.18/Lib/threading.py", line 801, in __bootstrap_inner
    self.run()
  File "/tmp/B.ny5_gl9e/BUILD/Python-2.7.18/Lib/test/test_ssl.py", line 1801, in run
    msg = self.read()
  File "/tmp/B.ny5_gl9e/BUILD/Python-2.7.18/Lib/test/test_ssl.py", line 1778, in read
    return self.sslconn.read()
  File "/tmp/B.ny5_gl9e/BUILD/Python-2.7.18/Lib/ssl.py", line 641, in read
    v = self._sslobj.read(len)
error: [Errno 104] Connection reset by peer


 server:  new connection from ('127.0.0.1', 55154)
 server: connection cipher is now ('TLS_AES_256_GCM_SHA384', 'TLSv1.3', 256)
 server: selected protocol is now None
 server:  new connection from ('127.0.0.1', 42618)

 server:  bad connection attempt from ('127.0.0.1', 42618):
Traceback (most recent call last):
   File "/tmp/B.ny5_gl9e/BUILD/Python-2.7.18/Lib/test/test_ssl.py", line 1721, in wrap_conn
    self.sock, server_side=True)
   File "/tmp/B.ny5_gl9e/BUILD/Python-2.7.18/Lib/ssl.py", line 369, in wrap_socket
    _context=self)
   File "/tmp/B.ny5_gl9e/BUILD/Python-2.7.18/Lib/ssl.py", line 599, in __init__
    self.do_handshake()
   File "/tmp/B.ny5_gl9e/BUILD/Python-2.7.18/Lib/ssl.py", line 828, in do_handshake
    self._sslobj.do_handshake()
 SSLError: [SSL: TLSV1_ALERT_UNKNOWN_CA] tlsv1 alert unknown ca (_ssl.c:733)
 server:  new connection from ('127.0.0.1', 35582)
 server: connection cipher is now ('TLS_AES_256_GCM_SHA384', 'TLSv1.3', 256)
 server: selected protocol is now None
ok
test_default_ecdh_curve (test.test_ssl.ThreadedTests) ...  server:  new connection from ('127.0.0.1', 48022)
 server: connection cipher is now ('ECDHE-RSA-AES256-GCM-SHA384', 'TLSv1.2', 256)
 server: selected protocol is now None
ok
test_dh_params (test.test_ssl.ThreadedTests) ...  server:  new connection from ('127.0.0.1', 40818)
 server: connection cipher is now ('DHE-RSA-AES256-GCM-SHA384', 'TLSv1.2', 256)
 server: selected protocol is now None
 client:  sending 'FOO\n'...
 client:  read 'foo\n'
 client:  sending 'FOO\n'...
 client:  read 'foo\n'
 client:  sending 'FOO\n'...
 client:  read 'foo\n'
 client:  closing connection.
ok
test_do_handshake_enotconn (test.test_ssl.ThreadedTests) ... ok
test_echo (test.test_ssl.ThreadedTests)
Basic test of an SSL client connecting to a server ... 
 server:  new connection from ('127.0.0.1', 45796)
 client:  sending 'FOO\n'...
 server: connection cipher is now ('TLS_AES_256_GCM_SHA384', 'TLSv1.3', 256)
 server: selected protocol is now None
 client:  read 'foo\n'
 client:  sending 'FOO\n'...
 client:  read 'foo\n'
 client:  sending 'FOO\n'...
 client:  read 'foo\n'
 client:  closing connection.
 server:  new connection from ('127.0.0.1', 34566)
 server: connection cipher is now ('ECDHE-RSA-AES256-GCM-SHA384', 'TLSv1.2', 256)
 server: selected protocol is now None
 client:  sending 'FOO\n'...
 client:  read 'foo\n'
 client:  sending 'FOO\n'...
 client:  read 'foo\n'
 client:  sending 'FOO\n'...
 client:  read 'foo\n'
 client:  closing connection.
ok
test_getpeercert (test.test_ssl.ThreadedTests) ... Exception in thread Thread-1436:
Traceback (most recent call last):
  File "/tmp/B.ny5_gl9e/BUILD/Python-2.7.18/Lib/threading.py", line 801, in __bootstrap_inner
    self.run()
  File "/tmp/B.ny5_gl9e/BUILD/Python-2.7.18/Lib/test/test_ssl.py", line 1801, in run
    msg = self.read()
  File "/tmp/B.ny5_gl9e/BUILD/Python-2.7.18/Lib/test/test_ssl.py", line 1778, in read
    return self.sslconn.read()
  File "/tmp/B.ny5_gl9e/BUILD/Python-2.7.18/Lib/ssl.py", line 641, in read
    v = self._sslobj.read(len)
error: [Errno 104] Connection reset by peer


{'issuer': ((('countryName', u'XY'),),
            (('localityName', u'Castle Anthrax'),),
            (('organizationName', u'Python Software Foundation'),),
            (('commonName', u'localhost'),)),
 'notAfter': 'Aug 26 14:23:15 2028 GMT',
 'notBefore': u'Aug 29 14:23:15 2018 GMT',
 'serialNumber': u'98A7CF88C74A32ED',
 'subject': ((('countryName', u'XY'),),
             (('localityName', u'Castle Anthrax'),),
             (('organizationName', u'Python Software Foundation'),),
             (('commonName', u'localhost'),)),
 'subjectAltName': (('DNS', 'localhost'),),
 'version': 3L}
Connection cipher is ('TLS_AES_256_GCM_SHA384', 'TLSv1.3', 256).
ok
test_getpeercert_enotconn (test.test_ssl.ThreadedTests) ... ok
test_handshake_timeout (test.test_ssl.ThreadedTests) ... ok
test_no_shared_ciphers (test.test_ssl.ThreadedTests) ...  server:  new connection from ('127.0.0.1', 57284)

 server:  bad connection attempt from ('127.0.0.1', 57284):
Traceback (most recent call last):
   File "/tmp/B.ny5_gl9e/BUILD/Python-2.7.18/Lib/test/test_ssl.py", line 1721, in wrap_conn
    self.sock, server_side=True)
   File "/tmp/B.ny5_gl9e/BUILD/Python-2.7.18/Lib/ssl.py", line 369, in wrap_socket
    _context=self)
   File "/tmp/B.ny5_gl9e/BUILD/Python-2.7.18/Lib/ssl.py", line 599, in __init__
    self.do_handshake()
   File "/tmp/B.ny5_gl9e/BUILD/Python-2.7.18/Lib/ssl.py", line 828, in do_handshake
    self._sslobj.do_handshake()
 SSLError: [SSL: NO_SHARED_CIPHER] no shared cipher (_ssl.c:733)
ok
test_npn_protocols (test.test_ssl.ThreadedTests) ... skipped 'NPN support needed for this test'
test_protocol_sslv2 (test.test_ssl.ThreadedTests)
Connecting to an SSLv2 server with various client options ... skipped 'OpenSSL is compiled without SSLv2 support'
test_protocol_sslv23 (test.test_ssl.ThreadedTests)
Connecting to an SSLv23 server with various client options ... skipped 'OpenSSL 3 supports only protocols > TLSv1.'
test_protocol_sslv3 (test.test_ssl.ThreadedTests)
Connecting to an SSLv3 server with various client options ... skipped 'OpenSSL is compiled without SSLv3 support'
test_protocol_tlsv1_2 (test.test_ssl.ThreadedTests)
Connecting to a TLSv1.2 server with various client options. ... 
 PROTOCOL_TLSv1_2->PROTOCOL_TLSv1_2 CERT_NONE
 {PROTOCOL_TLS->PROTOCOL_TLSv1_2} CERT_NONE
 PROTOCOL_TLSv1_2->PROTOCOL_TLS CERT_NONE
 {PROTOCOL_TLSv1->PROTOCOL_TLSv1_2} CERT_NONE
 {PROTOCOL_TLSv1_2->PROTOCOL_TLSv1} CERT_NONE
 {PROTOCOL_TLSv1_1->PROTOCOL_TLSv1_2} CERT_NONE
 {PROTOCOL_TLSv1_2->PROTOCOL_TLSv1_1} CERT_NONE
ok
test_read_write_after_close_raises_valuerror (test.test_ssl.ThreadedTests) ... ok
test_recv_send (test.test_ssl.ThreadedTests)
Test recv(), send() and friends. ... 
 server:  new connection from ('127.0.0.1', 41240)
 server: connection cipher is now ('TLS_AES_256_GCM_SHA384', 'TLSv1.3', 256)
 server: selected protocol is now None
ok
test_recv_zero (test.test_ssl.ThreadedTests) ...  server:  new connection from ('127.0.0.1', 36428)
 server: connection cipher is now ('TLS_AES_256_GCM_SHA384', 'TLSv1.3', 256)
 server: selected protocol is now None
ok
test_rude_shutdown (test.test_ssl.ThreadedTests)
A brutal shutdown of an SSL server should raise an OSError ... ok
test_selected_alpn_protocol (test.test_ssl.ThreadedTests) ...  server:  new connection from ('127.0.0.1', 33404)
 client:  sending 'FOO\n'...
 server: connection cipher is now ('TLS_AES_256_GCM_SHA384', 'TLSv1.3', 256)
 server: selected protocol is now None
 client:  read 'foo\n'
 client:  sending 'FOO\n'...
 client:  read 'foo\n'
 client:  sending 'FOO\n'...
 client:  read 'foo\n'
 client:  closing connection.
ok
test_selected_alpn_protocol_if_server_uses_alpn (test.test_ssl.ThreadedTests) ...  server:  new connection from ('127.0.0.1', 59668)
 client:  sending 'FOO\n'...
 server: connection cipher is now ('TLS_AES_256_GCM_SHA384', 'TLSv1.3', 256)
 server: selected protocol is now None
 client:  read 'foo\n'
 client:  sending 'FOO\n'...
 client:  read 'foo\n'
 client:  sending 'FOO\n'...
 client:  read 'foo\n'
 client:  closing connection.
ok
test_selected_npn_protocol (test.test_ssl.ThreadedTests) ...  server:  new connection from ('127.0.0.1', 58092)
 client:  sending 'FOO\n'...
 server: connection cipher is now ('TLS_AES_256_GCM_SHA384', 'TLSv1.3', 256)
 server: selected protocol is now None
 client:  read 'foo\n'
 client:  sending 'FOO\n'...
 client:  read 'foo\n'
 client:  sending 'FOO\n'...
 client:  read 'foo\n'
 client:  closing connection.
ok
test_server_accept (test.test_ssl.ThreadedTests) ... ok
test_sni_callback (test.test_ssl.ThreadedTests) ...  server:  new connection from ('127.0.0.1', 48272)
 server: connection cipher is now ('TLS_AES_256_GCM_SHA384', 'TLSv1.3', 256)
 server: selected protocol is now None
 server:  new connection from ('127.0.0.1', 59504)
 server: connection cipher is now ('TLS_AES_256_GCM_SHA384', 'TLSv1.3', 256)
 server: selected protocol is now None
 server:  new connection from ('127.0.0.1', 55824)
 server: connection cipher is now ('TLS_AES_256_GCM_SHA384', 'TLSv1.3', 256)
 server: selected protocol is now None
ok
test_sni_callback_alert (test.test_ssl.ThreadedTests) ... ok
test_sni_callback_raising (test.test_ssl.ThreadedTests) ... ok
test_sni_callback_wrong_return_type (test.test_ssl.ThreadedTests) ... ok
test_socketserver (test.test_ssl.ThreadedTests)
Using a SocketServer to create and manage SSL connections. ... 
 server (('127.0.0.1', 38577):38577 ('TLS_AES_256_GCM_SHA384', 'TLSv1.3', 256)):
   [18/May/2024 10:27:27] "GET /keycert.pem HTTP/1.1" 200 -
 client: read 4058 bytes from remote server '<HTTPSServerThread <HTTPSServer localhost:38577>>'
stopping HTTPS server
joining HTTPS thread
ok
test_starttls (test.test_ssl.ThreadedTests)
Switching from clear text to encrypted and back again. ... 
 client:  sending 'msg 1'...
 server:  new connection from ('127.0.0.1', 34706)
 server: read 'msg 1' (unencrypted), sending back 'msg 1' (unencrypted)...
 client:  read 'msg 1' from server
 client:  sending 'MSG 2'...
 server: read 'MSG 2' (unencrypted), sending back 'msg 2' (unencrypted)...
 client:  read 'msg 2' from server
 client:  sending 'STARTTLS'...
 server: read STARTTLS from client, sending OK...
 client:  read 'ok' from server, starting TLS...
 client:  sending 'MSG 3'...
 server: connection cipher is now ('TLS_AES_256_GCM_SHA384', 'TLSv1.3', 256)
 server: selected protocol is now None
 server: read 'MSG 3' (encrypted), sending back 'msg 3' (encrypted)...
 client:  read 'msg 3' from server
 client:  sending 'msg 4'...
 server: read 'msg 4' (encrypted), sending back 'msg 4' (encrypted)...
 client:  read 'msg 4' from server
 client:  sending 'ENDTLS'...
 server: read ENDTLS from client, sending OK...
 client:  read 'ok' from server, ending TLS...
 server: connection is now unencrypted...
 client:  sending 'msg 5'...
 server: read 'msg 5' (unencrypted), sending back 'msg 5' (unencrypted)...
 client:  read 'msg 5' from server
 client:  sending 'msg 6'...
 server: read 'msg 6' (unencrypted), sending back 'msg 6' (unencrypted)...
 client:  read 'msg 6' from server
 client:  closing connection.
 server: client closed connection
ok
test_tls1_3 (test.test_ssl.ThreadedTests) ...  server:  new connection from ('127.0.0.1', 36130)
 server: connection cipher is now ('TLS_AES_256_GCM_SHA384', 'TLSv1.3', 256)
 server: selected protocol is now None
ok
test_tls_unique_channel_binding (test.test_ssl.ThreadedTests)
Test tls-unique channel binding. ... 
 server:  new connection from ('127.0.0.1', 43178)
 server: connection cipher is now ('ECDHE-RSA-AES256-GCM-SHA384', 'TLSv1.2', 256)
 server: selected protocol is now None
 got channel binding data: '\xbb\xba\xbd\xaa\xe8G\x0c\xb0\xa8\n\x18%'
 server:  new connection from ('127.0.0.1', 43194)
 server: connection cipher is now ('ECDHE-RSA-AES256-GCM-SHA384', 'TLSv1.2', 256)
 server: selected protocol is now None
 got another channel binding data: '|\xa3\xc5\x0ed\x8bx\xa6\xd23h\x99'
ok
test_version_basic (test.test_ssl.ThreadedTests) ... Exception in thread Thread-1489:
Traceback (most recent call last):
  File "/tmp/B.ny5_gl9e/BUILD/Python-2.7.18/Lib/threading.py", line 801, in __bootstrap_inner
    self.run()
  File "/tmp/B.ny5_gl9e/BUILD/Python-2.7.18/Lib/test/test_ssl.py", line 1801, in run
    msg = self.read()
  File "/tmp/B.ny5_gl9e/BUILD/Python-2.7.18/Lib/test/test_ssl.py", line 1778, in read
    return self.sslconn.read()
  File "/tmp/B.ny5_gl9e/BUILD/Python-2.7.18/Lib/ssl.py", line 641, in read
    v = self._sslobj.read(len)
error: [Errno 104] Connection reset by peer

ok
test_wrong_cert (test.test_ssl.ThreadedTests)
Connecting when the server rejects the client's certificate ... test test_ssl failed -- Traceback (most recent call last):
  File "/tmp/B.ny5_gl9e/BUILD/Python-2.7.18/Lib/test/test_ssl.py", line 1382, in test_subclass
    c.do_handshake()
  File "/tmp/B.ny5_gl9e/BUILD/Python-2.7.18/Lib/ssl.py", line 828, in do_handshake
    self._sslobj.do_handshake()
SSLError: [SSL] internal error (_ssl.c:733)


SSLError is SSLError(1, u'[SSL] internal error (_ssl.c:733)')
ok

======================================================================
ERROR: test_subclass (test.test_ssl.SSLErrorTests)
----------------------------------------------------------------------
Traceback (most recent call last):
  File "/tmp/B.ny5_gl9e/BUILD/Python-2.7.18/Lib/test/test_ssl.py", line 1382, in test_subclass
    c.do_handshake()
  File "/tmp/B.ny5_gl9e/BUILD/Python-2.7.18/Lib/ssl.py", line 828, in do_handshake
    self._sslobj.do_handshake()
SSLError: [SSL] internal error (_ssl.c:733)

----------------------------------------------------------------------
Ran 94 tests in 2.185s

FAILED (errors=1, skipped=8)
1 test failed again:
    test_ssl

== Tests result: FAILURE then FAILURE ==

352 tests OK.

1 test failed:
    test_ssl

37 tests skipped:
    test_aepack test_al test_applesingle test_bsddb185 test_bsddb3
    test_cd test_cl test_codecmaps_cn test_codecmaps_hk
    test_codecmaps_jp test_codecmaps_kr test_codecmaps_tw test_curses
    test_dl test_gl test_imgfile test_ioctl test_kqueue
    test_linuxaudiodev test_macos test_macostools test_msilib
    test_ossaudiodev test_py3kwarn test_scriptpackages test_smtpnet
    test_socketserver test_startfile test_sunaudiodev test_timeout
    test_tk test_ttk_guionly test_urllib2net test_urllibnet
    test_winreg test_winsound test_zipfile64
1 skip unexpected on linux2:
    test_ioctl

1 re-run test:
    test_ssl

Total duration: 6 min 48 sec
Tests result: FAILURE then FAILURE
make: *** [Makefile:887: test] Error 2
error: Bad exit status from /tmp/B.ny5_gl9e/BUILD/tmp/rpm-tmp.DBBEHb (%build)

RPM build warnings:
    Macro expanded in comment on line 21: %{nil})

    Macro expanded in comment on line 92: %{?with_tkinter:BuildRequires:	tix-devel >= 1:8.1.4-4}

    line 227: It's not recommended to have unversioned Obsoletes: Obsoletes:	python-intl
    line 248: It's not recommended to have unversioned Obsoletes: Obsoletes:	python-curses
    line 250: It's not recommended to have unversioned Obsoletes: Obsoletes:	python-gdbm
    line 257: It's not recommended to have unversioned Obsoletes: Obsoletes:	python-xml
    Could not canonicalize hostname: ymir

RPM build errors:
    Bad exit status from /tmp/B.ny5_gl9e/BUILD/tmp/rpm-tmp.DBBEHb (%build)
ended at: Sat May 18 10:27:28 2024, done in 0:14:57.679335
error: No files produced.
+ chmod -R u+rwX /tmp/B.ny5_gl9e/BUILD
+ rm -rf /tmp/B.ny5_gl9e/tmp /tmp/B.ny5_gl9e/BUILD
+ rm -rf /tmp/B.ny5_gl9e
Begin-PLD-Builder-Info
Build-Time: user:579.81s sys:122.29s real:902.76s (faults io:11 non-io:9893528)

End-PLD-Builder-Info
[Back to list of logs] [View rpm -qa of builder]