FailedOk

th/SRPMS[OK]
th/x32[OK]
th/i686[OK]
th/x86_64[OK]

ac/SRPMS[OK]
ac/i386[OK]
ac/i586[OK]
ac/i686[OK]
ac/alpha[OK]
ac/amd64[OK]
ac/athlon[OK]
ac/ppc[OK]
ac/sparc[OK]
ac/sparc64[OK]

Advanced Search
main()
Powered by PLD Linux
(c) 2002-2021 PLD Team
$Revision: 1.37 $
Powered by The Golden Path.
Your IP: 3.234.211.61

python3-jinja2 490ce6df-8790-42c4-86e7-4929a27ab91d

Status:Failed
Source URL:https://buildlogs.pld-linux.org/pld/th/x86_64/FAIL/python3-jinja2,490ce6df-8790-42c4-86e7-4929a27ab91d.bz2
text/plain URL:View!
rpm -qa of builder:View!
Date:2021/10/09 23:49:12
Runtime:0:00:12.989945

Toc:

  • error 1
  • rpm: error: Failed build dependencies:
  • error 2
  • rpm: error: Failed build dependencies:
  • error 3
  • rpm: error: Failed build dependencies:
  • prep
  • Executing(%prep): /bin/sh -e /tmp/B.nelu577k/BUILD/tmp/rpm-tmp.UfJuP9
  • build
  • Executing(%build): /bin/sh -e /tmp/B.nelu577k/BUILD/tmp/rpm-tmp.Z9scOA
  • error 4
  • AttributeError: module 'jinja2' has no attribute 'pass_context'
  • error 5
  • AttributeError: pass_context
  • error 6
  • AttributeError: module 'jinja2' has no attribute 'pass_eval_context'
  • error 7
  • AttributeError: pass_eval_context
  • error 8
  • AttributeError: module 'jinja2' has no attribute 'pass_environment'
  • error 9
  • AttributeError: pass_environment
  • error 10
  • Theme error:
  • error 11
  • error: Bad exit status from /tmp/B.nelu577k/BUILD/tmp/rpm-tmp.Z9scOA (%build)
  • error 12
  • RPM build errors:
  • error 13
  • error: No files produced.

Content:

request from: baggins
checking if we should skip the build
started at: Sat Oct  9 23:48:47 2021
killing old processes on a builder
sending signal 9 to pid -1
cleaning up /tmp
fetching https://srcbuilder.pld-linux.org/th//srpms/490ce6df-8790-42c4-86e7-4929a27ab91d/python3-jinja2-3.0.2-1.src.rpm
fetched 278853 bytes, 722.9 K/s
installing srpm: python3-jinja2-3.0.2-1.src.rpm
+ install -d /tmp/B.nelu577k/BUILD /tmp/B.nelu577k/RPMS
+ LC_ALL=en_US.UTF-8
+ rpm -qp --changelog python3-jinja2-3.0.2-1.src.rpm
* Sat Oct 09 2021 PLD Linux Team <feedback@pld-linux.org>
- For complete changelog see: http://git.pld-linux.org/?p=packages/python3-jinja2.git;a=log;h=master
* Tue Oct 05 2021 Elan Ruusamäe <glen@pld-linux.org> 1bab1ac
- Up to 3.0.2, requires Python 3.6 * Tue Oct 05 2021 Elan Ruusamäe <glen@pld-linux.org> 36aca28
- Build only Python3 * Tue Oct 05 2021 Elan Ruusamäe <glen@pld-linux.org> 49a8d54
- Copied from python-jinja2.spec * Tue Oct 05 2021 Elan Ruusamäe <glen@pld-linux.org> e606858
- Revert "- merged into python-jinja2.spec" * Fri Nov 12 2010 Artur Frysiak <artur@frysiak.net> b81f42a
- updated to 2.3.1 - build and package html docs * Fri May 14 2010 sparky <sparky@pld-linux.org> f7e8068
- BR: python3-modules, rpm-pythonprov * Sun Feb 28 2010 Artur Frysiak <artur@frysiak.net> 80e3596
- up to 2.1.1 * Sun Feb 28 2010 Artur Frysiak <artur@frysiak.net> 6159bc3
- Python 3.x version + rpm -Uhv --nodeps --define '_topdir /tmp/B.nelu577k' --define '_specdir %{_topdir}' --define '_sourcedir %{_specdir}' --define '_rpmdir %{_topdir}/RPMS' --define '_builddir %{_topdir}/BUILD' python3-jinja2-3.0.2-1.src.rpm Updating / installing... python3-jinja2-3.0.2-1 ######################################## + rm -f python3-jinja2-3.0.2-1.src.rpm + install -m 700 -d /tmp/B.nelu577k/BUILD/tmp + TMPDIR=/tmp/B.nelu577k/BUILD/tmp + exec nice -n 0 rpmbuild -bp --short-circuit --nodeps --define '_topdir /tmp/B.nelu577k' --define '_specdir %{_topdir}' --define '_sourcedir %{_specdir}' --define '_rpmdir %{_topdir}/RPMS' --define '_builddir %{_topdir}/BUILD' --target x86_64-pld-linux --define 'prep exit 0' /tmp/B.nelu577k/python3-jinja2.spec warning: Could not canonicalize hostname: ymir Building target platforms: x86_64-pld-linux Building for target x86_64-pld-linux checking BuildConflict-ing packages rpm: warning: Could not canonicalize hostname: ymir rpm: error: Failed build dependencies: rpm: python3-sphinx_issues >= 1.2.0 is needed by python3-jinja2-3.0.2-1.noarch rpm: python3-sphinxcontrib-log-cabinet >= 1.0.1 is needed by python3-jinja2-3.0.2-1.noarch rpm: Building target platforms: x86_64-pld-linux rpm: Building for target x86_64-pld-linux no BuildConflicts found checking BR rpm: warning: Could not canonicalize hostname: ymir rpm: error: Failed build dependencies: rpm: python3-sphinx_issues >= 1.2.0 is needed by python3-jinja2-3.0.2-1.noarch rpm: python3-sphinxcontrib-log-cabinet >= 1.0.1 is needed by python3-jinja2-3.0.2-1.noarch rpm: Building target platforms: x86_64-pld-linux rpm: Building for target x86_64-pld-linux updating poldek cache... ready is up to date th is up to date th is up to date th-ready is up to date th-ready is up to date th-test is up to date th-test is up to date checking conflicting packages in BRed packages poldek: Loading [pndir]ready... poldek: Loading [pndir]th-test... poldek: Loading [pndir]th-test... poldek: Loading [pndir]th-ready... poldek: Loading [pndir]th-ready... poldek: Loading [pndir]th... poldek: Loading [pndir]th... poldek: 32376 packages read poldek: Removed 2777 duplicate packages from available set poldek: Processing dependencies... poldek: There are 2 packages to install: poldek: A python3-sphinx_issues-1.2.0-3.noarch poldek: A python3-sphinxcontrib-log-cabinet-1.0.1-2.noarch poldek: This operation will use 44.2KB of disk space. poldek: Need to get 31.8KB of archives (31.8KB to download). poldek: poldek: Retrieving [1/2] th::python3-sphinx_issues-1.2.0-3.noarch.rpm..............................done poldek: Retrieving [2/2] th::python3-sphinxcontrib-log-cabinet-1.0.1-2.noarch.rpm..............................done poldek: python3-sphinx_issues-1.2.0-3.noarch.rpm: digests OK poldek: python3-sphinxcontrib-log-cabinet-1.0.1-2.noarch.rpm: digests OK poldek: Executing pm-command.sh --upgrade -vh --test --root / --define _check_dirname_deps 0... poldek: warning: /root/.poldek-cache/ftp_ep09.pld-linux.org.dists.th.PLD.noarch.RPMS/python3-sphinx_issues-1.2.0-3.noarch.rpm: Header V4 DSA/SHA1 Signature, key ID e4f1bc2d: NOKEY poldek: Verifying... ######################################## poldek: Preparing... ######################################## no conflicts found checking BR rpm: warning: Could not canonicalize hostname: ymir rpm: error: Failed build dependencies: rpm: python3-sphinx_issues >= 1.2.0 is needed by python3-jinja2-3.0.2-1.noarch rpm: python3-sphinxcontrib-log-cabinet >= 1.0.1 is needed by python3-jinja2-3.0.2-1.noarch rpm: Building target platforms: x86_64-pld-linux rpm: Building for target x86_64-pld-linux installing BR: python3\-sphinx_issues python3\-sphinxcontrib\-log\-cabinet + poldek --noask --caplookup -Q -v '--ignore=hhvm-*' '--ignore=php4-*' '--ignore=php52-*' '--ignore=php54-*' '--ignore=php55-*' '--ignore=php56-*' '--ignore=php70-*' '--ignore=php71-*' '--ignore=php72-*' '--ignore=php73-*' '--ignore=php74-*' '--ignore=php80-*' --upgrade python3-sphinx_issues python3-sphinxcontrib-log-cabinet Loading [pndir]ready... Loading [pndir]th-test... Loading [pndir]th-test... Loading [pndir]th-ready... Loading [pndir]th-ready... Loading [pndir]th... Loading [pndir]th... 32376 packages read Removed 2777 duplicate packages from available set Processing dependencies... There are 2 packages to install: A python3-sphinx_issues-1.2.0-3.noarch A python3-sphinxcontrib-log-cabinet-1.0.1-2.noarch This operation will use 44.2KB of disk space. python3-sphinx_issues-1.2.0-3.noarch.rpm: digests OK python3-sphinxcontrib-log-cabinet-1.0.1-2.noarch.rpm: digests OK Need to get 31.8KB of archives. python3-sphinx_issues-1.2.0-3.noarch.rpm: digests OK python3-sphinxcontrib-log-cabinet-1.0.1-2.noarch.rpm: digests OK Executing pm-command.sh --upgrade -vh --root / --define _check_dirname_deps 0... warning: /root/.poldek-cache/ftp_ep09.pld-linux.org.dists.th.PLD.noarch.RPMS/python3-sphinx_issues-1.2.0-3.noarch.rpm: Header V4 DSA/SHA1 Signature, key ID e4f1bc2d: NOKEY Verifying... ######################################## Preparing... ######################################## Updating / installing... python3-sphinxcontrib-log-cabinet-1.0.######################################## python3-sphinx_issues-1.2.0-3 ######################################## building RPM using: set -ex; : build-id: 490ce6df-8790-42c4-86e7-4929a27ab91d; TMPDIR=/tmp/B.nelu577k/BUILD/tmp exec nice -n 0 rpmbuild -bb --define '_smp_mflags -j9' --define '_make_opts -Otarget' --define '_pld_builder 1' --define '_topdir /tmp/B.nelu577k' --define '_specdir %{_topdir}' --define '_sourcedir %{_specdir}' --define '_rpmdir %{_topdir}/RPMS' --define '_builddir %{_topdir}/BUILD' --target x86_64-pld-linux /tmp/B.nelu577k/python3-jinja2.spec + : build-id: 490ce6df-8790-42c4-86e7-4929a27ab91d + TMPDIR=/tmp/B.nelu577k/BUILD/tmp + exec nice -n 0 rpmbuild -bb --define '_smp_mflags -j9' --define '_make_opts -Otarget' --define '_pld_builder 1' --define '_topdir /tmp/B.nelu577k' --define '_specdir %{_topdir}' --define '_sourcedir %{_specdir}' --define '_rpmdir %{_topdir}/RPMS' --define '_builddir %{_topdir}/BUILD' --target x86_64-pld-linux /tmp/B.nelu577k/python3-jinja2.spec warning: Could not canonicalize hostname: ymir Building target platforms: x86_64-pld-linux Building for target x86_64-pld-linux Executing(%prep): /bin/sh -e /tmp/B.nelu577k/BUILD/tmp/rpm-tmp.UfJuP9 + umask 022 + cd /tmp/B.nelu577k/BUILD + cd /tmp/B.nelu577k/BUILD + rm -rf Jinja2-3.0.2 + /bin/gzip -dc /tmp/B.nelu577k/Jinja2-3.0.2.tar.gz + /bin/tar -xof - + STATUS=0 + '[' 0 -ne 0 ']' + cd Jinja2-3.0.2 + /bin/chmod -Rf a+rX,u+w,g-w,o-w . + RPM_EC=0 + jobs -p + exit 0 Executing(%build): /bin/sh -e /tmp/B.nelu577k/BUILD/tmp/rpm-tmp.Z9scOA TMP=/home/users/builder/tmp HOME=/home/users/builder PATH=/home/users/builder/GNUstep/Tools:/bin:/usr/bin:/usr/local/bin:/home/users/builder/bin TMPDIR=/tmp/B.nelu577k/BUILD/tmp + umask 022 + cd /tmp/B.nelu577k/BUILD + cd Jinja2-3.0.2 + LDFLAGS='-Wl,--as-needed -Wl,--no-copy-dt-needed-entries -Wl,-z,relro -Wl,-z,combreloc ' + export LDFLAGS + CFLAGS=' -O2 -fwrapv -pipe -Wformat -Werror=format-security -gdwarf-4 -fno-debug-types-section -fvar-tracking-assignments -g2 -Wp,-D_FORTIFY_SOURCE=2 -fstack-protector-strong --param=ssp-buffer-size=4 -Werror=trampolines -fPIC -march=x86-64 -mtune=generic -gdwarf-4 -fno-debug-types-section -fvar-tracking-assignments -g2 ' + export CFLAGS + CXXFLAGS=' -O2 -fwrapv -pipe -Wformat -Werror=format-security -gdwarf-4 -fno-debug-types-section -fvar-tracking-assignments -g2 -Wp,-D_FORTIFY_SOURCE=2 -fstack-protector-strong --param=ssp-buffer-size=4 -Werror=trampolines -fPIC -march=x86-64 -mtune=generic -gdwarf-4 -fno-debug-types-section -fvar-tracking-assignments -g2 ' + export CXXFLAGS + CC=x86_64-pld-linux-gcc + export CC + CXX=x86_64-pld-linux-g++ + export CXX + /usr/bin/python3 setup.py build '--build-base=build-3' running build running build_py creating build-3 creating build-3/lib creating build-3/lib/jinja2 copying src/jinja2/__init__.py -> build-3/lib/jinja2 copying src/jinja2/_identifier.py -> build-3/lib/jinja2 copying src/jinja2/async_utils.py -> build-3/lib/jinja2 copying src/jinja2/bccache.py -> build-3/lib/jinja2 copying src/jinja2/compiler.py -> build-3/lib/jinja2 copying src/jinja2/constants.py -> build-3/lib/jinja2 copying src/jinja2/debug.py -> build-3/lib/jinja2 copying src/jinja2/defaults.py -> build-3/lib/jinja2 copying src/jinja2/environment.py -> build-3/lib/jinja2 copying src/jinja2/exceptions.py -> build-3/lib/jinja2 copying src/jinja2/ext.py -> build-3/lib/jinja2 copying src/jinja2/filters.py -> build-3/lib/jinja2 copying src/jinja2/idtracking.py -> build-3/lib/jinja2 copying src/jinja2/lexer.py -> build-3/lib/jinja2 copying src/jinja2/loaders.py -> build-3/lib/jinja2 copying src/jinja2/meta.py -> build-3/lib/jinja2 copying src/jinja2/nativetypes.py -> build-3/lib/jinja2 copying src/jinja2/nodes.py -> build-3/lib/jinja2 copying src/jinja2/optimizer.py -> build-3/lib/jinja2 copying src/jinja2/parser.py -> build-3/lib/jinja2 copying src/jinja2/runtime.py -> build-3/lib/jinja2 copying src/jinja2/sandbox.py -> build-3/lib/jinja2 copying src/jinja2/tests.py -> build-3/lib/jinja2 copying src/jinja2/utils.py -> build-3/lib/jinja2 copying src/jinja2/visitor.py -> build-3/lib/jinja2 running egg_info writing src/Jinja2.egg-info/PKG-INFO writing dependency_links to src/Jinja2.egg-info/dependency_links.txt writing entry points to src/Jinja2.egg-info/entry_points.txt writing requirements to src/Jinja2.egg-info/requires.txt writing top-level names to src/Jinja2.egg-info/top_level.txt reading manifest file 'src/Jinja2.egg-info/SOURCES.txt' reading manifest template 'MANIFEST.in' no previously-included directories found matching 'docs/_build' warning: no previously-included files matching '*.pyc' found anywhere in distribution writing manifest file 'src/Jinja2.egg-info/SOURCES.txt' copying src/jinja2/py.typed -> build-3/lib/jinja2 + pwd + PYTHONPATH=/tmp/B.nelu577k/BUILD/Jinja2-3.0.2/src /usr/bin/python3 -m pytest tests ============================= test session starts ============================== platform linux -- Python 3.9.7, pytest-6.2.2, py-1.10.0, pluggy-0.13.1 rootdir: /tmp/B.nelu577k/BUILD/Jinja2-3.0.2, configfile: setup.cfg, testpaths: tests plugins: cov-2.8.1, pyfakefs-4.0.2, case-1.5.3, hypothesis-4.57.1, flaky-3.6.1 collected 826 items tests/test_api.py ................................. [ 3%] tests/test_async.py .................................................... [ 10%] .... [ 10%] tests/test_async_filters.py ......................................... [ 15%] tests/test_bytecode_cache.py ... [ 16%] tests/test_compile.py .. [ 16%] tests/test_core_tags.py ................................................ [ 22%] .............. [ 23%] tests/test_debug.py ....... [ 24%] tests/test_ext.py ............................................... [ 30%] tests/test_features.py . [ 30%] tests/test_filters.py .................................................. [ 36%] ...................................................................... [ 45%] tests/test_idtracking.py ..... [ 45%] tests/test_imports.py ............... [ 47%] tests/test_inheritance.py ...................... [ 50%] tests/test_lexnparse.py ................................................ [ 55%] ........................................................................ [ 64%] .............................. [ 68%] tests/test_loader.py ..................................... [ 72%] tests/test_nativetypes.py ........................ [ 75%] tests/test_regression.py ............................................... [ 81%] ...... [ 82%] tests/test_runtime.py ....... [ 82%] tests/test_security.py ............... [ 84%] tests/test_tests.py .................................................... [ 91%] ...................................................... [ 97%] tests/test_utils.py .................... [100%] ============================= 826 passed in 4.37s ============================== + pwd + PYTHONPATH=/tmp/B.nelu577k/BUILD/Jinja2-3.0.2 /usr/bin/make -Otarget -j9 -C docs -j1 html 'SPHINXBUILD=sphinx-build-3' make: Entering directory '/tmp/B.nelu577k/BUILD/Jinja2-3.0.2/docs' Running Sphinx v3.5.1 making output directory... done loading intersphinx inventory from https://docs.python.org/3/objects.inv... WARNING: failed to reach any of the inventories with the following issues: intersphinx inventory 'https://docs.python.org/3/objects.inv' not fetchable due to <class 'requests.exceptions.ConnectionError'>: HTTPSConnectionPool(host='docs.python.org', port=443): Max retries exceeded with url: /3/objects.inv (Caused by NewConnectionError('<urllib3.connection.HTTPSConnection object at 0x7f4aa268a5e0>: Failed to establish a new connection: [Errno -3] Temporary failure in name resolution')) building [mo]: targets for 0 po files that are out of date building [html]: targets for 13 source files that are out of date updating environment: [new config] 13 added, 0 changed, 0 removed reading sources... [ 7%] api reading sources... [ 15%] changes reading sources... [ 23%] extensions reading sources... [ 30%] faq reading sources... [ 38%] index reading sources... [ 46%] integration reading sources... [ 53%] intro reading sources... [ 61%] license reading sources... [ 69%] nativetypes reading sources... [ 76%] sandbox reading sources... [ 84%] switching reading sources... [ 92%] templates reading sources... [100%] tricks WARNING: autodoc: failed to import function 'pass_context' from module 'jinja2'; the following exception was raised: Traceback (most recent call last): File "/usr/share/python3.9/site-packages/sphinx/util/inspect.py", line 393, in safe_getattr return getattr(obj, name, *defargs) AttributeError: module 'jinja2' has no attribute 'pass_context' The above exception was the direct cause of the following exception: Traceback (most recent call last): File "/usr/share/python3.9/site-packages/sphinx/ext/autodoc/importer.py", line 111, in import_object obj = attrgetter(obj, mangled_name) File "/usr/share/python3.9/site-packages/sphinx/ext/autodoc/__init__.py", line 320, in get_attr return autodoc_attrgetter(self.env.app, obj, name, *defargs) File "/usr/share/python3.9/site-packages/sphinx/ext/autodoc/__init__.py", line 2604, in autodoc_attrgetter return safe_getattr(obj, name, *defargs) File "/usr/share/python3.9/site-packages/sphinx/util/inspect.py", line 409, in safe_getattr raise AttributeError(name) from exc AttributeError: pass_context WARNING: autodoc: failed to import function 'pass_eval_context' from module 'jinja2'; the following exception was raised: Traceback (most recent call last): File "/usr/share/python3.9/site-packages/sphinx/util/inspect.py", line 393, in safe_getattr return getattr(obj, name, *defargs) AttributeError: module 'jinja2' has no attribute 'pass_eval_context' The above exception was the direct cause of the following exception: Traceback (most recent call last): File "/usr/share/python3.9/site-packages/sphinx/ext/autodoc/importer.py", line 111, in import_object obj = attrgetter(obj, mangled_name) File "/usr/share/python3.9/site-packages/sphinx/ext/autodoc/__init__.py", line 320, in get_attr return autodoc_attrgetter(self.env.app, obj, name, *defargs) File "/usr/share/python3.9/site-packages/sphinx/ext/autodoc/__init__.py", line 2604, in autodoc_attrgetter return safe_getattr(obj, name, *defargs) File "/usr/share/python3.9/site-packages/sphinx/util/inspect.py", line 409, in safe_getattr raise AttributeError(name) from exc AttributeError: pass_eval_context WARNING: autodoc: failed to import function 'pass_environment' from module 'jinja2'; the following exception was raised: Traceback (most recent call last): File "/usr/share/python3.9/site-packages/sphinx/util/inspect.py", line 393, in safe_getattr return getattr(obj, name, *defargs) AttributeError: module 'jinja2' has no attribute 'pass_environment' The above exception was the direct cause of the following exception: Traceback (most recent call last): File "/usr/share/python3.9/site-packages/sphinx/ext/autodoc/importer.py", line 111, in import_object obj = attrgetter(obj, mangled_name) File "/usr/share/python3.9/site-packages/sphinx/ext/autodoc/__init__.py", line 320, in get_attr return autodoc_attrgetter(self.env.app, obj, name, *defargs) File "/usr/share/python3.9/site-packages/sphinx/ext/autodoc/__init__.py", line 2604, in autodoc_attrgetter return safe_getattr(obj, name, *defargs) File "/usr/share/python3.9/site-packages/sphinx/util/inspect.py", line 409, in safe_getattr raise AttributeError(name) from exc AttributeError: pass_environment looking for now-outdated files... none found pickling environment... done checking consistency... done preparing documents... done writing output... [ 7%] api Theme error: An error happened in rendering the page api. Reason: TemplateNotFound('ethicalads.html') make: *** [Makefile:19: html] Error 2 make: Leaving directory '/tmp/B.nelu577k/BUILD/Jinja2-3.0.2/docs' error: Bad exit status from /tmp/B.nelu577k/BUILD/tmp/rpm-tmp.Z9scOA (%build) RPM build errors: Could not canonicalize hostname: ymir Bad exit status from /tmp/B.nelu577k/BUILD/tmp/rpm-tmp.Z9scOA (%build) ended at: Sat Oct 9 23:49:12 2021, done in 0:00:12.989945 error: No files produced. + chmod -R u+rwX /tmp/B.nelu577k/BUILD + rm -rf /tmp/B.nelu577k/tmp /tmp/B.nelu577k/BUILD + rm -rf /tmp/B.nelu577k Begin-PLD-Builder-Info Build-Time: user:17.87s sys:1.89s real:25.00s (faults io:22 non-io:447714) End-PLD-Builder-Info
[Back to list of logs] [View rpm -qa of builder]