FailedOk

th/SRPMS[OK]
th/x32[OK]
th/i686[OK]
th/x86_64[OK]

ac/SRPMS[OK]
ac/i386[OK]
ac/i586[OK]
ac/i686[OK]
ac/alpha[OK]
ac/amd64[OK]
ac/athlon[OK]
ac/ppc[OK]
ac/sparc[OK]
ac/sparc64[OK]

Advanced Search
main()
Powered by PLD Linux
(c) 2002-2021 PLD Team
$Revision: 1.37 $
Powered by The Right Thing.
Your IP: 3.238.204.31

python3-markupsafe d4c07d06-86e6-4579-9249-c1e30c2e7525

Status:Failed
Source URL:https://buildlogs.pld-linux.org/pld/th/x86_64/FAIL/python3-markupsafe,d4c07d06-86e6-4579-9249-c1e30c2e7525.bz2
text/plain URL:View!
full text:View!
rpm -qa of builder:View!
Date:2021/10/09 23:48:47
Runtime:0:00:03.436122

Toc:

  • error 1
  • rpm: error: Failed build dependencies:
  • error 2
  • rpm: error: Failed build dependencies:
  • error 3
  • rpm: error: Failed build dependencies:
  • prep
  • Executing(%prep): /bin/sh -e /tmp/B.4eair4na/BUILD/tmp/rpm-tmp.HPzgi6
  • build
  • Executing(%build): /bin/sh -e /tmp/B.4eair4na/BUILD/tmp/rpm-tmp.JgEVuH
  • error 4
  • Extension error:
  • error 5
  • error: Bad exit status from /tmp/B.4eair4na/BUILD/tmp/rpm-tmp.JgEVuH (%build)
  • error 6
  • RPM build errors:
  • error 7
  • error: No files produced.

Content:

checking if we should skip the build
started at: Sat Oct  9 23:48:24 2021
killing old processes on a builder
sending signal 9 to pid -1
cleaning up /tmp
fetching https://srcbuilder.pld-linux.org/th//srpms/d4c07d06-86e6-4579-9249-c1e30c2e7525/python3-markupsafe-2.0.1-1.src.rpm
fetched 29424 bytes, 118.7 K/s
installing srpm: python3-markupsafe-2.0.1-1.src.rpm
+ install -d /tmp/B.4eair4na/BUILD /tmp/B.4eair4na/RPMS
+ LC_ALL=en_US.UTF-8
+ rpm -qp --changelog python3-markupsafe-2.0.1-1.src.rpm
* Sat Oct 09 2021 PLD Linux Team <feedback@pld-linux.org>
- For complete changelog see: http://git.pld-linux.org/?p=packages/python3-markupsafe.git;a=log;h=master
* Tue Oct 05 2021 Elan Ruusamäe <glen@pld-linux.org> 69f29ca
- Up to 2.0.1 * Tue Oct 05 2021 Elan Ruusamäe <glen@pld-linux.org> 102e358
- Build only python3 package * Sat Feb 27 2021 Jan Rękorajski <baggins@pld-linux.org> 8ab2d47
- release 3 (by relup.sh) * Sat Feb 27 2021 Jan Rękorajski <baggins@pld-linux.org> 24aacec
- release 2 (by relup.sh) * Tue Oct 29 2019 Jakub Bogusz <qboosh@pld-linux.org> f17806b
- updated to 1.1.1 - build docs * Mon Oct 28 2019 Jan Rękorajski <baggins@pld-linux.org> c1e982e
- rebuild with python 3.8 - release 2 (by relup.sh) * Thu Nov 08 2018 Arkadiusz Miśkiewicz <arekm@maven.pl> 8160656
- up to 1.1.0 * Wed Jul 18 2018 Jakub Bogusz <qboosh@pld-linux.org> 37cbba9
- updated download URL * Sun Jul 01 2018 Arkadiusz Miśkiewicz <arekm@maven.pl> f886d7f
- release 2 (by relup.sh) * Mon Mar 13 2017 Jakub Bogusz <qboosh@pld-linux.org> 4cbda2d
- updated to 1.0, now builds in the sane way * Wed Dec 28 2016 Arkadiusz Miśkiewicz <arekm@maven.pl> 3f9ce81
- python3.6 - release 7 (by relup.sh) * Sun Nov 29 2015 Jacek Konieczny <jajcus@jajcus.net> c7cf0f6
- BR: rpmbuild(macros) >= 1.710 * Sat Nov 28 2015 Jacek Konieczny <jajcus@jajcus.net> 5be30e4
- release 6 (by relup.sh) * Sat Nov 28 2015 Jacek Konieczny <jajcus@jajcus.net> e2092c7
- automatic change: use py_build/py_install macros * Mon Sep 14 2015 Arkadiusz Miśkiewicz <arekm@maven.pl> 9386ae9
- release 5 (by relup.sh) * Sun Sep 13 2015 Arkadiusz Miśkiewicz <arekm@maven.pl> 7a7bc84
- python 3.5 rebuild - release 4 (by relup.sh) * Mon Jun 15 2015 Jacek Konieczny <j.konieczny@eggsoft.pl> b15ed0c
- use setuptools instead of distribute * Sun Mar 01 2015 Jan Rękorajski <baggins@pld-linux.org> 822388d
- release 3 (by relup.sh) * Tue Feb 24 2015 Jan Rękorajski <baggins@pld-linux.org> 9646ede
- x32 rebuild - release 2 (by relup.sh) * Thu Jan 29 2015 Jakub Bogusz <qboosh@pld-linux.org> ba9d2fe
- updated to 0.23 + rpm -Uhv --nodeps --define '_topdir /tmp/B.4eair4na' --define '_specdir %{_topdir}' --define '_sourcedir %{_specdir}' --define '_rpmdir %{_topdir}/RPMS' --define '_builddir %{_topdir}/BUILD' python3-markupsafe-2.0.1-1.src.rpm Updating / installing... python3-markupsafe-2.0.1-1 ######################################## + rm -f python3-markupsafe-2.0.1-1.src.rpm + install -m 700 -d /tmp/B.4eair4na/BUILD/tmp + TMPDIR=/tmp/B.4eair4na/BUILD/tmp + exec nice -n 0 rpmbuild -bp --short-circuit --nodeps --define '_topdir /tmp/B.4eair4na' --define '_specdir %{_topdir}' --define '_sourcedir %{_specdir}' --define '_rpmdir %{_topdir}/RPMS' --define '_builddir %{_topdir}/BUILD' --target x86_64-pld-linux --define 'prep exit 0' /tmp/B.4eair4na/python3-markupsafe.spec warning: Could not canonicalize hostname: ymir Building target platforms: x86_64-pld-linux Building for target x86_64-pld-linux checking BuildConflict-ing packages rpm: warning: Could not canonicalize hostname: ymir rpm: error: Failed build dependencies: rpm: python3-pallets-sphinx-themes >= 1.1.0 is needed by python3-markupsafe-2.0.1-1.x86_64 rpm: Building target platforms: x86_64-pld-linux rpm: Building for target x86_64-pld-linux no BuildConflicts found checking BR rpm: warning: Could not canonicalize hostname: ymir rpm: error: Failed build dependencies: rpm: python3-pallets-sphinx-themes >= 1.1.0 is needed by python3-markupsafe-2.0.1-1.x86_64 rpm: Building target platforms: x86_64-pld-linux rpm: Building for target x86_64-pld-linux updating poldek cache... ready is up to date th is up to date th is up to date th-ready is up to date th-ready is up to date Retrieving th-test::packages.ndir.diff.toc.gz..............................................done Loading [pndir]th-test... Applying packages.ndir.2021.10.08-13.55.02.gz... Applying packages.ndir.2021.10.09-01.47.02.gz... Retrieving diff::packages.ndir.2021.10.09-10.26.02.gz......................................done Retrieving diff::packages.ndir.dscr.2021.10.09-10.26.02.gz.................................done Applying packages.ndir.2021.10.09-10.26.02.gz... Applying packages.ndir.2021.10.09-17.12.06.gz... Writing /root/.poldek-cache/[...]/packages.ndir.gz... Retrieving th-test::packages.ndir.diff.toc.gz..............................................done Loading [pndir]th-test... Applying packages.ndir.2021.10.08-20.04.01.gz... Retrieving diff::packages.ndir.2021.10.09-01.47.03.gz......................................done Applying packages.ndir.2021.10.09-01.47.03.gz... Retrieving diff::packages.ndir.2021.10.09-10.26.02.gz......................................done Applying packages.ndir.2021.10.09-10.26.02.gz... Retrieving diff::packages.ndir.2021.10.09-15.36.03.gz......................................done Applying packages.ndir.2021.10.09-15.36.03.gz... Applying packages.ndir.2021.10.09-17.17.01.gz... Retrieving diff::packages.ndir.2021.10.09-20.58.02.gz......................................done Applying packages.ndir.2021.10.09-20.58.02.gz... Applying packages.ndir.2021.10.09-21.18.02.gz... Retrieving diff::packages.ndir.2021.10.09-21.26.02.gz......................................done Applying packages.ndir.2021.10.09-21.26.02.gz... Retrieving diff::packages.ndir.2021.10.09-21.41.01.gz......................................done Applying packages.ndir.2021.10.09-21.41.01.gz... Applying packages.ndir.2021.10.09-21.46.01.gz... Writing /root/.poldek-cache/[...]/packages.ndir.gz... checking conflicting packages in BRed packages poldek: Loading [pndir]ready... poldek: Loading [pndir]th-test... poldek: Loading [pndir]th-test... poldek: Loading [pndir]th-ready... poldek: Loading [pndir]th-ready... poldek: Loading [pndir]th... poldek: Loading [pndir]th... poldek: 32376 packages read poldek: Removed 2777 duplicate packages from available set poldek: Processing dependencies... poldek: There are 1 package to install: poldek: A python3-pallets-sphinx-themes-1.2.3-2.noarch poldek: This operation will use 118.5KB of disk space. poldek: Need to get 45.5KB of archives (45.5KB to download). poldek: poldek: Retrieving th::python3-pallets-sphinx-themes-1.2.3-2.noarch.rpm..............................done poldek: python3-pallets-sphinx-themes-1.2.3-2.noarch.rpm: digests OK poldek: Executing pm-command.sh --upgrade -vh --test --root / --define _check_dirname_deps 0... poldek: warning: /root/.poldek-cache/ftp_ep09.pld-linux.org.dists.th.PLD.noarch.RPMS/python3-pallets-sphinx-themes-1.2.3-2.noarch.rpm: Header V4 DSA/SHA1 Signature, key ID e4f1bc2d: NOKEY poldek: Verifying... ######################################## poldek: Preparing... ######################################## no conflicts found checking BR rpm: warning: Could not canonicalize hostname: ymir rpm: error: Failed build dependencies: rpm: python3-pallets-sphinx-themes >= 1.1.0 is needed by python3-markupsafe-2.0.1-1.x86_64 rpm: Building target platforms: x86_64-pld-linux rpm: Building for target x86_64-pld-linux installing BR: python3\-pallets\-sphinx\-themes + poldek --noask --caplookup -Q -v '--ignore=hhvm-*' '--ignore=php4-*' '--ignore=php52-*' '--ignore=php54-*' '--ignore=php55-*' '--ignore=php56-*' '--ignore=php70-*' '--ignore=php71-*' '--ignore=php72-*' '--ignore=php73-*' '--ignore=php74-*' '--ignore=php80-*' --upgrade python3-pallets-sphinx-themes Loading [pndir]ready... Loading [pndir]th-test... Loading [pndir]th-test... Loading [pndir]th-ready... Loading [pndir]th-ready... Loading [pndir]th... Loading [pndir]th... 32376 packages read Removed 2777 duplicate packages from available set Processing dependencies... There are 1 package to install: A python3-pallets-sphinx-themes-1.2.3-2.noarch This operation will use 118.5KB of disk space. python3-pallets-sphinx-themes-1.2.3-2.noarch.rpm: digests OK Need to get 45.5KB of archives. python3-pallets-sphinx-themes-1.2.3-2.noarch.rpm: digests OK Executing pm-command.sh --upgrade -vh --root / --define _check_dirname_deps 0... warning: /root/.poldek-cache/ftp_ep09.pld-linux.org.dists.th.PLD.noarch.RPMS/python3-pallets-sphinx-themes-1.2.3-2.noarch.rpm: Header V4 DSA/SHA1 Signature, key ID e4f1bc2d: NOKEY Verifying... ######################################## Preparing... ######################################## Updating / installing... python3-pallets-sphinx-themes-1.2.3-2 ######################################## building RPM using: set -ex; : build-id: d4c07d06-86e6-4579-9249-c1e30c2e7525; TMPDIR=/tmp/B.4eair4na/BUILD/tmp exec nice -n 0 rpmbuild -bb --define '_smp_mflags -j9' --define '_make_opts -Otarget' --define '_pld_builder 1' --define '_topdir /tmp/B.4eair4na' --define '_specdir %{_topdir}' --define '_sourcedir %{_specdir}' --define '_rpmdir %{_topdir}/RPMS' --define '_builddir %{_topdir}/BUILD' --target x86_64-pld-linux /tmp/B.4eair4na/python3-markupsafe.spec + : build-id: d4c07d06-86e6-4579-9249-c1e30c2e7525 + TMPDIR=/tmp/B.4eair4na/BUILD/tmp + exec nice -n 0 rpmbuild -bb --define '_smp_mflags -j9' --define '_make_opts -Otarget' --define '_pld_builder 1' --define '_topdir /tmp/B.4eair4na' --define '_specdir %{_topdir}' --define '_sourcedir %{_specdir}' --define '_rpmdir %{_topdir}/RPMS' --define '_builddir %{_topdir}/BUILD' --target x86_64-pld-linux /tmp/B.4eair4na/python3-markupsafe.spec warning: Could not canonicalize hostname: ymir Building target platforms: x86_64-pld-linux Building for target x86_64-pld-linux Executing(%prep): /bin/sh -e /tmp/B.4eair4na/BUILD/tmp/rpm-tmp.HPzgi6 + umask 022 + cd /tmp/B.4eair4na/BUILD + cd /tmp/B.4eair4na/BUILD + rm -rf MarkupSafe-2.0.1 + /bin/gzip -dc /tmp/B.4eair4na/MarkupSafe-2.0.1.tar.gz + /bin/tar -xof - + STATUS=0 + '[' 0 -ne 0 ']' + cd MarkupSafe-2.0.1 + /bin/chmod -Rf a+rX,u+w,g-w,o-w . + RPM_EC=0 + jobs -p + exit 0 Executing(%build): /bin/sh -e /tmp/B.4eair4na/BUILD/tmp/rpm-tmp.JgEVuH TMP=/home/users/builder/tmp HOME=/home/users/builder PATH=/home/users/builder/GNUstep/Tools:/bin:/usr/bin:/usr/local/bin:/home/users/builder/bin TMPDIR=/tmp/B.4eair4na/BUILD/tmp + umask 022 + cd /tmp/B.4eair4na/BUILD + cd MarkupSafe-2.0.1 + LDFLAGS='-Wl,--as-needed -Wl,--no-copy-dt-needed-entries -Wl,-z,relro -Wl,-z,combreloc ' + export LDFLAGS + CFLAGS=' -O2 -fwrapv -pipe -Wformat -Werror=format-security -gdwarf-4 -fno-debug-types-section -fvar-tracking-assignments -g2 -Wp,-D_FORTIFY_SOURCE=2 -fstack-protector-strong --param=ssp-buffer-size=4 -Werror=trampolines -fPIC -march=x86-64 -mtune=generic -gdwarf-4 -fno-debug-types-section -fvar-tracking-assignments -g2 ' + export CFLAGS + CXXFLAGS=' -O2 -fwrapv -pipe -Wformat -Werror=format-security -gdwarf-4 -fno-debug-types-section -fvar-tracking-assignments -g2 -Wp,-D_FORTIFY_SOURCE=2 -fstack-protector-strong --param=ssp-buffer-size=4 -Werror=trampolines -fPIC -march=x86-64 -mtune=generic -gdwarf-4 -fno-debug-types-section -fvar-tracking-assignments -g2 ' + export CXXFLAGS + CC=x86_64-pld-linux-gcc + export CC + CXX=x86_64-pld-linux-g++ + export CXX + /usr/bin/python3 setup.py build '--build-base=build-3' running build running build_py creating build-3 creating build-3/lib.linux-x86_64-3.9 creating build-3/lib.linux-x86_64-3.9/markupsafe copying src/markupsafe/__init__.py -> build-3/lib.linux-x86_64-3.9/markupsafe copying src/markupsafe/_native.py -> build-3/lib.linux-x86_64-3.9/markupsafe running egg_info writing src/MarkupSafe.egg-info/PKG-INFO writing dependency_links to src/MarkupSafe.egg-info/dependency_links.txt writing top-level names to src/MarkupSafe.egg-info/top_level.txt reading manifest file 'src/MarkupSafe.egg-info/SOURCES.txt' reading manifest template 'MANIFEST.in' no previously-included directories found matching 'docs/_build' warning: no previously-included files matching '*.pyc' found anywhere in distribution writing manifest file 'src/MarkupSafe.egg-info/SOURCES.txt' copying src/markupsafe/_speedups.c -> build-3/lib.linux-x86_64-3.9/markupsafe copying src/markupsafe/_speedups.pyi -> build-3/lib.linux-x86_64-3.9/markupsafe copying src/markupsafe/py.typed -> build-3/lib.linux-x86_64-3.9/markupsafe running build_ext building 'markupsafe._speedups' extension creating build-3/temp.linux-x86_64-3.9 creating build-3/temp.linux-x86_64-3.9/src creating build-3/temp.linux-x86_64-3.9/src/markupsafe x86_64-pld-linux-gcc -Wno-unused-result -Wsign-compare -DNDEBUG -O2 -fwrapv -pipe -Wformat -Werror=format-security -gdwarf-4 -fno-debug-types-section -fvar-tracking-assignments -g2 -Wp,-D_FORTIFY_SOURCE=2 -fstack-protector-strong --param=ssp-buffer-size=4 -Werror=trampolines -fPIC -march=x86-64 -mtune=generic -gdwarf-4 -fno-debug-types-section -fvar-tracking-assignments -g2 -O2 -fwrapv -pipe -Wformat -Werror=format-security -gdwarf-4 -fno-debug-types-section -fvar-tracking-assignments -g2 -Wp,-D_FORTIFY_SOURCE=2 -fstack-protector-strong --param=ssp-buffer-size=4 -Werror=trampolines -fPIC -march=x86-64 -mtune=generic -gdwarf-4 -fno-debug-types-section -fvar-tracking-assignments -g2 -O2 -fwrapv -pipe -Wformat -Werror=format-security -gdwarf-4 -fno-debug-types-section -fvar-tracking-assignments -g2 -Wp,-D_FORTIFY_SOURCE=2 -fstack-protector-strong --param=ssp-buffer-size=4 -Werror=trampolines -fPIC -march=x86-64 -mtune=generic -gdwarf-4 -fno-debug-types-section -fvar-tracking-assignments -g2 -fPIC -I/usr/include/python3.9 -c src/markupsafe/_speedups.c -o build-3/temp.linux-x86_64-3.9/src/markupsafe/_speedups.o x86_64-pld-linux-gcc -shared -Wl,--as-needed -Wl,--no-copy-dt-needed-entries -Wl,-z,relro -Wl,-z,combreloc -Wl,--as-needed -Wl,--no-copy-dt-needed-entries -Wl,-z,relro -Wl,-z,combreloc -O2 -fwrapv -pipe -Wformat -Werror=format-security -gdwarf-4 -fno-debug-types-section -fvar-tracking-assignments -g2 -Wp,-D_FORTIFY_SOURCE=2 -fstack-protector-strong --param=ssp-buffer-size=4 -Werror=trampolines -fPIC -march=x86-64 -mtune=generic -gdwarf-4 -fno-debug-types-section -fvar-tracking-assignments -g2 build-3/temp.linux-x86_64-3.9/src/markupsafe/_speedups.o -L/usr/lib64 -o build-3/lib.linux-x86_64-3.9/markupsafe/_speedups.cpython-39-x86_64-linux-gnu.so + pwd + echo build-3/lib.linux-x86_64-3.9 + PYTHONPATH=/tmp/B.4eair4na/BUILD/MarkupSafe-2.0.1/build-3/lib.linux-x86_64-3.9 /usr/bin/python3 -m pytest tests ============================= test session starts ============================== platform linux -- Python 3.9.7, pytest-6.2.2, py-1.10.0, pluggy-0.13.1 rootdir: /tmp/B.4eair4na/BUILD/MarkupSafe-2.0.1, configfile: setup.cfg, testpaths: tests plugins: cov-2.8.1, pyfakefs-4.0.2, case-1.5.3, hypothesis-4.57.1, flaky-3.6.1 collected 51 items tests/test_escape.py .......... [ 19%] tests/test_exception_custom_html.py . [ 21%] tests/test_markupsafe.py ...... [ 33%] tests/test_escape.py .......... [ 52%] tests/test_exception_custom_html.py . [ 54%] tests/test_markupsafe.py ...... [ 66%] tests/test_leak.py . [ 68%] tests/test_markupsafe.py ................ [100%] ============================== 51 passed in 0.30s ============================== + /usr/bin/make -Otarget -j9 -C docs html 'SPHINXBUILD=sphinx-build-3' make: Entering directory '/tmp/B.4eair4na/BUILD/MarkupSafe-2.0.1/docs' Running Sphinx v3.5.1 Extension error: Could not import extension sphinxcontrib.log_cabinet (exception: No module named 'sphinxcontrib.log_cabinet') make: *** [Makefile:19: html] Error 2 make: Leaving directory '/tmp/B.4eair4na/BUILD/MarkupSafe-2.0.1/docs' error: Bad exit status from /tmp/B.4eair4na/BUILD/tmp/rpm-tmp.JgEVuH (%build) RPM build errors: Could not canonicalize hostname: ymir Bad exit status from /tmp/B.4eair4na/BUILD/tmp/rpm-tmp.JgEVuH (%build) ended at: Sat Oct 9 23:48:46 2021, done in 0:00:03.436122 error: No files produced. + chmod -R u+rwX /tmp/B.4eair4na/BUILD + rm -rf /tmp/B.4eair4na/tmp /tmp/B.4eair4na/BUILD + rm -rf /tmp/B.4eair4na Begin-PLD-Builder-Info Build-Time: user:10.18s sys:2.11s real:22.60s (faults io:18 non-io:463872) End-PLD-Builder-Info
[Back to list of logs] [View rpm -qa of builder]