FailedOk

th/SRPMS[OK]
th/x32[OK]
th/i686[OK]
th/x86_64[OK]

ac/SRPMS[OK]
ac/i386[OK]
ac/i586[OK]
ac/i686[OK]
ac/alpha[OK]
ac/amd64[OK]
ac/athlon[OK]
ac/ppc[OK]
ac/sparc[OK]
ac/sparc64[OK]

Advanced Search
main()
Powered by PLD Linux
(c) 2002-2021 PLD Team
$Revision: 1.37 $
Powered by Przewodniczacego Lepper-a.
Your IP: 52.23.219.12

python3-yarl 5627f7e2-90eb-4a30-b032-271aff82b3e4

Status:Failed
Source URL:https://buildlogs.pld-linux.org/pld/th/x86_64/FAIL/python3-yarl,5627f7e2-90eb-4a30-b032-271aff82b3e4.bz2
text/plain URL:View!
full text:View!
rpm -qa of builder:View!
Date:2021/11/21 07:29:00
Runtime:0:00:07.380499

Toc:

  • error 1
  • error: Bad exit status from /tmp/B.37lpcypk/BUILD/tmp/rpm-tmp.Fe0i4N (%build)
  • error 2
  • RPM build errors:
  • error 3
  • error: No files produced.

Content:

test_url_parsing.py::TestUserInfo::test_weird_user3 PASSED               [ 92%]
test_url_parsing.py::TestQuery_String::test_simple PASSED                [ 92%]
test_url_parsing.py::TestQuery_String::test_scheme_query PASSED          [ 93%]
test_url_parsing.py::TestQuery_String::test_abs_url_query PASSED         [ 93%]
test_url_parsing.py::TestQuery_String::test_abs_url_path_query PASSED    [ 93%]
test_url_parsing.py::TestQuery_String::test_double_question_mark PASSED  [ 93%]
test_url_parsing.py::TestQuery_String::test_complex_query PASSED         [ 93%]
test_url_parsing.py::TestQuery_String::test_query_in_fragment PASSED     [ 93%]
test_url_parsing.py::TestFragment::test_simple PASSED                    [ 93%]
test_url_parsing.py::TestFragment::test_scheme_frag PASSED               [ 93%]
test_url_parsing.py::TestFragment::test_host_frag PASSED                 [ 93%]
test_url_parsing.py::TestFragment::test_scheme_path_frag PASSED          [ 93%]
test_url_parsing.py::TestFragment::test_scheme_query_frag PASSED         [ 94%]
test_url_parsing.py::TestFragment::test_host_frag_query PASSED           [ 94%]
test_url_parsing.py::TestFragment::test_complex_frag PASSED              [ 94%]
test_url_parsing.py::TestStripEmptyParts::test_all_empty PASSED          [ 94%]
test_url_parsing.py::TestStripEmptyParts::test_path_only PASSED          [ 94%]
test_url_parsing.py::TestStripEmptyParts::test_empty_user PASSED         [ 94%]
test_url_parsing.py::TestStripEmptyParts::test_empty_port PASSED         [ 94%]
test_url_parsing.py::TestStripEmptyParts::test_empty_port_and_path PASSED [ 94%]
test_url_parsing.py::TestStripEmptyParts::test_empty_path_only PASSED    [ 94%]
test_url_parsing.py::TestStripEmptyParts::test_relative_path_only PASSED [ 94%]
test_url_parsing.py::TestStripEmptyParts::test_path PASSED               [ 95%]
test_url_parsing.py::TestStripEmptyParts::test_empty_query_with_path PASSED [ 95%]
test_url_parsing.py::TestStripEmptyParts::test_empty_query PASSED        [ 95%]
test_url_parsing.py::TestStripEmptyParts::test_empty_query_with_frag PASSED [ 95%]
test_url_parsing.py::TestStripEmptyParts::test_path_empty_frag PASSED    [ 95%]
test_url_parsing.py::TestStripEmptyParts::test_empty_path PASSED         [ 95%]
test_url_query.py::test_query_spaces PASSED                              [ 95%]
test_url_query.py::test_query_empty PASSED                               [ 95%]
test_url_query.py::test_query PASSED                                     [ 95%]
test_url_query.py::test_query_repeated_args PASSED                       [ 95%]
test_url_query.py::test_query_empty_arg PASSED                           [ 96%]
test_url_query.py::test_query_dont_unqoute_twice PASSED                  [ 96%]
test_url_query.py::test_query_nonascii PASSED                            [ 96%]
test_url_query.py::test_ampersand_as_separator PASSED                    [ 96%]
test_url_query.py::test_ampersand_as_value PASSED                        [ 96%]
test_url_query.py::test_semicolon_as_separator FAILED                    [ 96%]
test_url_query.py::test_semicolon_as_value PASSED                        [ 96%]
test_url_update_netloc.py::test_with_scheme PASSED                       [ 96%]
test_url_update_netloc.py::test_with_scheme_uppercased PASSED            [ 96%]
test_url_update_netloc.py::test_with_scheme_for_relative_url PASSED      [ 96%]
test_url_update_netloc.py::test_with_scheme_invalid_type PASSED          [ 97%]
test_url_update_netloc.py::test_with_user PASSED                         [ 97%]
test_url_update_netloc.py::test_with_user_non_ascii PASSED               [ 97%]
test_url_update_netloc.py::test_with_user_percent_encoded PASSED         [ 97%]
test_url_update_netloc.py::test_with_user_for_relative_url PASSED        [ 97%]
test_url_update_netloc.py::test_with_user_invalid_type PASSED            [ 97%]
test_url_update_netloc.py::test_with_user_None PASSED                    [ 97%]
test_url_update_netloc.py::test_with_user_ipv6 PASSED                    [ 97%]
test_url_update_netloc.py::test_with_user_None_when_password_present PASSED [ 97%]
test_url_update_netloc.py::test_with_password PASSED                     [ 97%]
test_url_update_netloc.py::test_with_password_ipv6 PASSED                [ 98%]
test_url_update_netloc.py::test_with_password_non_ascii PASSED           [ 98%]
test_url_update_netloc.py::test_with_password_percent_encoded PASSED     [ 98%]
test_url_update_netloc.py::test_with_password_non_ascii_with_colon PASSED [ 98%]
test_url_update_netloc.py::test_with_password_for_relative_url PASSED    [ 98%]
test_url_update_netloc.py::test_with_password_None PASSED                [ 98%]
test_url_update_netloc.py::test_with_password_invalid_type PASSED        [ 98%]
test_url_update_netloc.py::test_with_password_and_empty_user PASSED      [ 98%]
test_url_update_netloc.py::test_from_str_with_host_ipv4 PASSED           [ 98%]
test_url_update_netloc.py::test_from_str_with_host_ipv6 PASSED           [ 98%]
test_url_update_netloc.py::test_with_host PASSED                         [ 99%]
test_url_update_netloc.py::test_with_host_empty PASSED                   [ 99%]
test_url_update_netloc.py::test_with_host_non_ascii PASSED               [ 99%]
test_url_update_netloc.py::test_with_host_percent_encoded PASSED         [ 99%]
test_url_update_netloc.py::test_with_host_for_relative_url PASSED        [ 99%]
test_url_update_netloc.py::test_with_host_invalid_type PASSED            [ 99%]
test_url_update_netloc.py::test_with_port PASSED                         [ 99%]
test_url_update_netloc.py::test_with_port_ipv6 PASSED                    [ 99%]
test_url_update_netloc.py::test_with_port_keeps_query_and_fragment PASSED [ 99%]
test_url_update_netloc.py::test_with_port_for_relative_url PASSED        [ 99%]
test_url_update_netloc.py::test_with_port_invalid_type PASSED            [100%]

=================================== FAILURES ===================================
_________________________ test_semicolon_as_separator __________________________

    def test_semicolon_as_separator():
        u = URL("http://127.0.0.1/?a=1;b=2")
>       assert len(u.query) == 2
E       assert 1 == 2
E         +1
E         -2

test_url_query.py:67: AssertionError

----------- coverage: platform linux, python 3.9.8-final-0 -----------
Name                                                                                Stmts   Miss  Cover
-------------------------------------------------------------------------------------------------------
/tmp/B.37lpcypk/BUILD/yarl-1.6.3/build-3/lib.linux-x86_64-3.9/yarl/__init__.py          3      0   100%
/tmp/B.37lpcypk/BUILD/yarl-1.6.3/build-3/lib.linux-x86_64-3.9/yarl/_quoting.py         10      2    80%
/tmp/B.37lpcypk/BUILD/yarl-1.6.3/build-3/lib.linux-x86_64-3.9/yarl/_quoting_py.py     155      0   100%
/tmp/B.37lpcypk/BUILD/yarl-1.6.3/build-3/lib.linux-x86_64-3.9/yarl/_url.py            569     22    96%
-------------------------------------------------------------------------------------------------------
TOTAL                                                                                 737     24    97%

=========================== short test summary info ============================
FAILED test_url_query.py::test_semicolon_as_separator - assert 1 == 2
================== 1 failed, 1005 passed, 2 xfailed in 3.42s ===================
error: Bad exit status from /tmp/B.37lpcypk/BUILD/tmp/rpm-tmp.Fe0i4N (%build)


RPM build errors:
    Could not canonicalize hostname: ymir
    Bad exit status from /tmp/B.37lpcypk/BUILD/tmp/rpm-tmp.Fe0i4N (%build)
ended at: Sun Nov 21 07:28:59 2021, done in 0:00:07.380499
error: No files produced.
+ chmod -R u+rwX /tmp/B.37lpcypk/BUILD
+ rm -rf /tmp/B.37lpcypk/tmp /tmp/B.37lpcypk/BUILD
+ rm -rf /tmp/B.37lpcypk
Begin-PLD-Builder-Info
Build-Time: user:8.24s sys:0.96s real:9.34s (faults io:0 non-io:202041)

End-PLD-Builder-Info
[Back to list of logs] [View rpm -qa of builder]