FailedOk

th/SRPMS[OK]
th/x32[OK]
th/i686[OK]
th/x86_64[OK]

ac/SRPMS[OK]
ac/i386[OK]
ac/i586[OK]
ac/i686[OK]
ac/alpha[OK]
ac/amd64[OK]
ac/athlon[OK]
ac/ppc[OK]
ac/sparc[OK]
ac/sparc64[OK]

Advanced Search
main()
Powered by PLD Linux
(c) 2002-2021 PLD Team
$Revision: 1.37 $
Powered by /dev/drzewo.
Your IP: 3.236.124.56

ragel a347ce5d-2b50-48ca-9841-31fb79d2f1a3

Status:Failed
Source URL:https://buildlogs.pld-linux.org/pld/th/x86_64/FAIL/ragel,a347ce5d-2b50-48ca-9841-31fb79d2f1a3.bz2
text/plain URL:View!
rpm -qa of builder:View!
Date:2021/05/21 19:43:27
Runtime:0:01:54.890022

Toc:

  • error 1
  • rpm: error: Failed build dependencies:
  • error 2
  • rpm: error: Failed build dependencies:
  • prep
  • Executing(%prep): /bin/sh -e /tmp/B.3pi6qc/BUILD/tmp/rpm-tmp.KPjPWl
  • build
  • Executing(%build): /bin/sh -e /tmp/B.3pi6qc/BUILD/tmp/rpm-tmp.Navhr1
  • error 3
  • a2x: ERROR: "dblatex" -t pdf -p "/etc/asciidoc/dblatex/asciidoc-dblatex.xsl" -s "/etc/asciidoc/dblatex/asciidoc-dblatex.sty" -V "/tmp/B.3pi6qc/BUILD/ragel-7.0.4/doc/ragel/ragel-guide.xml" returned non-zero exit status 1
  • error 4
  • Error: pdflatex compilation failed
  • error 5
  • make[2]: *** [Makefile:630: ragel-guide.pdf] Error 1
  • error 6
  • make[1]: *** [Makefile:385: all-recursive] Error 1
  • error 7
  • error: Bad exit status from /tmp/B.3pi6qc/BUILD/tmp/rpm-tmp.Navhr1 (%build)
  • error 8
  • RPM build errors:
  • error 9
  • error: No files produced.

Content:

request from: qboosh
checking if we should skip the build
started at: Fri May 21 19:41:21 2021
killing old processes on a builder
sending signal 9 to pid -1
cleaning up /tmp
fetching https://srcbuilder.pld-linux.org/th//srpms/a347ce5d-2b50-48ca-9841-31fb79d2f1a3/ragel-7.0.4-1.src.rpm
fetched 1621189 bytes, 3428.1 K/s
installing srpm: ragel-7.0.4-1.src.rpm
+ install -d /tmp/B.3pi6qc/BUILD /tmp/B.3pi6qc/RPMS
+ LC_ALL=en_US.UTF-8
+ rpm -qp --changelog ragel-7.0.4-1.src.rpm
* Fri May 21 2021 PLD Linux Team <feedback@pld-linux.org>
- For complete changelog see: http://git.pld-linux.org/?p=packages/ragel.git;a=log;h=master
* Fri May 21 2021 Jakub Bogusz <qboosh@pld-linux.org> cfb9c47
- updated to 7.0.4 - added noarch -doc and vim-syntax- packages * Tue Feb 26 2019 Jakub Bogusz <qboosh@pld-linux.org> 9af7546
- updated to 6.10 * Tue Jun 10 2014 Jakub Bogusz <qboosh@pld-linux.org> d98b156
- new URLs, updated to 6.8 * Sun Jan 22 2012 zbyniu <zbyniu@pld-linux.org> 2237989
- up to 6.7 * Tue May 19 2009 aredridel <aredridel@pld-linux.org> 55c27e4
- 6.5 * Sun Aug 31 2008 aredridel <aredridel@pld-linux.org> d0bc676
- 6.3 * Tue Dec 25 2007 zbyniu <zbyniu@pld-linux.org> 78d5507
- up to 5.25 * Tue Feb 13 2007 Elan Ruusamäe <glen@pld-linux.org> ccb1330
- tabs in preamble * Mon Feb 12 2007 Jan Rękorajski <baggins@pld-linux.org> 963cfde
- converted to UTF-8 * Sat Jan 27 2007 Jakub Bogusz <qboosh@pld-linux.org> 9acded5
- pl * Wed Jan 24 2007 aredridel <aredridel@pld-linux.org> 6e68e54
- added + rpm -Uhv --nodeps --define '_topdir /tmp/B.3pi6qc' --define '_specdir %{_topdir}' --define '_sourcedir %{_specdir}' --define '_rpmdir %{_topdir}/RPMS' --define '_builddir %{_topdir}/BUILD' ragel-7.0.4-1.src.rpm Updating / installing... ragel-7.0.4-1 ######################################## + rm -f ragel-7.0.4-1.src.rpm + install -m 700 -d /tmp/B.3pi6qc/BUILD/tmp + TMPDIR=/tmp/B.3pi6qc/BUILD/tmp + exec nice -n 0 rpmbuild -bp --short-circuit --nodeps --define '_topdir /tmp/B.3pi6qc' --define '_specdir %{_topdir}' --define '_sourcedir %{_specdir}' --define '_rpmdir %{_topdir}/RPMS' --define '_builddir %{_topdir}/BUILD' --target x86_64-pld-linux --define 'prep exit 0' /tmp/B.3pi6qc/ragel.spec warning: Could not canonicalize hostname: ymir Building target platforms: x86_64-pld-linux Building for target x86_64-pld-linux checking BuildConflict-ing packages no BuildConflicts found checking BR rpm: warning: Could not canonicalize hostname: ymir rpm: error: Failed build dependencies: rpm: colm = 0.14.7 is needed by ragel-7.0.4-1.x86_64 rpm: colm-devel = 0.14.7 is needed by ragel-7.0.4-1.x86_64 rpm: Building target platforms: x86_64-pld-linux rpm: Building for target x86_64-pld-linux updating poldek cache... ready is up to date th is up to date th is up to date th-ready is up to date th-ready is up to date th-test is up to date th-test is up to date checking conflicting packages in BRed packages poldek: Loading [pndir]ready... poldek: Loading [pndir]th-test... poldek: Loading [pndir]th-test... poldek: Loading [pndir]th-ready... poldek: Loading [pndir]th-ready... poldek: Loading [pndir]th... poldek: Loading [pndir]th... poldek: 32281 packages read poldek: Removed 2949 duplicate packages from available set poldek: Processing dependencies... poldek: There are 2 packages to install: poldek: A colm-0.14.7-1.x86_64 colm-devel-0.14.7-1.x86_64 poldek: This operation will use 3.7MB of disk space. poldek: Need to get 703.9KB of archives. poldek: colm-0.14.7-1.x86_64.rpm: digests OK poldek: colm-devel-0.14.7-1.x86_64.rpm: digests OK poldek: Executing pm-command.sh --upgrade -vh --test --root / --define _check_dirname_deps 0... poldek: Verifying... ######################################## poldek: Preparing... ######################################## no conflicts found checking BR rpm: warning: Could not canonicalize hostname: ymir rpm: error: Failed build dependencies: rpm: colm = 0.14.7 is needed by ragel-7.0.4-1.x86_64 rpm: colm-devel = 0.14.7 is needed by ragel-7.0.4-1.x86_64 rpm: Building target platforms: x86_64-pld-linux rpm: Building for target x86_64-pld-linux installing BR: colm\-devel colm + poldek --noask --caplookup -Q -v '--ignore=hhvm-*' '--ignore=php4-*' '--ignore=php52-*' '--ignore=php54-*' '--ignore=php55-*' '--ignore=php56-*' '--ignore=php70-*' '--ignore=php71-*' '--ignore=php72-*' '--ignore=php73-*' '--ignore=php74-*' '--ignore=php80-*' --upgrade colm-devel colm Loading [pndir]ready... Loading [pndir]th-test... Loading [pndir]th-test... Loading [pndir]th-ready... Loading [pndir]th-ready... Loading [pndir]th... Loading [pndir]th... 32281 packages read Removed 2949 duplicate packages from available set Processing dependencies... There are 2 packages to install: A colm-0.14.7-1.x86_64 colm-devel-0.14.7-1.x86_64 This operation will use 3.7MB of disk space. Need to get 703.9KB of archives. colm-0.14.7-1.x86_64.rpm: digests OK colm-devel-0.14.7-1.x86_64.rpm: digests OK Executing pm-command.sh --upgrade -vh --root / --define _check_dirname_deps 0... Verifying... ######################################## Preparing... ######################################## Updating / installing... colm-0.14.7-1 ######################################## colm-devel-0.14.7-1 ######################################## building RPM using: set -ex; : build-id: a347ce5d-2b50-48ca-9841-31fb79d2f1a3; TMPDIR=/tmp/B.3pi6qc/BUILD/tmp exec nice -n 0 rpmbuild -bb --define '_smp_mflags -j9' --define '_make_opts -Otarget' --define '_pld_builder 1' --define '_topdir /tmp/B.3pi6qc' --define '_specdir %{_topdir}' --define '_sourcedir %{_specdir}' --define '_rpmdir %{_topdir}/RPMS' --define '_builddir %{_topdir}/BUILD' --target x86_64-pld-linux /tmp/B.3pi6qc/ragel.spec + : build-id: a347ce5d-2b50-48ca-9841-31fb79d2f1a3 + TMPDIR=/tmp/B.3pi6qc/BUILD/tmp + exec nice -n 0 rpmbuild -bb --define '_smp_mflags -j9' --define '_make_opts -Otarget' --define '_pld_builder 1' --define '_topdir /tmp/B.3pi6qc' --define '_specdir %{_topdir}' --define '_sourcedir %{_specdir}' --define '_rpmdir %{_topdir}/RPMS' --define '_builddir %{_topdir}/BUILD' --target x86_64-pld-linux /tmp/B.3pi6qc/ragel.spec warning: Could not canonicalize hostname: ymir Building target platforms: x86_64-pld-linux Building for target x86_64-pld-linux Executing(%prep): /bin/sh -e /tmp/B.3pi6qc/BUILD/tmp/rpm-tmp.KPjPWl + umask 022 + cd /tmp/B.3pi6qc/BUILD + cd /tmp/B.3pi6qc/BUILD + rm -rf ragel-7.0.4 + /bin/gzip -dc /tmp/B.3pi6qc/ragel-7.0.4.tar.gz + /bin/tar -xof - + STATUS=0 + '[' 0 -ne 0 ']' + cd ragel-7.0.4 + /bin/chmod -Rf a+rX,u+w,g-w,o-w . + RPM_EC=0 + jobs -p + exit 0 Executing(%build): /bin/sh -e /tmp/B.3pi6qc/BUILD/tmp/rpm-tmp.Navhr1 TMP=/home/users/builder/tmp HOME=/home/users/builder PATH=/home/users/builder/GNUstep/Tools:/bin:/usr/bin:/usr/local/bin:/home/users/builder/bin TMPDIR=/tmp/B.3pi6qc/BUILD/tmp + umask 022 + cd /tmp/B.3pi6qc/BUILD + cd ragel-7.0.4 + ./configure 'LDFLAGS=-Wl,--as-needed -Wl,--no-copy-dt-needed-entries -Wl,-z,relro -Wl,-z,combreloc ' 'CFLAGS=-O2 -fwrapv -pipe -Wformat -Werror=format-security -gdwarf-4 -fno-debug-types-section -fvar-tracking-assignments -g2 -Wp,-D_FORTIFY_SOURCE=2 -fstack-protector-strong --param=ssp-buffer-size=4 -Werror=trampolines -fPIC -march=x86-64 -mtune=generic -gdwarf-4 -fno-debug-types-section -fvar-tracking-assignments -g2 ' 'CXXFLAGS=-O2 -fwrapv -pipe -Wformat -Werror=format-security -gdwarf-4 -fno-debug-types-section -fvar-tracking-assignments -g2 -Wp,-D_FORTIFY_SOURCE=2 -fstack-protector-strong --param=ssp-buffer-size=4 -Werror=trampolines -fPIC -march=x86-64 -mtune=generic -gdwarf-4 -fno-debug-types-section -fvar-tracking-assignments -g2 ' 'FFLAGS=-O2 -fwrapv -pipe -Wformat -Werror=format-security -gdwarf-4 -fno-debug-types-section -fvar-tracking-assignments -g2 -Wp,-D_FORTIFY_SOURCE=2 -fstack-protector-strong --param=ssp-buffer-size=4 -Werror=trampolines -fPIC -march=x86-64 -mtune=generic -gdwarf-4 -fno-debug-types-section -fvar-tracking-assignments -g2 ' 'FCFLAGS=-O2 -fwrapv -pipe -Wformat -Werror=format-security -gdwarf-4 -fno-debug-types-section -fvar-tracking-assignments -g2 -Wp,-D_FORTIFY_SOURCE=2 -fstack-protector-strong --param=ssp-buffer-size=4 -Werror=trampolines -fPIC -march=x86-64 -mtune=generic -gdwarf-4 -fno-debug-types-section -fvar-tracking-assignments -g2 ' 'CPPFLAGS=' 'CC=x86_64-pld-linux-gcc' 'CXX=x86_64-pld-linux-g++' '--host=x86_64-pld-linux' '--build=x86_64-pld-linux' '--prefix=/usr' '--exec-prefix=/usr' '--bindir=/usr/bin' '--sbindir=/usr/sbin' '--sysconfdir=/etc' '--datadir=/usr/share' '--includedir=/usr/include' '--libdir=/usr/lib64' '--libexecdir=/usr/libexec' '--localstatedir=/var' '--sharedstatedir=/var/lib' '--mandir=/usr/share/man' '--infodir=/usr/share/info' '--x-libraries=/usr/lib64' 'CPPFLAGS= -I/usr/include/aapl' 'COLM=/usr/bin/colm' 'COLM_WRAP=/usr/bin/colm-wrap' 'COLM_SHARE=/usr/share/colm' 'LIBCOLM_LA=-lcolm' 'LIBFSM_LA=-lfsm' '--datadir=/usr/share/ragel' --disable-static checking for a BSD-compatible install... /usr/bin/install -c checking whether build environment is sane... yes checking for a thread-safe mkdir -p... /bin/mkdir -p checking for gawk... gawk checking whether make sets $(MAKE)... yes checking whether make supports nested variables... yes checking whether make supports the include directive... yes (GNU style) checking for x86_64-pld-linux-gcc... x86_64-pld-linux-gcc checking whether the C compiler works... yes checking for C compiler default output file name... a.out checking for suffix of executables... checking whether we are cross compiling... no checking for suffix of object files... o checking whether we are using the GNU C compiler... yes checking whether x86_64-pld-linux-gcc accepts -g... yes checking for x86_64-pld-linux-gcc option to accept ISO C89... none needed checking whether x86_64-pld-linux-gcc understands -c and -o together... yes checking dependency style of x86_64-pld-linux-gcc... gcc3 checking how to run the C preprocessor... x86_64-pld-linux-gcc -E checking for grep that handles long lines and -e... /bin/grep checking for egrep... /bin/grep -E checking for ANSI C header files... yes checking for sys/types.h... yes checking for sys/stat.h... yes checking for stdlib.h... yes checking for string.h... yes checking for memory.h... yes checking for strings.h... yes checking for inttypes.h... yes checking for stdint.h... yes checking for unistd.h... yes checking size of int... 4 checking size of long... 8 checking size of void *... 8 checking size of long... (cached) 8 checking size of unsigned long... 8 checking size of unsigned long long... 8 checking sys/mman.h usability... yes checking sys/mman.h presence... yes checking for sys/mman.h... yes checking sys/wait.h usability... yes checking sys/wait.h presence... yes checking for sys/wait.h... yes checking for unistd.h... (cached) yes checking for /usr/bin/colm... yes checking for x86_64-pld-linux-gcc... (cached) x86_64-pld-linux-gcc checking whether we are using the GNU C compiler... (cached) yes checking whether x86_64-pld-linux-gcc accepts -g... (cached) yes checking for x86_64-pld-linux-gcc option to accept ISO C89... (cached) none needed checking whether x86_64-pld-linux-gcc understands -c and -o together... (cached) yes checking dependency style of x86_64-pld-linux-gcc... (cached) gcc3 checking whether we are using the GNU C++ compiler... yes checking whether x86_64-pld-linux-g++ accepts -g... yes checking dependency style of x86_64-pld-linux-g++... gcc3 checking for x86_64-pld-linux-ar... no checking for ar... ar checking for x86_64-pld-linux-ranlib... no checking for ranlib... ranlib checking build system type... x86_64-pld-linux-gnu checking host system type... x86_64-pld-linux-gnu checking how to print strings... print -r checking for a sed that does not truncate output... /bin/sed checking for fgrep... /bin/grep -F checking for ld used by x86_64-pld-linux-gcc... /usr/bin/ld checking if the linker (/usr/bin/ld) is GNU ld... yes checking for BSD- or MS-compatible name lister (nm)... /usr/bin/nm -B checking the name lister (/usr/bin/nm -B) interface... BSD nm checking whether ln -s works... yes checking the maximum length of command line arguments... 1572864 checking how to convert x86_64-pld-linux-gnu file names to x86_64-pld-linux-gnu format... func_convert_file_noop checking how to convert x86_64-pld-linux-gnu file names to toolchain format... func_convert_file_noop checking for /usr/bin/ld option to reload object files... -r checking for x86_64-pld-linux-objdump... no checking for objdump... objdump checking how to recognize dependent libraries... pass_all checking for x86_64-pld-linux-dlltool... no checking for dlltool... no checking how to associate runtime and link libraries... print -r -- checking for x86_64-pld-linux-ar... ar checking for archiver @FILE support... @ checking for x86_64-pld-linux-strip... no checking for strip... strip checking for x86_64-pld-linux-ranlib... ranlib checking command to parse /usr/bin/nm -B output from x86_64-pld-linux-gcc object... ok checking for sysroot... no checking for a working dd... /bin/dd checking how to truncate binary pipes... /bin/dd bs=4096 count=1 checking for x86_64-pld-linux-mt... no checking for mt... no checking if : is a manifest tool... no checking for dlfcn.h... yes checking for objdir... .libs checking if x86_64-pld-linux-gcc supports -fno-rtti -fno-exceptions... no checking for x86_64-pld-linux-gcc option to produce PIC... -fPIC -DPIC checking if x86_64-pld-linux-gcc PIC flag -fPIC -DPIC works... yes checking if x86_64-pld-linux-gcc static flag -static works... yes checking if x86_64-pld-linux-gcc supports -c -o file.o... yes checking if x86_64-pld-linux-gcc supports -c -o file.o... (cached) yes checking whether the x86_64-pld-linux-gcc linker (/usr/bin/ld -m elf_x86_64) supports shared libraries... yes checking whether -lc should be explicitly linked in... no checking dynamic linker characteristics... GNU/Linux ld.so checking how to hardcode library paths into programs... immediate checking whether stripping libraries is possible... yes checking if libtool supports shared libraries... yes checking whether to build shared libraries... yes checking whether to build static libraries... no checking how to run the C++ preprocessor... x86_64-pld-linux-g++ -E checking for ld used by x86_64-pld-linux-g++... /usr/bin/ld -m elf_x86_64 checking if the linker (/usr/bin/ld -m elf_x86_64) is GNU ld... yes checking whether the x86_64-pld-linux-g++ linker (/usr/bin/ld -m elf_x86_64) supports shared libraries... yes checking for x86_64-pld-linux-g++ option to produce PIC... -fPIC -DPIC checking if x86_64-pld-linux-g++ PIC flag -fPIC -DPIC works... yes checking if x86_64-pld-linux-g++ static flag -static works... yes checking if x86_64-pld-linux-g++ supports -c -o file.o... yes checking if x86_64-pld-linux-g++ supports -c -o file.o... (cached) yes checking whether the x86_64-pld-linux-g++ linker (/usr/bin/ld -m elf_x86_64) supports shared libraries... yes checking dynamic linker characteristics... (cached) GNU/Linux ld.so checking how to hardcode library paths into programs... immediate checking whether make sets $(MAKE)... (cached) yes checking for asciidoc... asciidoc checking for pygmentize... pygmentize checking for ./DIST... no checking for fig2dev... fig2dev checking for pdflatex... pdflatex checking for gdc-8... no checking for gdc-7... no checking for gdc-6... no checking for gdc-5... no checking for javac... /usr/bin/javac checking if javac is able to compile programs ... yes checking for ruby... /usr/bin/ruby checking for mcs... /usr/bin/mcs checking for go... /usr/bin/go checking for ocaml... /usr/bin/ocaml checking for rustc... /usr/bin/rustc checking for julia... no checking for gnustep-config... /usr/bin/gnustep-config checking if ragel ASM tests will build ... yes checking for crack... no checking that generated files are newer than configure... done configure: creating ./config.status config.status: creating Makefile config.status: creating src/Makefile config.status: creating src/host-ruby/Makefile config.status: creating src/host-asm/Makefile config.status: creating src/host-julia/Makefile config.status: creating src/host-ocaml/Makefile config.status: creating src/host-c/Makefile config.status: creating src/host-d/Makefile config.status: creating src/host-csharp/Makefile config.status: creating src/host-go/Makefile config.status: creating src/host-java/Makefile config.status: creating src/host-rust/Makefile config.status: creating src/host-crack/Makefile config.status: creating src/host-js/Makefile config.status: creating test/Makefile config.status: creating test/ragel.d/Makefile config.status: creating doc/Makefile config.status: creating doc/ragel/Makefile config.status: creating src/config.h config.status: executing depfiles commands config.status: executing libtool commands configuration of colm complete + /usr/bin/make -Otarget -j9 Making all in src make[1]: Entering directory '/tmp/B.3pi6qc/BUILD/ragel-7.0.4/src' echo '#define VERSION "7.0.4"' > version.h echo '#define PUBDATE "February 2021"' >> version.h make[1]: Leaving directory '/tmp/B.3pi6qc/BUILD/ragel-7.0.4/src' make[1]: Entering directory '/tmp/B.3pi6qc/BUILD/ragel-7.0.4/src' /usr/bin/colm-wrap -c -b rlparseC -o parse.pack -p parse.c -m rlreduce.cc rlparse.lm make[1]: Leaving directory '/tmp/B.3pi6qc/BUILD/ragel-7.0.4/src' make[1]: Entering directory '/tmp/B.3pi6qc/BUILD/ragel-7.0.4/src' /usr/bin/colm-wrap -o rlreduce.cc parse.pack make[1]: Leaving directory '/tmp/B.3pi6qc/BUILD/ragel-7.0.4/src' make[1]: Entering directory '/tmp/B.3pi6qc/BUILD/ragel-7.0.4/src' /usr/bin/colm-wrap -o parse.c parse.pack make[1]: Leaving directory '/tmp/B.3pi6qc/BUILD/ragel-7.0.4/src' /usr/bin/make all-recursive Making all in . make[3]: Entering directory '/tmp/B.3pi6qc/BUILD/ragel-7.0.4/src' /bin/sh ../libtool --tag=CXX --mode=compile x86_64-pld-linux-g++ -DHAVE_CONFIG_H -I. -I../aapl -I../colm/include -DBINDIR='"/usr/bin"' -I/usr/include/aapl -O2 -fwrapv -pipe -Wformat -Werror=format-security -gdwarf-4 -fno-debug-types-section -fvar-tracking-assignments -g2 -Wp,-D_FORTIFY_SOURCE=2 -fstack-protector-strong --param=ssp-buffer-size=4 -Werror=trampolines -fPIC -march=x86-64 -mtune=generic -gdwarf-4 -fno-debug-types-section -fvar-tracking-assignments -g2 -MT libragel_la-load.lo -MD -MP -MF .deps/libragel_la-load.Tpo -c -o libragel_la-load.lo `test -f 'load.cc' || echo './'`load.cc libtool: compile: x86_64-pld-linux-g++ -DHAVE_CONFIG_H -I. -I../aapl -I../colm/include -DBINDIR=\"/usr/bin\" -I/usr/include/aapl -O2 -fwrapv -pipe -Wformat -Werror=format-security -gdwarf-4 -fno-debug-types-section -fvar-tracking-assignments -g2 -Wp,-D_FORTIFY_SOURCE=2 -fstack-protector-strong --param=ssp-buffer-size=4 -Werror=trampolines -fPIC -march=x86-64 -mtune=generic -gdwarf-4 -fno-debug-types-section -fvar-tracking-assignments -g2 -MT libragel_la-load.lo -MD -MP -MF .deps/libragel_la-load.Tpo -c load.cc -fPIC -DPIC -o .libs/libragel_la-load.o mv -f .deps/libragel_la-load.Tpo .deps/libragel_la-load.Plo make[3]: Leaving directory '/tmp/B.3pi6qc/BUILD/ragel-7.0.4/src' make[3]: Entering directory '/tmp/B.3pi6qc/BUILD/ragel-7.0.4/src' x86_64-pld-linux-g++ -DHAVE_CONFIG_H -I. -I../aapl -I../colm/include -I/usr/include/aapl -O2 -fwrapv -pipe -Wformat -Werror=format-security -gdwarf-4 -fno-debug-types-section -fvar-tracking-assignments -g2 -Wp,-D_FORTIFY_SOURCE=2 -fstack-protector-strong --param=ssp-buffer-size=4 -Werror=trampolines -fPIC -march=x86-64 -mtune=generic -gdwarf-4 -fno-debug-types-section -fvar-tracking-assignments -g2 -MT ragel-main.o -MD -MP -MF .deps/ragel-main.Tpo -c -o ragel-main.o `test -f 'main.cc' || echo './'`main.cc mv -f .deps/ragel-main.Tpo .deps/ragel-main.Po make[3]: Leaving directory '/tmp/B.3pi6qc/BUILD/ragel-7.0.4/src' make[3]: Entering directory '/tmp/B.3pi6qc/BUILD/ragel-7.0.4/src' /bin/sh ../libtool --tag=CXX --mode=compile x86_64-pld-linux-g++ -DHAVE_CONFIG_H -I. -I../aapl -I../colm/include -DBINDIR='"/usr/bin"' -I/usr/include/aapl -O2 -fwrapv -pipe -Wformat -Werror=format-security -gdwarf-4 -fno-debug-types-section -fvar-tracking-assignments -g2 -Wp,-D_FORTIFY_SOURCE=2 -fstack-protector-strong --param=ssp-buffer-size=4 -Werror=trampolines -fPIC -march=x86-64 -mtune=generic -gdwarf-4 -fno-debug-types-section -fvar-tracking-assignments -g2 -MT libragel_la-reducer.lo -MD -MP -MF .deps/libragel_la-reducer.Tpo -c -o libragel_la-reducer.lo `test -f 'reducer.cc' || echo './'`reducer.cc libtool: compile: x86_64-pld-linux-g++ -DHAVE_CONFIG_H -I. -I../aapl -I../colm/include -DBINDIR=\"/usr/bin\" -I/usr/include/aapl -O2 -fwrapv -pipe -Wformat -Werror=format-security -gdwarf-4 -fno-debug-types-section -fvar-tracking-assignments -g2 -Wp,-D_FORTIFY_SOURCE=2 -fstack-protector-strong --param=ssp-buffer-size=4 -Werror=trampolines -fPIC -march=x86-64 -mtune=generic -gdwarf-4 -fno-debug-types-section -fvar-tracking-assignments -g2 -MT libragel_la-reducer.lo -MD -MP -MF .deps/libragel_la-reducer.Tpo -c reducer.cc -fPIC -DPIC -o .libs/libragel_la-reducer.o mv -f .deps/libragel_la-reducer.Tpo .deps/libragel_la-reducer.Plo make[3]: Leaving directory '/tmp/B.3pi6qc/BUILD/ragel-7.0.4/src' make[3]: Entering directory '/tmp/B.3pi6qc/BUILD/ragel-7.0.4/src' /bin/sh ../libtool --tag=CXX --mode=compile x86_64-pld-linux-g++ -DHAVE_CONFIG_H -I. -I../aapl -I../colm/include -DBINDIR='"/usr/bin"' -I/usr/include/aapl -O2 -fwrapv -pipe -Wformat -Werror=format-security -gdwarf-4 -fno-debug-types-section -fvar-tracking-assignments -g2 -Wp,-D_FORTIFY_SOURCE=2 -fstack-protector-strong --param=ssp-buffer-size=4 -Werror=trampolines -fPIC -march=x86-64 -mtune=generic -gdwarf-4 -fno-debug-types-section -fvar-tracking-assignments -g2 -MT libragel_la-longest.lo -MD -MP -MF .deps/libragel_la-longest.Tpo -c -o libragel_la-longest.lo `test -f 'longest.cc' || echo './'`longest.cc libtool: compile: x86_64-pld-linux-g++ -DHAVE_CONFIG_H -I. -I../aapl -I../colm/include -DBINDIR=\"/usr/bin\" -I/usr/include/aapl -O2 -fwrapv -pipe -Wformat -Werror=format-security -gdwarf-4 -fno-debug-types-section -fvar-tracking-assignments -g2 -Wp,-D_FORTIFY_SOURCE=2 -fstack-protector-strong --param=ssp-buffer-size=4 -Werror=trampolines -fPIC -march=x86-64 -mtune=generic -gdwarf-4 -fno-debug-types-section -fvar-tracking-assignments -g2 -MT libragel_la-longest.lo -MD -MP -MF .deps/libragel_la-longest.Tpo -c longest.cc -fPIC -DPIC -o .libs/libragel_la-longest.o mv -f .deps/libragel_la-longest.Tpo .deps/libragel_la-longest.Plo make[3]: Leaving directory '/tmp/B.3pi6qc/BUILD/ragel-7.0.4/src' make[3]: Entering directory '/tmp/B.3pi6qc/BUILD/ragel-7.0.4/src' /bin/sh ../libtool --tag=CXX --mode=compile x86_64-pld-linux-g++ -DHAVE_CONFIG_H -I. -I../aapl -I../colm/include -DBINDIR='"/usr/bin"' -I/usr/include/aapl -O2 -fwrapv -pipe -Wformat -Werror=format-security -gdwarf-4 -fno-debug-types-section -fvar-tracking-assignments -g2 -Wp,-D_FORTIFY_SOURCE=2 -fstack-protector-strong --param=ssp-buffer-size=4 -Werror=trampolines -fPIC -march=x86-64 -mtune=generic -gdwarf-4 -fno-debug-types-section -fvar-tracking-assignments -g2 -MT libragel_la-inputdata.lo -MD -MP -MF .deps/libragel_la-inputdata.Tpo -c -o libragel_la-inputdata.lo `test -f 'inputdata.cc' || echo './'`inputdata.cc libtool: compile: x86_64-pld-linux-g++ -DHAVE_CONFIG_H -I. -I../aapl -I../colm/include -DBINDIR=\"/usr/bin\" -I/usr/include/aapl -O2 -fwrapv -pipe -Wformat -Werror=format-security -gdwarf-4 -fno-debug-types-section -fvar-tracking-assignments -g2 -Wp,-D_FORTIFY_SOURCE=2 -fstack-protector-strong --param=ssp-buffer-size=4 -Werror=trampolines -fPIC -march=x86-64 -mtune=generic -gdwarf-4 -fno-debug-types-section -fvar-tracking-assignments -g2 -MT libragel_la-inputdata.lo -MD -MP -MF .deps/libragel_la-inputdata.Tpo -c inputdata.cc -fPIC -DPIC -o .libs/libragel_la-inputdata.o mv -f .deps/libragel_la-inputdata.Tpo .deps/libragel_la-inputdata.Plo make[3]: Leaving directory '/tmp/B.3pi6qc/BUILD/ragel-7.0.4/src' make[3]: Entering directory '/tmp/B.3pi6qc/BUILD/ragel-7.0.4/src' /bin/sh ../libtool --tag=CXX --mode=compile x86_64-pld-linux-g++ -DHAVE_CONFIG_H -I. -I../aapl -I../colm/include -DBINDIR='"/usr/bin"' -I/usr/include/aapl -O2 -fwrapv -pipe -Wformat -Werror=format-security -gdwarf-4 -fno-debug-types-section -fvar-tracking-assignments -g2 -Wp,-D_FORTIFY_SOURCE=2 -fstack-protector-strong --param=ssp-buffer-size=4 -Werror=trampolines -fPIC -march=x86-64 -mtune=generic -gdwarf-4 -fno-debug-types-section -fvar-tracking-assignments -g2 -MT libragel_la-parsetree.lo -MD -MP -MF .deps/libragel_la-parsetree.Tpo -c -o libragel_la-parsetree.lo `test -f 'parsetree.cc' || echo './'`parsetree.cc libtool: compile: x86_64-pld-linux-g++ -DHAVE_CONFIG_H -I. -I../aapl -I../colm/include -DBINDIR=\"/usr/bin\" -I/usr/include/aapl -O2 -fwrapv -pipe -Wformat -Werror=format-security -gdwarf-4 -fno-debug-types-section -fvar-tracking-assignments -g2 -Wp,-D_FORTIFY_SOURCE=2 -fstack-protector-strong --param=ssp-buffer-size=4 -Werror=trampolines -fPIC -march=x86-64 -mtune=generic -gdwarf-4 -fno-debug-types-section -fvar-tracking-assignments -g2 -MT libragel_la-parsetree.lo -MD -MP -MF .deps/libragel_la-parsetree.Tpo -c parsetree.cc -fPIC -DPIC -o .libs/libragel_la-parsetree.o mv -f .deps/libragel_la-parsetree.Tpo .deps/libragel_la-parsetree.Plo make[3]: Leaving directory '/tmp/B.3pi6qc/BUILD/ragel-7.0.4/src' make[3]: Entering directory '/tmp/B.3pi6qc/BUILD/ragel-7.0.4/src' /bin/sh ../libtool --tag=CXX --mode=compile x86_64-pld-linux-g++ -DHAVE_CONFIG_H -I. -I../aapl -I../colm/include -DBINDIR='"/usr/bin"' -I/usr/include/aapl -O2 -fwrapv -pipe -Wformat -Werror=format-security -gdwarf-4 -fno-debug-types-section -fvar-tracking-assignments -g2 -Wp,-D_FORTIFY_SOURCE=2 -fstack-protector-strong --param=ssp-buffer-size=4 -Werror=trampolines -fPIC -march=x86-64 -mtune=generic -gdwarf-4 -fno-debug-types-section -fvar-tracking-assignments -g2 -MT libragel_la-parsedata.lo -MD -MP -MF .deps/libragel_la-parsedata.Tpo -c -o libragel_la-parsedata.lo `test -f 'parsedata.cc' || echo './'`parsedata.cc libtool: compile: x86_64-pld-linux-g++ -DHAVE_CONFIG_H -I. -I../aapl -I../colm/include -DBINDIR=\"/usr/bin\" -I/usr/include/aapl -O2 -fwrapv -pipe -Wformat -Werror=format-security -gdwarf-4 -fno-debug-types-section -fvar-tracking-assignments -g2 -Wp,-D_FORTIFY_SOURCE=2 -fstack-protector-strong --param=ssp-buffer-size=4 -Werror=trampolines -fPIC -march=x86-64 -mtune=generic -gdwarf-4 -fno-debug-types-section -fvar-tracking-assignments -g2 -MT libragel_la-parsedata.lo -MD -MP -MF .deps/libragel_la-parsedata.Tpo -c parsedata.cc -fPIC -DPIC -o .libs/libragel_la-parsedata.o mv -f .deps/libragel_la-parsedata.Tpo .deps/libragel_la-parsedata.Plo make[3]: Leaving directory '/tmp/B.3pi6qc/BUILD/ragel-7.0.4/src' make[3]: Entering directory '/tmp/B.3pi6qc/BUILD/ragel-7.0.4/src' /bin/sh ../libtool --tag=CXX --mode=link x86_64-pld-linux-g++ -O2 -fwrapv -pipe -Wformat -Werror=format-security -gdwarf-4 -fno-debug-types-section -fvar-tracking-assignments -g2 -Wp,-D_FORTIFY_SOURCE=2 -fstack-protector-strong --param=ssp-buffer-size=4 -Werror=trampolines -fPIC -march=x86-64 -mtune=generic -gdwarf-4 -fno-debug-types-section -fvar-tracking-assignments -g2 -no-undefined -Wl,--no-undefined -Wl,--as-needed -Wl,--no-copy-dt-needed-entries -Wl,-z,relro -Wl,-z,combreloc -o libragel.la -rpath /usr/lib64 libragel_la-parsetree.lo libragel_la-longest.lo libragel_la-parsedata.lo libragel_la-inputdata.lo libragel_la-load.lo libragel_la-reducer.lo -lfsm -lcolm libtool: link: x86_64-pld-linux-g++ -fPIC -DPIC -shared -nostdlib /usr/lib64/gcc/x86_64-pld-linux/10.3.0/../../../../lib64/crti.o /usr/lib64/gcc/x86_64-pld-linux/10.3.0/crtbeginS.o .libs/libragel_la-parsetree.o .libs/libragel_la-longest.o .libs/libragel_la-parsedata.o .libs/libragel_la-inputdata.o .libs/libragel_la-load.o .libs/libragel_la-reducer.o -Wl,-rpath -Wl,/usr/lib64 -Wl,-rpath -Wl,/usr/lib64 -lfsm -lcolm -L/usr/lib64/gcc/x86_64-pld-linux/10.3.0 -L/usr/lib64/gcc/x86_64-pld-linux/10.3.0/../../../../lib64 -L/lib/../lib64 -L/usr/lib/../lib64 -L/usr/lib64/gcc/x86_64-pld-linux/10.3.0/../../.. /usr/lib64/libstdc++.so -lm -lc -lgcc_s /usr/lib64/gcc/x86_64-pld-linux/10.3.0/crtendS.o /usr/lib64/gcc/x86_64-pld-linux/10.3.0/../../../../lib64/crtn.o -O2 -gdwarf-4 -g2 -fstack-protector-strong -march=x86-64 -mtune=generic -gdwarf-4 -g2 -Wl,--no-undefined -Wl,--as-needed -Wl,--no-copy-dt-needed-entries -Wl,-z -Wl,relro -Wl,-z -Wl,combreloc -Wl,-soname -Wl,libragel.so.0 -o .libs/libragel.so.0.0.0 libtool: link: (cd ".libs" && rm -f "libragel.so.0" && ln -s "libragel.so.0.0.0" "libragel.so.0") libtool: link: (cd ".libs" && rm -f "libragel.so" && ln -s "libragel.so.0.0.0" "libragel.so") libtool: link: ( cd ".libs" && rm -f "libragel.la" && ln -s "../libragel.la" "libragel.la" ) make[3]: Leaving directory '/tmp/B.3pi6qc/BUILD/ragel-7.0.4/src' make[3]: Entering directory '/tmp/B.3pi6qc/BUILD/ragel-7.0.4/src' x86_64-pld-linux-gcc -DHAVE_CONFIG_H -I. -I../aapl -I../colm/include -I/usr/include/aapl -O2 -fwrapv -pipe -Wformat -Werror=format-security -gdwarf-4 -fno-debug-types-section -fvar-tracking-assignments -g2 -Wp,-D_FORTIFY_SOURCE=2 -fstack-protector-strong --param=ssp-buffer-size=4 -Werror=trampolines -fPIC -march=x86-64 -mtune=generic -gdwarf-4 -fno-debug-types-section -fvar-tracking-assignments -g2 -MT ragel-parse.o -MD -MP -MF .deps/ragel-parse.Tpo -c -o ragel-parse.o `test -f 'parse.c' || echo './'`parse.c mv -f .deps/ragel-parse.Tpo .deps/ragel-parse.Po make[3]: Leaving directory '/tmp/B.3pi6qc/BUILD/ragel-7.0.4/src' make[3]: Entering directory '/tmp/B.3pi6qc/BUILD/ragel-7.0.4/src' x86_64-pld-linux-g++ -DHAVE_CONFIG_H -I. -I../aapl -I../colm/include -I/usr/include/aapl -O2 -fwrapv -pipe -Wformat -Werror=format-security -gdwarf-4 -fno-debug-types-section -fvar-tracking-assignments -g2 -Wp,-D_FORTIFY_SOURCE=2 -fstack-protector-strong --param=ssp-buffer-size=4 -Werror=trampolines -fPIC -march=x86-64 -mtune=generic -gdwarf-4 -fno-debug-types-section -fvar-tracking-assignments -g2 -MT ragel-rlreduce.o -MD -MP -MF .deps/ragel-rlreduce.Tpo -c -o ragel-rlreduce.o `test -f 'rlreduce.cc' || echo './'`rlreduce.cc mv -f .deps/ragel-rlreduce.Tpo .deps/ragel-rlreduce.Po make[3]: Leaving directory '/tmp/B.3pi6qc/BUILD/ragel-7.0.4/src' make[3]: Entering directory '/tmp/B.3pi6qc/BUILD/ragel-7.0.4/src' /bin/sh ../libtool --tag=CXX --mode=link x86_64-pld-linux-g++ -O2 -fwrapv -pipe -Wformat -Werror=format-security -gdwarf-4 -fno-debug-types-section -fvar-tracking-assignments -g2 -Wp,-D_FORTIFY_SOURCE=2 -fstack-protector-strong --param=ssp-buffer-size=4 -Werror=trampolines -fPIC -march=x86-64 -mtune=generic -gdwarf-4 -fno-debug-types-section -fvar-tracking-assignments -g2 -Wl,--as-needed -Wl,--no-copy-dt-needed-entries -Wl,-z,relro -Wl,-z,combreloc -o ragel ragel-main.o ragel-parse.o ragel-rlreduce.o -lfsm -lcolm libragel.la libtool: link: x86_64-pld-linux-g++ -O2 -fwrapv -pipe -Wformat -Werror=format-security -gdwarf-4 -fno-debug-types-section -fvar-tracking-assignments -g2 -Wp,-D_FORTIFY_SOURCE=2 -fstack-protector-strong --param=ssp-buffer-size=4 -Werror=trampolines -fPIC -march=x86-64 -mtune=generic -gdwarf-4 -fno-debug-types-section -fvar-tracking-assignments -g2 -Wl,--as-needed -Wl,--no-copy-dt-needed-entries -Wl,-z -Wl,relro -Wl,-z -Wl,combreloc -o .libs/ragel ragel-main.o ragel-parse.o ragel-rlreduce.o -lfsm -lcolm ./.libs/libragel.so -Wl,-rpath -Wl,/usr/lib64 make[3]: Leaving directory '/tmp/B.3pi6qc/BUILD/ragel-7.0.4/src' Making all in host-ruby make[3]: Entering directory '/tmp/B.3pi6qc/BUILD/ragel-7.0.4/src/host-ruby' /usr/bin/colm -c -I /usr/share/colm -b rlhcRuby -o rlhc.c /usr/share/colm/rlhc-ruby.lm make[3]: Leaving directory '/tmp/B.3pi6qc/BUILD/ragel-7.0.4/src/host-ruby' make[3]: Entering directory '/tmp/B.3pi6qc/BUILD/ragel-7.0.4/src/host-ruby' /usr/bin/colm-wrap -c -I .. -b rlparseRuby -o rlparse.pack -p rlparse.c -m rlreduce.cc rlparse.lm make[3]: Leaving directory '/tmp/B.3pi6qc/BUILD/ragel-7.0.4/src/host-ruby' make[3]: Entering directory '/tmp/B.3pi6qc/BUILD/ragel-7.0.4/src/host-ruby' /usr/bin/colm-wrap -o rlreduce.cc rlparse.pack make[3]: Leaving directory '/tmp/B.3pi6qc/BUILD/ragel-7.0.4/src/host-ruby' make[3]: Entering directory '/tmp/B.3pi6qc/BUILD/ragel-7.0.4/src/host-ruby' /usr/bin/colm-wrap -o rlparse.c rlparse.pack make[3]: Leaving directory '/tmp/B.3pi6qc/BUILD/ragel-7.0.4/src/host-ruby' /usr/bin/make all-am make[4]: Entering directory '/tmp/B.3pi6qc/BUILD/ragel-7.0.4/src/host-ruby' x86_64-pld-linux-g++ -DHAVE_CONFIG_H -I. -I../../src -I../../aapl -I../../ragel -I../../colm/include -I/usr/include/aapl -O2 -fwrapv -pipe -Wformat -Werror=format-security -gdwarf-4 -fno-debug-types-section -fvar-tracking-assignments -g2 -Wp,-D_FORTIFY_SOURCE=2 -fstack-protector-strong --param=ssp-buffer-size=4 -Werror=trampolines -fPIC -march=x86-64 -mtune=generic -gdwarf-4 -fno-debug-types-section -fvar-tracking-assignments -g2 -MT ragel_ruby-main.o -MD -MP -MF .deps/ragel_ruby-main.Tpo -c -o ragel_ruby-main.o `test -f 'main.cc' || echo './'`main.cc mv -f .deps/ragel_ruby-main.Tpo .deps/ragel_ruby-main.Po make[4]: Leaving directory '/tmp/B.3pi6qc/BUILD/ragel-7.0.4/src/host-ruby' make[4]: Entering directory '/tmp/B.3pi6qc/BUILD/ragel-7.0.4/src/host-ruby' x86_64-pld-linux-gcc -DHAVE_CONFIG_H -I. -I../../src -I../../aapl -I../../ragel -I../../colm/include -I/usr/include/aapl -O2 -fwrapv -pipe -Wformat -Werror=format-security -gdwarf-4 -fno-debug-types-section -fvar-tracking-assignments -g2 -Wp,-D_FORTIFY_SOURCE=2 -fstack-protector-strong --param=ssp-buffer-size=4 -Werror=trampolines -fPIC -march=x86-64 -mtune=generic -gdwarf-4 -fno-debug-types-section -fvar-tracking-assignments -g2 -MT ragel_ruby-rlhc.o -MD -MP -MF .deps/ragel_ruby-rlhc.Tpo -c -o ragel_ruby-rlhc.o `test -f 'rlhc.c' || echo './'`rlhc.c mv -f .deps/ragel_ruby-rlhc.Tpo .deps/ragel_ruby-rlhc.Po make[4]: Leaving directory '/tmp/B.3pi6qc/BUILD/ragel-7.0.4/src/host-ruby' make[4]: Entering directory '/tmp/B.3pi6qc/BUILD/ragel-7.0.4/src/host-ruby' x86_64-pld-linux-gcc -DHAVE_CONFIG_H -I. -I../../src -I../../aapl -I../../ragel -I../../colm/include -I/usr/include/aapl -O2 -fwrapv -pipe -Wformat -Werror=format-security -gdwarf-4 -fno-debug-types-section -fvar-tracking-assignments -g2 -Wp,-D_FORTIFY_SOURCE=2 -fstack-protector-strong --param=ssp-buffer-size=4 -Werror=trampolines -fPIC -march=x86-64 -mtune=generic -gdwarf-4 -fno-debug-types-section -fvar-tracking-assignments -g2 -MT ragel_ruby-rlparse.o -MD -MP -MF .deps/ragel_ruby-rlparse.Tpo -c -o ragel_ruby-rlparse.o `test -f 'rlparse.c' || echo './'`rlparse.c mv -f .deps/ragel_ruby-rlparse.Tpo .deps/ragel_ruby-rlparse.Po make[4]: Leaving directory '/tmp/B.3pi6qc/BUILD/ragel-7.0.4/src/host-ruby' make[4]: Entering directory '/tmp/B.3pi6qc/BUILD/ragel-7.0.4/src/host-ruby' x86_64-pld-linux-g++ -DHAVE_CONFIG_H -I. -I../../src -I../../aapl -I../../ragel -I../../colm/include -I/usr/include/aapl -O2 -fwrapv -pipe -Wformat -Werror=format-security -gdwarf-4 -fno-debug-types-section -fvar-tracking-assignments -g2 -Wp,-D_FORTIFY_SOURCE=2 -fstack-protector-strong --param=ssp-buffer-size=4 -Werror=trampolines -fPIC -march=x86-64 -mtune=generic -gdwarf-4 -fno-debug-types-section -fvar-tracking-assignments -g2 -MT ragel_ruby-rlreduce.o -MD -MP -MF .deps/ragel_ruby-rlreduce.Tpo -c -o ragel_ruby-rlreduce.o `test -f 'rlreduce.cc' || echo './'`rlreduce.cc mv -f .deps/ragel_ruby-rlreduce.Tpo .deps/ragel_ruby-rlreduce.Po make[4]: Leaving directory '/tmp/B.3pi6qc/BUILD/ragel-7.0.4/src/host-ruby' make[4]: Entering directory '/tmp/B.3pi6qc/BUILD/ragel-7.0.4/src/host-ruby' /bin/sh ../../libtool --tag=CXX --mode=link x86_64-pld-linux-g++ -O2 -fwrapv -pipe -Wformat -Werror=format-security -gdwarf-4 -fno-debug-types-section -fvar-tracking-assignments -g2 -Wp,-D_FORTIFY_SOURCE=2 -fstack-protector-strong --param=ssp-buffer-size=4 -Werror=trampolines -fPIC -march=x86-64 -mtune=generic -gdwarf-4 -fno-debug-types-section -fvar-tracking-assignments -g2 -Wl,--as-needed -Wl,--no-copy-dt-needed-entries -Wl,-z,relro -Wl,-z,combreloc -o ragel-ruby ragel_ruby-main.o ragel_ruby-rlhc.o ragel_ruby-rlparse.o ragel_ruby-rlreduce.o -lfsm -lcolm ../libragel.la libtool: link: x86_64-pld-linux-g++ -O2 -fwrapv -pipe -Wformat -Werror=format-security -gdwarf-4 -fno-debug-types-section -fvar-tracking-assignments -g2 -Wp,-D_FORTIFY_SOURCE=2 -fstack-protector-strong --param=ssp-buffer-size=4 -Werror=trampolines -fPIC -march=x86-64 -mtune=generic -gdwarf-4 -fno-debug-types-section -fvar-tracking-assignments -g2 -Wl,--as-needed -Wl,--no-copy-dt-needed-entries -Wl,-z -Wl,relro -Wl,-z -Wl,combreloc -o .libs/ragel-ruby ragel_ruby-main.o ragel_ruby-rlhc.o ragel_ruby-rlparse.o ragel_ruby-rlreduce.o -lfsm -lcolm ../.libs/libragel.so -Wl,-rpath -Wl,/usr/lib64 make[4]: Leaving directory '/tmp/B.3pi6qc/BUILD/ragel-7.0.4/src/host-ruby' Making all in host-asm make[3]: Entering directory '/tmp/B.3pi6qc/BUILD/ragel-7.0.4/src/host-asm' /usr/bin/colm-wrap -c -I .. -b rlparseAsm -o rlparse.pack -p rlparse.c -m rlreduce.cc rlparse.lm make[3]: Leaving directory '/tmp/B.3pi6qc/BUILD/ragel-7.0.4/src/host-asm' make[3]: Entering directory '/tmp/B.3pi6qc/BUILD/ragel-7.0.4/src/host-asm' /usr/bin/colm-wrap -o rlreduce.cc rlparse.pack make[3]: Leaving directory '/tmp/B.3pi6qc/BUILD/ragel-7.0.4/src/host-asm' make[3]: Entering directory '/tmp/B.3pi6qc/BUILD/ragel-7.0.4/src/host-asm' /usr/bin/colm-wrap -o rlparse.c rlparse.pack make[3]: Leaving directory '/tmp/B.3pi6qc/BUILD/ragel-7.0.4/src/host-asm' /usr/bin/make all-am make[4]: Entering directory '/tmp/B.3pi6qc/BUILD/ragel-7.0.4/src/host-asm' x86_64-pld-linux-g++ -DHAVE_CONFIG_H -I. -I../../src -I../../aapl -I../../ragel -I../../colm/include -I/usr/include/aapl -O2 -fwrapv -pipe -Wformat -Werror=format-security -gdwarf-4 -fno-debug-types-section -fvar-tracking-assignments -g2 -Wp,-D_FORTIFY_SOURCE=2 -fstack-protector-strong --param=ssp-buffer-size=4 -Werror=trampolines -fPIC -march=x86-64 -mtune=generic -gdwarf-4 -fno-debug-types-section -fvar-tracking-assignments -g2 -MT ragel_asm-main.o -MD -MP -MF .deps/ragel_asm-main.Tpo -c -o ragel_asm-main.o `test -f 'main.cc' || echo './'`main.cc mv -f .deps/ragel_asm-main.Tpo .deps/ragel_asm-main.Po make[4]: Leaving directory '/tmp/B.3pi6qc/BUILD/ragel-7.0.4/src/host-asm' make[4]: Entering directory '/tmp/B.3pi6qc/BUILD/ragel-7.0.4/src/host-asm' x86_64-pld-linux-gcc -DHAVE_CONFIG_H -I. -I../../src -I../../aapl -I../../ragel -I../../colm/include -I/usr/include/aapl -O2 -fwrapv -pipe -Wformat -Werror=format-security -gdwarf-4 -fno-debug-types-section -fvar-tracking-assignments -g2 -Wp,-D_FORTIFY_SOURCE=2 -fstack-protector-strong --param=ssp-buffer-size=4 -Werror=trampolines -fPIC -march=x86-64 -mtune=generic -gdwarf-4 -fno-debug-types-section -fvar-tracking-assignments -g2 -MT ragel_asm-rlparse.o -MD -MP -MF .deps/ragel_asm-rlparse.Tpo -c -o ragel_asm-rlparse.o `test -f 'rlparse.c' || echo './'`rlparse.c mv -f .deps/ragel_asm-rlparse.Tpo .deps/ragel_asm-rlparse.Po make[4]: Leaving directory '/tmp/B.3pi6qc/BUILD/ragel-7.0.4/src/host-asm' make[4]: Entering directory '/tmp/B.3pi6qc/BUILD/ragel-7.0.4/src/host-asm' x86_64-pld-linux-g++ -DHAVE_CONFIG_H -I. -I../../src -I../../aapl -I../../ragel -I../../colm/include -I/usr/include/aapl -O2 -fwrapv -pipe -Wformat -Werror=format-security -gdwarf-4 -fno-debug-types-section -fvar-tracking-assignments -g2 -Wp,-D_FORTIFY_SOURCE=2 -fstack-protector-strong --param=ssp-buffer-size=4 -Werror=trampolines -fPIC -march=x86-64 -mtune=generic -gdwarf-4 -fno-debug-types-section -fvar-tracking-assignments -g2 -MT ragel_asm-rlreduce.o -MD -MP -MF .deps/ragel_asm-rlreduce.Tpo -c -o ragel_asm-rlreduce.o `test -f 'rlreduce.cc' || echo './'`rlreduce.cc mv -f .deps/ragel_asm-rlreduce.Tpo .deps/ragel_asm-rlreduce.Po make[4]: Leaving directory '/tmp/B.3pi6qc/BUILD/ragel-7.0.4/src/host-asm' make[4]: Entering directory '/tmp/B.3pi6qc/BUILD/ragel-7.0.4/src/host-asm' /bin/sh ../../libtool --tag=CXX --mode=link x86_64-pld-linux-g++ -O2 -fwrapv -pipe -Wformat -Werror=format-security -gdwarf-4 -fno-debug-types-section -fvar-tracking-assignments -g2 -Wp,-D_FORTIFY_SOURCE=2 -fstack-protector-strong --param=ssp-buffer-size=4 -Werror=trampolines -fPIC -march=x86-64 -mtune=generic -gdwarf-4 -fno-debug-types-section -fvar-tracking-assignments -g2 -Wl,--as-needed -Wl,--no-copy-dt-needed-entries -Wl,-z,relro -Wl,-z,combreloc -o ragel-asm ragel_asm-main.o ragel_asm-rlparse.o ragel_asm-rlreduce.o -lfsm -lcolm ../libragel.la libtool: link: x86_64-pld-linux-g++ -O2 -fwrapv -pipe -Wformat -Werror=format-security -gdwarf-4 -fno-debug-types-section -fvar-tracking-assignments -g2 -Wp,-D_FORTIFY_SOURCE=2 -fstack-protector-strong --param=ssp-buffer-size=4 -Werror=trampolines -fPIC -march=x86-64 -mtune=generic -gdwarf-4 -fno-debug-types-section -fvar-tracking-assignments -g2 -Wl,--as-needed -Wl,--no-copy-dt-needed-entries -Wl,-z -Wl,relro -Wl,-z -Wl,combreloc -o .libs/ragel-asm ragel_asm-main.o ragel_asm-rlparse.o ragel_asm-rlreduce.o -lfsm -lcolm ../.libs/libragel.so -Wl,-rpath -Wl,/usr/lib64 make[4]: Leaving directory '/tmp/B.3pi6qc/BUILD/ragel-7.0.4/src/host-asm' Making all in host-julia make[3]: Entering directory '/tmp/B.3pi6qc/BUILD/ragel-7.0.4/src/host-julia' /usr/bin/colm -c -I /usr/share/colm -b rlhcJulia -o rlhc.c /usr/share/colm/rlhc-julia.lm make[3]: Leaving directory '/tmp/B.3pi6qc/BUILD/ragel-7.0.4/src/host-julia' make[3]: Entering directory '/tmp/B.3pi6qc/BUILD/ragel-7.0.4/src/host-julia' /usr/bin/colm-wrap -c -I .. -b rlparseJulia -o rlparse.pack -p rlparse.c -m rlreduce.cc rlparse.lm make[3]: Leaving directory '/tmp/B.3pi6qc/BUILD/ragel-7.0.4/src/host-julia' make[3]: Entering directory '/tmp/B.3pi6qc/BUILD/ragel-7.0.4/src/host-julia' /usr/bin/colm-wrap -o rlreduce.cc rlparse.pack make[3]: Leaving directory '/tmp/B.3pi6qc/BUILD/ragel-7.0.4/src/host-julia' make[3]: Entering directory '/tmp/B.3pi6qc/BUILD/ragel-7.0.4/src/host-julia' /usr/bin/colm-wrap -o rlparse.c rlparse.pack make[3]: Leaving directory '/tmp/B.3pi6qc/BUILD/ragel-7.0.4/src/host-julia' /usr/bin/make all-am make[4]: Entering directory '/tmp/B.3pi6qc/BUILD/ragel-7.0.4/src/host-julia' x86_64-pld-linux-g++ -DHAVE_CONFIG_H -I. -I../../src -I../../aapl -I../../ragel -I../../colm/include -I/usr/include/aapl -O2 -fwrapv -pipe -Wformat -Werror=format-security -gdwarf-4 -fno-debug-types-section -fvar-tracking-assignments -g2 -Wp,-D_FORTIFY_SOURCE=2 -fstack-protector-strong --param=ssp-buffer-size=4 -Werror=trampolines -fPIC -march=x86-64 -mtune=generic -gdwarf-4 -fno-debug-types-section -fvar-tracking-assignments -g2 -MT ragel_julia-main.o -MD -MP -MF .deps/ragel_julia-main.Tpo -c -o ragel_julia-main.o `test -f 'main.cc' || echo './'`main.cc mv -f .deps/ragel_julia-main.Tpo .deps/ragel_julia-main.Po make[4]: Leaving directory '/tmp/B.3pi6qc/BUILD/ragel-7.0.4/src/host-julia' make[4]: Entering directory '/tmp/B.3pi6qc/BUILD/ragel-7.0.4/src/host-julia' x86_64-pld-linux-gcc -DHAVE_CONFIG_H -I. -I../../src -I../../aapl -I../../ragel -I../../colm/include -I/usr/include/aapl -O2 -fwrapv -pipe -Wformat -Werror=format-security -gdwarf-4 -fno-debug-types-section -fvar-tracking-assignments -g2 -Wp,-D_FORTIFY_SOURCE=2 -fstack-protector-strong --param=ssp-buffer-size=4 -Werror=trampolines -fPIC -march=x86-64 -mtune=generic -gdwarf-4 -fno-debug-types-section -fvar-tracking-assignments -g2 -MT ragel_julia-rlhc.o -MD -MP -MF .deps/ragel_julia-rlhc.Tpo -c -o ragel_julia-rlhc.o `test -f 'rlhc.c' || echo './'`rlhc.c mv -f .deps/ragel_julia-rlhc.Tpo .deps/ragel_julia-rlhc.Po make[4]: Leaving directory '/tmp/B.3pi6qc/BUILD/ragel-7.0.4/src/host-julia' make[4]: Entering directory '/tmp/B.3pi6qc/BUILD/ragel-7.0.4/src/host-julia' x86_64-pld-linux-gcc -DHAVE_CONFIG_H -I. -I../../src -I../../aapl -I../../ragel -I../../colm/include -I/usr/include/aapl -O2 -fwrapv -pipe -Wformat -Werror=format-security -gdwarf-4 -fno-debug-types-section -fvar-tracking-assignments -g2 -Wp,-D_FORTIFY_SOURCE=2 -fstack-protector-strong --param=ssp-buffer-size=4 -Werror=trampolines -fPIC -march=x86-64 -mtune=generic -gdwarf-4 -fno-debug-types-section -fvar-tracking-assignments -g2 -MT ragel_julia-rlparse.o -MD -MP -MF .deps/ragel_julia-rlparse.Tpo -c -o ragel_julia-rlparse.o `test -f 'rlparse.c' || echo './'`rlparse.c mv -f .deps/ragel_julia-rlparse.Tpo .deps/ragel_julia-rlparse.Po make[4]: Leaving directory '/tmp/B.3pi6qc/BUILD/ragel-7.0.4/src/host-julia' make[4]: Entering directory '/tmp/B.3pi6qc/BUILD/ragel-7.0.4/src/host-julia' x86_64-pld-linux-g++ -DHAVE_CONFIG_H -I. -I../../src -I../../aapl -I../../ragel -I../../colm/include -I/usr/include/aapl -O2 -fwrapv -pipe -Wformat -Werror=format-security -gdwarf-4 -fno-debug-types-section -fvar-tracking-assignments -g2 -Wp,-D_FORTIFY_SOURCE=2 -fstack-protector-strong --param=ssp-buffer-size=4 -Werror=trampolines -fPIC -march=x86-64 -mtune=generic -gdwarf-4 -fno-debug-types-section -fvar-tracking-assignments -g2 -MT ragel_julia-rlreduce.o -MD -MP -MF .deps/ragel_julia-rlreduce.Tpo -c -o ragel_julia-rlreduce.o `test -f 'rlreduce.cc' || echo './'`rlreduce.cc mv -f .deps/ragel_julia-rlreduce.Tpo .deps/ragel_julia-rlreduce.Po make[4]: Leaving directory '/tmp/B.3pi6qc/BUILD/ragel-7.0.4/src/host-julia' make[4]: Entering directory '/tmp/B.3pi6qc/BUILD/ragel-7.0.4/src/host-julia' /bin/sh ../../libtool --tag=CXX --mode=link x86_64-pld-linux-g++ -O2 -fwrapv -pipe -Wformat -Werror=format-security -gdwarf-4 -fno-debug-types-section -fvar-tracking-assignments -g2 -Wp,-D_FORTIFY_SOURCE=2 -fstack-protector-strong --param=ssp-buffer-size=4 -Werror=trampolines -fPIC -march=x86-64 -mtune=generic -gdwarf-4 -fno-debug-types-section -fvar-tracking-assignments -g2 -Wl,--as-needed -Wl,--no-copy-dt-needed-entries -Wl,-z,relro -Wl,-z,combreloc -o ragel-julia ragel_julia-main.o ragel_julia-rlhc.o ragel_julia-rlparse.o ragel_julia-rlreduce.o -lfsm -lcolm ../libragel.la libtool: link: x86_64-pld-linux-g++ -O2 -fwrapv -pipe -Wformat -Werror=format-security -gdwarf-4 -fno-debug-types-section -fvar-tracking-assignments -g2 -Wp,-D_FORTIFY_SOURCE=2 -fstack-protector-strong --param=ssp-buffer-size=4 -Werror=trampolines -fPIC -march=x86-64 -mtune=generic -gdwarf-4 -fno-debug-types-section -fvar-tracking-assignments -g2 -Wl,--as-needed -Wl,--no-copy-dt-needed-entries -Wl,-z -Wl,relro -Wl,-z -Wl,combreloc -o .libs/ragel-julia ragel_julia-main.o ragel_julia-rlhc.o ragel_julia-rlparse.o ragel_julia-rlreduce.o -lfsm -lcolm ../.libs/libragel.so -Wl,-rpath -Wl,/usr/lib64 make[4]: Leaving directory '/tmp/B.3pi6qc/BUILD/ragel-7.0.4/src/host-julia' Making all in host-ocaml make[3]: Entering directory '/tmp/B.3pi6qc/BUILD/ragel-7.0.4/src/host-ocaml' /usr/bin/colm -c -I /usr/share/colm -b rlhcOCaml -o rlhc.c /usr/share/colm/rlhc-ocaml.lm make[3]: Leaving directory '/tmp/B.3pi6qc/BUILD/ragel-7.0.4/src/host-ocaml' make[3]: Entering directory '/tmp/B.3pi6qc/BUILD/ragel-7.0.4/src/host-ocaml' /usr/bin/colm-wrap -c -I .. -b rlparseOCaml -o rlparse.pack -p rlparse.c -m rlreduce.cc rlparse.lm make[3]: Leaving directory '/tmp/B.3pi6qc/BUILD/ragel-7.0.4/src/host-ocaml' make[3]: Entering directory '/tmp/B.3pi6qc/BUILD/ragel-7.0.4/src/host-ocaml' /usr/bin/colm-wrap -o rlreduce.cc rlparse.pack make[3]: Leaving directory '/tmp/B.3pi6qc/BUILD/ragel-7.0.4/src/host-ocaml' make[3]: Entering directory '/tmp/B.3pi6qc/BUILD/ragel-7.0.4/src/host-ocaml' /usr/bin/colm-wrap -o rlparse.c rlparse.pack make[3]: Leaving directory '/tmp/B.3pi6qc/BUILD/ragel-7.0.4/src/host-ocaml' /usr/bin/make all-am make[4]: Entering directory '/tmp/B.3pi6qc/BUILD/ragel-7.0.4/src/host-ocaml' x86_64-pld-linux-g++ -DHAVE_CONFIG_H -I. -I../../src -I../../aapl -I../../ragel -I../../colm/include -I/usr/include/aapl -O2 -fwrapv -pipe -Wformat -Werror=format-security -gdwarf-4 -fno-debug-types-section -fvar-tracking-assignments -g2 -Wp,-D_FORTIFY_SOURCE=2 -fstack-protector-strong --param=ssp-buffer-size=4 -Werror=trampolines -fPIC -march=x86-64 -mtune=generic -gdwarf-4 -fno-debug-types-section -fvar-tracking-assignments -g2 -MT ragel_ocaml-main.o -MD -MP -MF .deps/ragel_ocaml-main.Tpo -c -o ragel_ocaml-main.o `test -f 'main.cc' || echo './'`main.cc mv -f .deps/ragel_ocaml-main.Tpo .deps/ragel_ocaml-main.Po make[4]: Leaving directory '/tmp/B.3pi6qc/BUILD/ragel-7.0.4/src/host-ocaml' make[4]: Entering directory '/tmp/B.3pi6qc/BUILD/ragel-7.0.4/src/host-ocaml' x86_64-pld-linux-gcc -DHAVE_CONFIG_H -I. -I../../src -I../../aapl -I../../ragel -I../../colm/include -I/usr/include/aapl -O2 -fwrapv -pipe -Wformat -Werror=format-security -gdwarf-4 -fno-debug-types-section -fvar-tracking-assignments -g2 -Wp,-D_FORTIFY_SOURCE=2 -fstack-protector-strong --param=ssp-buffer-size=4 -Werror=trampolines -fPIC -march=x86-64 -mtune=generic -gdwarf-4 -fno-debug-types-section -fvar-tracking-assignments -g2 -MT ragel_ocaml-rlhc.o -MD -MP -MF .deps/ragel_ocaml-rlhc.Tpo -c -o ragel_ocaml-rlhc.o `test -f 'rlhc.c' || echo './'`rlhc.c mv -f .deps/ragel_ocaml-rlhc.Tpo .deps/ragel_ocaml-rlhc.Po make[4]: Leaving directory '/tmp/B.3pi6qc/BUILD/ragel-7.0.4/src/host-ocaml' make[4]: Entering directory '/tmp/B.3pi6qc/BUILD/ragel-7.0.4/src/host-ocaml' x86_64-pld-linux-gcc -DHAVE_CONFIG_H -I. -I../../src -I../../aapl -I../../ragel -I../../colm/include -I/usr/include/aapl -O2 -fwrapv -pipe -Wformat -Werror=format-security -gdwarf-4 -fno-debug-types-section -fvar-tracking-assignments -g2 -Wp,-D_FORTIFY_SOURCE=2 -fstack-protector-strong --param=ssp-buffer-size=4 -Werror=trampolines -fPIC -march=x86-64 -mtune=generic -gdwarf-4 -fno-debug-types-section -fvar-tracking-assignments -g2 -MT ragel_ocaml-rlparse.o -MD -MP -MF .deps/ragel_ocaml-rlparse.Tpo -c -o ragel_ocaml-rlparse.o `test -f 'rlparse.c' || echo './'`rlparse.c mv -f .deps/ragel_ocaml-rlparse.Tpo .deps/ragel_ocaml-rlparse.Po make[4]: Leaving directory '/tmp/B.3pi6qc/BUILD/ragel-7.0.4/src/host-ocaml' make[4]: Entering directory '/tmp/B.3pi6qc/BUILD/ragel-7.0.4/src/host-ocaml' x86_64-pld-linux-g++ -DHAVE_CONFIG_H -I. -I../../src -I../../aapl -I../../ragel -I../../colm/include -I/usr/include/aapl -O2 -fwrapv -pipe -Wformat -Werror=format-security -gdwarf-4 -fno-debug-types-section -fvar-tracking-assignments -g2 -Wp,-D_FORTIFY_SOURCE=2 -fstack-protector-strong --param=ssp-buffer-size=4 -Werror=trampolines -fPIC -march=x86-64 -mtune=generic -gdwarf-4 -fno-debug-types-section -fvar-tracking-assignments -g2 -MT ragel_ocaml-rlreduce.o -MD -MP -MF .deps/ragel_ocaml-rlreduce.Tpo -c -o ragel_ocaml-rlreduce.o `test -f 'rlreduce.cc' || echo './'`rlreduce.cc mv -f .deps/ragel_ocaml-rlreduce.Tpo .deps/ragel_ocaml-rlreduce.Po make[4]: Leaving directory '/tmp/B.3pi6qc/BUILD/ragel-7.0.4/src/host-ocaml' make[4]: Entering directory '/tmp/B.3pi6qc/BUILD/ragel-7.0.4/src/host-ocaml' /bin/sh ../../libtool --tag=CXX --mode=link x86_64-pld-linux-g++ -O2 -fwrapv -pipe -Wformat -Werror=format-security -gdwarf-4 -fno-debug-types-section -fvar-tracking-assignments -g2 -Wp,-D_FORTIFY_SOURCE=2 -fstack-protector-strong --param=ssp-buffer-size=4 -Werror=trampolines -fPIC -march=x86-64 -mtune=generic -gdwarf-4 -fno-debug-types-section -fvar-tracking-assignments -g2 -Wl,--as-needed -Wl,--no-copy-dt-needed-entries -Wl,-z,relro -Wl,-z,combreloc -o ragel-ocaml ragel_ocaml-main.o ragel_ocaml-rlhc.o ragel_ocaml-rlparse.o ragel_ocaml-rlreduce.o -lfsm -lcolm ../libragel.la libtool: link: x86_64-pld-linux-g++ -O2 -fwrapv -pipe -Wformat -Werror=format-security -gdwarf-4 -fno-debug-types-section -fvar-tracking-assignments -g2 -Wp,-D_FORTIFY_SOURCE=2 -fstack-protector-strong --param=ssp-buffer-size=4 -Werror=trampolines -fPIC -march=x86-64 -mtune=generic -gdwarf-4 -fno-debug-types-section -fvar-tracking-assignments -g2 -Wl,--as-needed -Wl,--no-copy-dt-needed-entries -Wl,-z -Wl,relro -Wl,-z -Wl,combreloc -o .libs/ragel-ocaml ragel_ocaml-main.o ragel_ocaml-rlhc.o ragel_ocaml-rlparse.o ragel_ocaml-rlreduce.o -lfsm -lcolm ../.libs/libragel.so -Wl,-rpath -Wl,/usr/lib64 make[4]: Leaving directory '/tmp/B.3pi6qc/BUILD/ragel-7.0.4/src/host-ocaml' Making all in host-c make[3]: Entering directory '/tmp/B.3pi6qc/BUILD/ragel-7.0.4/src/host-c' /usr/bin/colm-wrap -c -I .. -b rlparseC -o rlparse.pack -p rlparse.c -m rlreduce.cc rlparse.lm make[3]: Leaving directory '/tmp/B.3pi6qc/BUILD/ragel-7.0.4/src/host-c' make[3]: Entering directory '/tmp/B.3pi6qc/BUILD/ragel-7.0.4/src/host-c' /usr/bin/colm-wrap -o rlreduce.cc rlparse.pack make[3]: Leaving directory '/tmp/B.3pi6qc/BUILD/ragel-7.0.4/src/host-c' make[3]: Entering directory '/tmp/B.3pi6qc/BUILD/ragel-7.0.4/src/host-c' /usr/bin/colm-wrap -o rlparse.c rlparse.pack make[3]: Leaving directory '/tmp/B.3pi6qc/BUILD/ragel-7.0.4/src/host-c' /usr/bin/make all-am make[4]: Entering directory '/tmp/B.3pi6qc/BUILD/ragel-7.0.4/src/host-c' /usr/bin/colm -c -I /usr/share/colm -b rlhcC -o rlhc.c /usr/share/colm/rlhc-c.lm make[4]: Leaving directory '/tmp/B.3pi6qc/BUILD/ragel-7.0.4/src/host-c' make[4]: Entering directory '/tmp/B.3pi6qc/BUILD/ragel-7.0.4/src/host-c' x86_64-pld-linux-g++ -DHAVE_CONFIG_H -I. -I../../src -I../../aapl -I../../ragel -I../../colm/include -I/usr/include/aapl -O2 -fwrapv -pipe -Wformat -Werror=format-security -gdwarf-4 -fno-debug-types-section -fvar-tracking-assignments -g2 -Wp,-D_FORTIFY_SOURCE=2 -fstack-protector-strong --param=ssp-buffer-size=4 -Werror=trampolines -fPIC -march=x86-64 -mtune=generic -gdwarf-4 -fno-debug-types-section -fvar-tracking-assignments -g2 -MT ragel_c-main.o -MD -MP -MF .deps/ragel_c-main.Tpo -c -o ragel_c-main.o `test -f 'main.cc' || echo './'`main.cc mv -f .deps/ragel_c-main.Tpo .deps/ragel_c-main.Po make[4]: Leaving directory '/tmp/B.3pi6qc/BUILD/ragel-7.0.4/src/host-c' make[4]: Entering directory '/tmp/B.3pi6qc/BUILD/ragel-7.0.4/src/host-c' x86_64-pld-linux-gcc -DHAVE_CONFIG_H -I. -I../../src -I../../aapl -I../../ragel -I../../colm/include -I/usr/include/aapl -O2 -fwrapv -pipe -Wformat -Werror=format-security -gdwarf-4 -fno-debug-types-section -fvar-tracking-assignments -g2 -Wp,-D_FORTIFY_SOURCE=2 -fstack-protector-strong --param=ssp-buffer-size=4 -Werror=trampolines -fPIC -march=x86-64 -mtune=generic -gdwarf-4 -fno-debug-types-section -fvar-tracking-assignments -g2 -MT ragel_c-rlhc.o -MD -MP -MF .deps/ragel_c-rlhc.Tpo -c -o ragel_c-rlhc.o `test -f 'rlhc.c' || echo './'`rlhc.c mv -f .deps/ragel_c-rlhc.Tpo .deps/ragel_c-rlhc.Po make[4]: Leaving directory '/tmp/B.3pi6qc/BUILD/ragel-7.0.4/src/host-c' make[4]: Entering directory '/tmp/B.3pi6qc/BUILD/ragel-7.0.4/src/host-c' x86_64-pld-linux-gcc -DHAVE_CONFIG_H -I. -I../../src -I../../aapl -I../../ragel -I../../colm/include -I/usr/include/aapl -O2 -fwrapv -pipe -Wformat -Werror=format-security -gdwarf-4 -fno-debug-types-section -fvar-tracking-assignments -g2 -Wp,-D_FORTIFY_SOURCE=2 -fstack-protector-strong --param=ssp-buffer-size=4 -Werror=trampolines -fPIC -march=x86-64 -mtune=generic -gdwarf-4 -fno-debug-types-section -fvar-tracking-assignments -g2 -MT ragel_c-rlparse.o -MD -MP -MF .deps/ragel_c-rlparse.Tpo -c -o ragel_c-rlparse.o `test -f 'rlparse.c' || echo './'`rlparse.c mv -f .deps/ragel_c-rlparse.Tpo .deps/ragel_c-rlparse.Po make[4]: Leaving directory '/tmp/B.3pi6qc/BUILD/ragel-7.0.4/src/host-c' make[4]: Entering directory '/tmp/B.3pi6qc/BUILD/ragel-7.0.4/src/host-c' x86_64-pld-linux-g++ -DHAVE_CONFIG_H -I. -I../../src -I../../aapl -I../../ragel -I../../colm/include -I/usr/include/aapl -O2 -fwrapv -pipe -Wformat -Werror=format-security -gdwarf-4 -fno-debug-types-section -fvar-tracking-assignments -g2 -Wp,-D_FORTIFY_SOURCE=2 -fstack-protector-strong --param=ssp-buffer-size=4 -Werror=trampolines -fPIC -march=x86-64 -mtune=generic -gdwarf-4 -fno-debug-types-section -fvar-tracking-assignments -g2 -MT ragel_c-rlreduce.o -MD -MP -MF .deps/ragel_c-rlreduce.Tpo -c -o ragel_c-rlreduce.o `test -f 'rlreduce.cc' || echo './'`rlreduce.cc mv -f .deps/ragel_c-rlreduce.Tpo .deps/ragel_c-rlreduce.Po make[4]: Leaving directory '/tmp/B.3pi6qc/BUILD/ragel-7.0.4/src/host-c' make[4]: Entering directory '/tmp/B.3pi6qc/BUILD/ragel-7.0.4/src/host-c' /bin/sh ../../libtool --tag=CXX --mode=link x86_64-pld-linux-g++ -O2 -fwrapv -pipe -Wformat -Werror=format-security -gdwarf-4 -fno-debug-types-section -fvar-tracking-assignments -g2 -Wp,-D_FORTIFY_SOURCE=2 -fstack-protector-strong --param=ssp-buffer-size=4 -Werror=trampolines -fPIC -march=x86-64 -mtune=generic -gdwarf-4 -fno-debug-types-section -fvar-tracking-assignments -g2 -Wl,--as-needed -Wl,--no-copy-dt-needed-entries -Wl,-z,relro -Wl,-z,combreloc -o ragel-c ragel_c-main.o ragel_c-rlhc.o ragel_c-rlparse.o ragel_c-rlreduce.o -lfsm -lcolm ../libragel.la libtool: link: x86_64-pld-linux-g++ -O2 -fwrapv -pipe -Wformat -Werror=format-security -gdwarf-4 -fno-debug-types-section -fvar-tracking-assignments -g2 -Wp,-D_FORTIFY_SOURCE=2 -fstack-protector-strong --param=ssp-buffer-size=4 -Werror=trampolines -fPIC -march=x86-64 -mtune=generic -gdwarf-4 -fno-debug-types-section -fvar-tracking-assignments -g2 -Wl,--as-needed -Wl,--no-copy-dt-needed-entries -Wl,-z -Wl,relro -Wl,-z -Wl,combreloc -o .libs/ragel-c ragel_c-main.o ragel_c-rlhc.o ragel_c-rlparse.o ragel_c-rlreduce.o -lfsm -lcolm ../.libs/libragel.so -Wl,-rpath -Wl,/usr/lib64 make[4]: Leaving directory '/tmp/B.3pi6qc/BUILD/ragel-7.0.4/src/host-c' Making all in host-d make[3]: Entering directory '/tmp/B.3pi6qc/BUILD/ragel-7.0.4/src/host-d' /usr/bin/colm -c -I /usr/share/colm -b rlhcD -o rlhc.c /usr/share/colm/rlhc-d.lm make[3]: Leaving directory '/tmp/B.3pi6qc/BUILD/ragel-7.0.4/src/host-d' make[3]: Entering directory '/tmp/B.3pi6qc/BUILD/ragel-7.0.4/src/host-d' /usr/bin/colm-wrap -c -I .. -b rlparseD -o rlparse.pack -p rlparse.c -m rlreduce.cc rlparse.lm make[3]: Leaving directory '/tmp/B.3pi6qc/BUILD/ragel-7.0.4/src/host-d' make[3]: Entering directory '/tmp/B.3pi6qc/BUILD/ragel-7.0.4/src/host-d' /usr/bin/colm-wrap -o rlreduce.cc rlparse.pack make[3]: Leaving directory '/tmp/B.3pi6qc/BUILD/ragel-7.0.4/src/host-d' make[3]: Entering directory '/tmp/B.3pi6qc/BUILD/ragel-7.0.4/src/host-d' /usr/bin/colm-wrap -o rlparse.c rlparse.pack make[3]: Leaving directory '/tmp/B.3pi6qc/BUILD/ragel-7.0.4/src/host-d' /usr/bin/make all-am make[4]: Entering directory '/tmp/B.3pi6qc/BUILD/ragel-7.0.4/src/host-d' x86_64-pld-linux-g++ -DHAVE_CONFIG_H -I. -I../../src -I../../aapl -I../../ragel -I../../colm/include -I/usr/include/aapl -O2 -fwrapv -pipe -Wformat -Werror=format-security -gdwarf-4 -fno-debug-types-section -fvar-tracking-assignments -g2 -Wp,-D_FORTIFY_SOURCE=2 -fstack-protector-strong --param=ssp-buffer-size=4 -Werror=trampolines -fPIC -march=x86-64 -mtune=generic -gdwarf-4 -fno-debug-types-section -fvar-tracking-assignments -g2 -MT ragel_d-main.o -MD -MP -MF .deps/ragel_d-main.Tpo -c -o ragel_d-main.o `test -f 'main.cc' || echo './'`main.cc mv -f .deps/ragel_d-main.Tpo .deps/ragel_d-main.Po make[4]: Leaving directory '/tmp/B.3pi6qc/BUILD/ragel-7.0.4/src/host-d' make[4]: Entering directory '/tmp/B.3pi6qc/BUILD/ragel-7.0.4/src/host-d' x86_64-pld-linux-gcc -DHAVE_CONFIG_H -I. -I../../src -I../../aapl -I../../ragel -I../../colm/include -I/usr/include/aapl -O2 -fwrapv -pipe -Wformat -Werror=format-security -gdwarf-4 -fno-debug-types-section -fvar-tracking-assignments -g2 -Wp,-D_FORTIFY_SOURCE=2 -fstack-protector-strong --param=ssp-buffer-size=4 -Werror=trampolines -fPIC -march=x86-64 -mtune=generic -gdwarf-4 -fno-debug-types-section -fvar-tracking-assignments -g2 -MT ragel_d-rlhc.o -MD -MP -MF .deps/ragel_d-rlhc.Tpo -c -o ragel_d-rlhc.o `test -f 'rlhc.c' || echo './'`rlhc.c mv -f .deps/ragel_d-rlhc.Tpo .deps/ragel_d-rlhc.Po make[4]: Leaving directory '/tmp/B.3pi6qc/BUILD/ragel-7.0.4/src/host-d' make[4]: Entering directory '/tmp/B.3pi6qc/BUILD/ragel-7.0.4/src/host-d' x86_64-pld-linux-gcc -DHAVE_CONFIG_H -I. -I../../src -I../../aapl -I../../ragel -I../../colm/include -I/usr/include/aapl -O2 -fwrapv -pipe -Wformat -Werror=format-security -gdwarf-4 -fno-debug-types-section -fvar-tracking-assignments -g2 -Wp,-D_FORTIFY_SOURCE=2 -fstack-protector-strong --param=ssp-buffer-size=4 -Werror=trampolines -fPIC -march=x86-64 -mtune=generic -gdwarf-4 -fno-debug-types-section -fvar-tracking-assignments -g2 -MT ragel_d-rlparse.o -MD -MP -MF .deps/ragel_d-rlparse.Tpo -c -o ragel_d-rlparse.o `test -f 'rlparse.c' || echo './'`rlparse.c mv -f .deps/ragel_d-rlparse.Tpo .deps/ragel_d-rlparse.Po make[4]: Leaving directory '/tmp/B.3pi6qc/BUILD/ragel-7.0.4/src/host-d' make[4]: Entering directory '/tmp/B.3pi6qc/BUILD/ragel-7.0.4/src/host-d' x86_64-pld-linux-g++ -DHAVE_CONFIG_H -I. -I../../src -I../../aapl -I../../ragel -I../../colm/include -I/usr/include/aapl -O2 -fwrapv -pipe -Wformat -Werror=format-security -gdwarf-4 -fno-debug-types-section -fvar-tracking-assignments -g2 -Wp,-D_FORTIFY_SOURCE=2 -fstack-protector-strong --param=ssp-buffer-size=4 -Werror=trampolines -fPIC -march=x86-64 -mtune=generic -gdwarf-4 -fno-debug-types-section -fvar-tracking-assignments -g2 -MT ragel_d-rlreduce.o -MD -MP -MF .deps/ragel_d-rlreduce.Tpo -c -o ragel_d-rlreduce.o `test -f 'rlreduce.cc' || echo './'`rlreduce.cc mv -f .deps/ragel_d-rlreduce.Tpo .deps/ragel_d-rlreduce.Po make[4]: Leaving directory '/tmp/B.3pi6qc/BUILD/ragel-7.0.4/src/host-d' make[4]: Entering directory '/tmp/B.3pi6qc/BUILD/ragel-7.0.4/src/host-d' /bin/sh ../../libtool --tag=CXX --mode=link x86_64-pld-linux-g++ -O2 -fwrapv -pipe -Wformat -Werror=format-security -gdwarf-4 -fno-debug-types-section -fvar-tracking-assignments -g2 -Wp,-D_FORTIFY_SOURCE=2 -fstack-protector-strong --param=ssp-buffer-size=4 -Werror=trampolines -fPIC -march=x86-64 -mtune=generic -gdwarf-4 -fno-debug-types-section -fvar-tracking-assignments -g2 -Wl,--as-needed -Wl,--no-copy-dt-needed-entries -Wl,-z,relro -Wl,-z,combreloc -o ragel-d ragel_d-main.o ragel_d-rlhc.o ragel_d-rlparse.o ragel_d-rlreduce.o -lfsm -lcolm ../libragel.la libtool: link: x86_64-pld-linux-g++ -O2 -fwrapv -pipe -Wformat -Werror=format-security -gdwarf-4 -fno-debug-types-section -fvar-tracking-assignments -g2 -Wp,-D_FORTIFY_SOURCE=2 -fstack-protector-strong --param=ssp-buffer-size=4 -Werror=trampolines -fPIC -march=x86-64 -mtune=generic -gdwarf-4 -fno-debug-types-section -fvar-tracking-assignments -g2 -Wl,--as-needed -Wl,--no-copy-dt-needed-entries -Wl,-z -Wl,relro -Wl,-z -Wl,combreloc -o .libs/ragel-d ragel_d-main.o ragel_d-rlhc.o ragel_d-rlparse.o ragel_d-rlreduce.o -lfsm -lcolm ../.libs/libragel.so -Wl,-rpath -Wl,/usr/lib64 make[4]: Leaving directory '/tmp/B.3pi6qc/BUILD/ragel-7.0.4/src/host-d' Making all in host-csharp make[3]: Entering directory '/tmp/B.3pi6qc/BUILD/ragel-7.0.4/src/host-csharp' /usr/bin/colm -c -I /usr/share/colm -b rlhcCSharp -o rlhc.c /usr/share/colm/rlhc-csharp.lm make[3]: Leaving directory '/tmp/B.3pi6qc/BUILD/ragel-7.0.4/src/host-csharp' make[3]: Entering directory '/tmp/B.3pi6qc/BUILD/ragel-7.0.4/src/host-csharp' /usr/bin/colm-wrap -c -I .. -b rlparseCSharp -o rlparse.pack -p rlparse.c -m rlreduce.cc rlparse.lm make[3]: Leaving directory '/tmp/B.3pi6qc/BUILD/ragel-7.0.4/src/host-csharp' make[3]: Entering directory '/tmp/B.3pi6qc/BUILD/ragel-7.0.4/src/host-csharp' /usr/bin/colm-wrap -o rlreduce.cc rlparse.pack make[3]: Leaving directory '/tmp/B.3pi6qc/BUILD/ragel-7.0.4/src/host-csharp' make[3]: Entering directory '/tmp/B.3pi6qc/BUILD/ragel-7.0.4/src/host-csharp' /usr/bin/colm-wrap -o rlparse.c rlparse.pack make[3]: Leaving directory '/tmp/B.3pi6qc/BUILD/ragel-7.0.4/src/host-csharp' /usr/bin/make all-am make[4]: Entering directory '/tmp/B.3pi6qc/BUILD/ragel-7.0.4/src/host-csharp' x86_64-pld-linux-g++ -DHAVE_CONFIG_H -I. -I../../src -I../../aapl -I../../ragel -I../../colm/include -I/usr/include/aapl -O2 -fwrapv -pipe -Wformat -Werror=format-security -gdwarf-4 -fno-debug-types-section -fvar-tracking-assignments -g2 -Wp,-D_FORTIFY_SOURCE=2 -fstack-protector-strong --param=ssp-buffer-size=4 -Werror=trampolines -fPIC -march=x86-64 -mtune=generic -gdwarf-4 -fno-debug-types-section -fvar-tracking-assignments -g2 -MT ragel_csharp-main.o -MD -MP -MF .deps/ragel_csharp-main.Tpo -c -o ragel_csharp-main.o `test -f 'main.cc' || echo './'`main.cc mv -f .deps/ragel_csharp-main.Tpo .deps/ragel_csharp-main.Po make[4]: Leaving directory '/tmp/B.3pi6qc/BUILD/ragel-7.0.4/src/host-csharp' make[4]: Entering directory '/tmp/B.3pi6qc/BUILD/ragel-7.0.4/src/host-csharp' x86_64-pld-linux-gcc -DHAVE_CONFIG_H -I. -I../../src -I../../aapl -I../../ragel -I../../colm/include -I/usr/include/aapl -O2 -fwrapv -pipe -Wformat -Werror=format-security -gdwarf-4 -fno-debug-types-section -fvar-tracking-assignments -g2 -Wp,-D_FORTIFY_SOURCE=2 -fstack-protector-strong --param=ssp-buffer-size=4 -Werror=trampolines -fPIC -march=x86-64 -mtune=generic -gdwarf-4 -fno-debug-types-section -fvar-tracking-assignments -g2 -MT ragel_csharp-rlhc.o -MD -MP -MF .deps/ragel_csharp-rlhc.Tpo -c -o ragel_csharp-rlhc.o `test -f 'rlhc.c' || echo './'`rlhc.c mv -f .deps/ragel_csharp-rlhc.Tpo .deps/ragel_csharp-rlhc.Po make[4]: Leaving directory '/tmp/B.3pi6qc/BUILD/ragel-7.0.4/src/host-csharp' make[4]: Entering directory '/tmp/B.3pi6qc/BUILD/ragel-7.0.4/src/host-csharp' x86_64-pld-linux-gcc -DHAVE_CONFIG_H -I. -I../../src -I../../aapl -I../../ragel -I../../colm/include -I/usr/include/aapl -O2 -fwrapv -pipe -Wformat -Werror=format-security -gdwarf-4 -fno-debug-types-section -fvar-tracking-assignments -g2 -Wp,-D_FORTIFY_SOURCE=2 -fstack-protector-strong --param=ssp-buffer-size=4 -Werror=trampolines -fPIC -march=x86-64 -mtune=generic -gdwarf-4 -fno-debug-types-section -fvar-tracking-assignments -g2 -MT ragel_csharp-rlparse.o -MD -MP -MF .deps/ragel_csharp-rlparse.Tpo -c -o ragel_csharp-rlparse.o `test -f 'rlparse.c' || echo './'`rlparse.c mv -f .deps/ragel_csharp-rlparse.Tpo .deps/ragel_csharp-rlparse.Po make[4]: Leaving directory '/tmp/B.3pi6qc/BUILD/ragel-7.0.4/src/host-csharp' make[4]: Entering directory '/tmp/B.3pi6qc/BUILD/ragel-7.0.4/src/host-csharp' x86_64-pld-linux-g++ -DHAVE_CONFIG_H -I. -I../../src -I../../aapl -I../../ragel -I../../colm/include -I/usr/include/aapl -O2 -fwrapv -pipe -Wformat -Werror=format-security -gdwarf-4 -fno-debug-types-section -fvar-tracking-assignments -g2 -Wp,-D_FORTIFY_SOURCE=2 -fstack-protector-strong --param=ssp-buffer-size=4 -Werror=trampolines -fPIC -march=x86-64 -mtune=generic -gdwarf-4 -fno-debug-types-section -fvar-tracking-assignments -g2 -MT ragel_csharp-rlreduce.o -MD -MP -MF .deps/ragel_csharp-rlreduce.Tpo -c -o ragel_csharp-rlreduce.o `test -f 'rlreduce.cc' || echo './'`rlreduce.cc mv -f .deps/ragel_csharp-rlreduce.Tpo .deps/ragel_csharp-rlreduce.Po make[4]: Leaving directory '/tmp/B.3pi6qc/BUILD/ragel-7.0.4/src/host-csharp' make[4]: Entering directory '/tmp/B.3pi6qc/BUILD/ragel-7.0.4/src/host-csharp' /bin/sh ../../libtool --tag=CXX --mode=link x86_64-pld-linux-g++ -O2 -fwrapv -pipe -Wformat -Werror=format-security -gdwarf-4 -fno-debug-types-section -fvar-tracking-assignments -g2 -Wp,-D_FORTIFY_SOURCE=2 -fstack-protector-strong --param=ssp-buffer-size=4 -Werror=trampolines -fPIC -march=x86-64 -mtune=generic -gdwarf-4 -fno-debug-types-section -fvar-tracking-assignments -g2 -Wl,--as-needed -Wl,--no-copy-dt-needed-entries -Wl,-z,relro -Wl,-z,combreloc -o ragel-csharp ragel_csharp-main.o ragel_csharp-rlhc.o ragel_csharp-rlparse.o ragel_csharp-rlreduce.o -lfsm -lcolm ../libragel.la libtool: link: x86_64-pld-linux-g++ -O2 -fwrapv -pipe -Wformat -Werror=format-security -gdwarf-4 -fno-debug-types-section -fvar-tracking-assignments -g2 -Wp,-D_FORTIFY_SOURCE=2 -fstack-protector-strong --param=ssp-buffer-size=4 -Werror=trampolines -fPIC -march=x86-64 -mtune=generic -gdwarf-4 -fno-debug-types-section -fvar-tracking-assignments -g2 -Wl,--as-needed -Wl,--no-copy-dt-needed-entries -Wl,-z -Wl,relro -Wl,-z -Wl,combreloc -o .libs/ragel-csharp ragel_csharp-main.o ragel_csharp-rlhc.o ragel_csharp-rlparse.o ragel_csharp-rlreduce.o -lfsm -lcolm ../.libs/libragel.so -Wl,-rpath -Wl,/usr/lib64 make[4]: Leaving directory '/tmp/B.3pi6qc/BUILD/ragel-7.0.4/src/host-csharp' Making all in host-go make[3]: Entering directory '/tmp/B.3pi6qc/BUILD/ragel-7.0.4/src/host-go' /usr/bin/colm -c -I /usr/share/colm -b rlhcGo -o rlhc.c /usr/share/colm/rlhc-go.lm make[3]: Leaving directory '/tmp/B.3pi6qc/BUILD/ragel-7.0.4/src/host-go' make[3]: Entering directory '/tmp/B.3pi6qc/BUILD/ragel-7.0.4/src/host-go' /usr/bin/colm-wrap -c -I .. -b rlparseGo -o rlparse.pack -p rlparse.c -m rlreduce.cc rlparse.lm make[3]: Leaving directory '/tmp/B.3pi6qc/BUILD/ragel-7.0.4/src/host-go' make[3]: Entering directory '/tmp/B.3pi6qc/BUILD/ragel-7.0.4/src/host-go' /usr/bin/colm-wrap -o rlreduce.cc rlparse.pack make[3]: Leaving directory '/tmp/B.3pi6qc/BUILD/ragel-7.0.4/src/host-go' make[3]: Entering directory '/tmp/B.3pi6qc/BUILD/ragel-7.0.4/src/host-go' /usr/bin/colm-wrap -o rlparse.c rlparse.pack make[3]: Leaving directory '/tmp/B.3pi6qc/BUILD/ragel-7.0.4/src/host-go' /usr/bin/make all-am make[4]: Entering directory '/tmp/B.3pi6qc/BUILD/ragel-7.0.4/src/host-go' x86_64-pld-linux-g++ -DHAVE_CONFIG_H -I. -I../../src -I../../aapl -I../../ragel -I../../colm/include -I/usr/include/aapl -O2 -fwrapv -pipe -Wformat -Werror=format-security -gdwarf-4 -fno-debug-types-section -fvar-tracking-assignments -g2 -Wp,-D_FORTIFY_SOURCE=2 -fstack-protector-strong --param=ssp-buffer-size=4 -Werror=trampolines -fPIC -march=x86-64 -mtune=generic -gdwarf-4 -fno-debug-types-section -fvar-tracking-assignments -g2 -MT ragel_go-main.o -MD -MP -MF .deps/ragel_go-main.Tpo -c -o ragel_go-main.o `test -f 'main.cc' || echo './'`main.cc mv -f .deps/ragel_go-main.Tpo .deps/ragel_go-main.Po make[4]: Leaving directory '/tmp/B.3pi6qc/BUILD/ragel-7.0.4/src/host-go' make[4]: Entering directory '/tmp/B.3pi6qc/BUILD/ragel-7.0.4/src/host-go' x86_64-pld-linux-gcc -DHAVE_CONFIG_H -I. -I../../src -I../../aapl -I../../ragel -I../../colm/include -I/usr/include/aapl -O2 -fwrapv -pipe -Wformat -Werror=format-security -gdwarf-4 -fno-debug-types-section -fvar-tracking-assignments -g2 -Wp,-D_FORTIFY_SOURCE=2 -fstack-protector-strong --param=ssp-buffer-size=4 -Werror=trampolines -fPIC -march=x86-64 -mtune=generic -gdwarf-4 -fno-debug-types-section -fvar-tracking-assignments -g2 -MT ragel_go-rlhc.o -MD -MP -MF .deps/ragel_go-rlhc.Tpo -c -o ragel_go-rlhc.o `test -f 'rlhc.c' || echo './'`rlhc.c mv -f .deps/ragel_go-rlhc.Tpo .deps/ragel_go-rlhc.Po make[4]: Leaving directory '/tmp/B.3pi6qc/BUILD/ragel-7.0.4/src/host-go' make[4]: Entering directory '/tmp/B.3pi6qc/BUILD/ragel-7.0.4/src/host-go' x86_64-pld-linux-gcc -DHAVE_CONFIG_H -I. -I../../src -I../../aapl -I../../ragel -I../../colm/include -I/usr/include/aapl -O2 -fwrapv -pipe -Wformat -Werror=format-security -gdwarf-4 -fno-debug-types-section -fvar-tracking-assignments -g2 -Wp,-D_FORTIFY_SOURCE=2 -fstack-protector-strong --param=ssp-buffer-size=4 -Werror=trampolines -fPIC -march=x86-64 -mtune=generic -gdwarf-4 -fno-debug-types-section -fvar-tracking-assignments -g2 -MT ragel_go-rlparse.o -MD -MP -MF .deps/ragel_go-rlparse.Tpo -c -o ragel_go-rlparse.o `test -f 'rlparse.c' || echo './'`rlparse.c mv -f .deps/ragel_go-rlparse.Tpo .deps/ragel_go-rlparse.Po make[4]: Leaving directory '/tmp/B.3pi6qc/BUILD/ragel-7.0.4/src/host-go' make[4]: Entering directory '/tmp/B.3pi6qc/BUILD/ragel-7.0.4/src/host-go' x86_64-pld-linux-g++ -DHAVE_CONFIG_H -I. -I../../src -I../../aapl -I../../ragel -I../../colm/include -I/usr/include/aapl -O2 -fwrapv -pipe -Wformat -Werror=format-security -gdwarf-4 -fno-debug-types-section -fvar-tracking-assignments -g2 -Wp,-D_FORTIFY_SOURCE=2 -fstack-protector-strong --param=ssp-buffer-size=4 -Werror=trampolines -fPIC -march=x86-64 -mtune=generic -gdwarf-4 -fno-debug-types-section -fvar-tracking-assignments -g2 -MT ragel_go-rlreduce.o -MD -MP -MF .deps/ragel_go-rlreduce.Tpo -c -o ragel_go-rlreduce.o `test -f 'rlreduce.cc' || echo './'`rlreduce.cc mv -f .deps/ragel_go-rlreduce.Tpo .deps/ragel_go-rlreduce.Po make[4]: Leaving directory '/tmp/B.3pi6qc/BUILD/ragel-7.0.4/src/host-go' make[4]: Entering directory '/tmp/B.3pi6qc/BUILD/ragel-7.0.4/src/host-go' /bin/sh ../../libtool --tag=CXX --mode=link x86_64-pld-linux-g++ -O2 -fwrapv -pipe -Wformat -Werror=format-security -gdwarf-4 -fno-debug-types-section -fvar-tracking-assignments -g2 -Wp,-D_FORTIFY_SOURCE=2 -fstack-protector-strong --param=ssp-buffer-size=4 -Werror=trampolines -fPIC -march=x86-64 -mtune=generic -gdwarf-4 -fno-debug-types-section -fvar-tracking-assignments -g2 -Wl,--as-needed -Wl,--no-copy-dt-needed-entries -Wl,-z,relro -Wl,-z,combreloc -o ragel-go ragel_go-main.o ragel_go-rlhc.o ragel_go-rlparse.o ragel_go-rlreduce.o -lfsm -lcolm ../libragel.la libtool: link: x86_64-pld-linux-g++ -O2 -fwrapv -pipe -Wformat -Werror=format-security -gdwarf-4 -fno-debug-types-section -fvar-tracking-assignments -g2 -Wp,-D_FORTIFY_SOURCE=2 -fstack-protector-strong --param=ssp-buffer-size=4 -Werror=trampolines -fPIC -march=x86-64 -mtune=generic -gdwarf-4 -fno-debug-types-section -fvar-tracking-assignments -g2 -Wl,--as-needed -Wl,--no-copy-dt-needed-entries -Wl,-z -Wl,relro -Wl,-z -Wl,combreloc -o .libs/ragel-go ragel_go-main.o ragel_go-rlhc.o ragel_go-rlparse.o ragel_go-rlreduce.o -lfsm -lcolm ../.libs/libragel.so -Wl,-rpath -Wl,/usr/lib64 make[4]: Leaving directory '/tmp/B.3pi6qc/BUILD/ragel-7.0.4/src/host-go' Making all in host-java make[3]: Entering directory '/tmp/B.3pi6qc/BUILD/ragel-7.0.4/src/host-java' /usr/bin/colm -c -I /usr/share/colm -b rlhcJava -o rlhc.c /usr/share/colm/rlhc-java.lm make[3]: Leaving directory '/tmp/B.3pi6qc/BUILD/ragel-7.0.4/src/host-java' make[3]: Entering directory '/tmp/B.3pi6qc/BUILD/ragel-7.0.4/src/host-java' /usr/bin/colm-wrap -c -I .. -b rlparseJava -o rlparse.pack -p rlparse.c -m rlreduce.cc rlparse.lm make[3]: Leaving directory '/tmp/B.3pi6qc/BUILD/ragel-7.0.4/src/host-java' make[3]: Entering directory '/tmp/B.3pi6qc/BUILD/ragel-7.0.4/src/host-java' /usr/bin/colm-wrap -o rlreduce.cc rlparse.pack make[3]: Leaving directory '/tmp/B.3pi6qc/BUILD/ragel-7.0.4/src/host-java' make[3]: Entering directory '/tmp/B.3pi6qc/BUILD/ragel-7.0.4/src/host-java' /usr/bin/colm-wrap -o rlparse.c rlparse.pack make[3]: Leaving directory '/tmp/B.3pi6qc/BUILD/ragel-7.0.4/src/host-java' /usr/bin/make all-am make[4]: Entering directory '/tmp/B.3pi6qc/BUILD/ragel-7.0.4/src/host-java' x86_64-pld-linux-g++ -DHAVE_CONFIG_H -I. -I../../src -I../../aapl -I../../ragel -I../../colm/include -I/usr/include/aapl -O2 -fwrapv -pipe -Wformat -Werror=format-security -gdwarf-4 -fno-debug-types-section -fvar-tracking-assignments -g2 -Wp,-D_FORTIFY_SOURCE=2 -fstack-protector-strong --param=ssp-buffer-size=4 -Werror=trampolines -fPIC -march=x86-64 -mtune=generic -gdwarf-4 -fno-debug-types-section -fvar-tracking-assignments -g2 -MT ragel_java-main.o -MD -MP -MF .deps/ragel_java-main.Tpo -c -o ragel_java-main.o `test -f 'main.cc' || echo './'`main.cc mv -f .deps/ragel_java-main.Tpo .deps/ragel_java-main.Po make[4]: Leaving directory '/tmp/B.3pi6qc/BUILD/ragel-7.0.4/src/host-java' make[4]: Entering directory '/tmp/B.3pi6qc/BUILD/ragel-7.0.4/src/host-java' x86_64-pld-linux-gcc -DHAVE_CONFIG_H -I. -I../../src -I../../aapl -I../../ragel -I../../colm/include -I/usr/include/aapl -O2 -fwrapv -pipe -Wformat -Werror=format-security -gdwarf-4 -fno-debug-types-section -fvar-tracking-assignments -g2 -Wp,-D_FORTIFY_SOURCE=2 -fstack-protector-strong --param=ssp-buffer-size=4 -Werror=trampolines -fPIC -march=x86-64 -mtune=generic -gdwarf-4 -fno-debug-types-section -fvar-tracking-assignments -g2 -MT ragel_java-rlhc.o -MD -MP -MF .deps/ragel_java-rlhc.Tpo -c -o ragel_java-rlhc.o `test -f 'rlhc.c' || echo './'`rlhc.c mv -f .deps/ragel_java-rlhc.Tpo .deps/ragel_java-rlhc.Po make[4]: Leaving directory '/tmp/B.3pi6qc/BUILD/ragel-7.0.4/src/host-java' make[4]: Entering directory '/tmp/B.3pi6qc/BUILD/ragel-7.0.4/src/host-java' x86_64-pld-linux-gcc -DHAVE_CONFIG_H -I. -I../../src -I../../aapl -I../../ragel -I../../colm/include -I/usr/include/aapl -O2 -fwrapv -pipe -Wformat -Werror=format-security -gdwarf-4 -fno-debug-types-section -fvar-tracking-assignments -g2 -Wp,-D_FORTIFY_SOURCE=2 -fstack-protector-strong --param=ssp-buffer-size=4 -Werror=trampolines -fPIC -march=x86-64 -mtune=generic -gdwarf-4 -fno-debug-types-section -fvar-tracking-assignments -g2 -MT ragel_java-rlparse.o -MD -MP -MF .deps/ragel_java-rlparse.Tpo -c -o ragel_java-rlparse.o `test -f 'rlparse.c' || echo './'`rlparse.c mv -f .deps/ragel_java-rlparse.Tpo .deps/ragel_java-rlparse.Po make[4]: Leaving directory '/tmp/B.3pi6qc/BUILD/ragel-7.0.4/src/host-java' make[4]: Entering directory '/tmp/B.3pi6qc/BUILD/ragel-7.0.4/src/host-java' x86_64-pld-linux-g++ -DHAVE_CONFIG_H -I. -I../../src -I../../aapl -I../../ragel -I../../colm/include -I/usr/include/aapl -O2 -fwrapv -pipe -Wformat -Werror=format-security -gdwarf-4 -fno-debug-types-section -fvar-tracking-assignments -g2 -Wp,-D_FORTIFY_SOURCE=2 -fstack-protector-strong --param=ssp-buffer-size=4 -Werror=trampolines -fPIC -march=x86-64 -mtune=generic -gdwarf-4 -fno-debug-types-section -fvar-tracking-assignments -g2 -MT ragel_java-rlreduce.o -MD -MP -MF .deps/ragel_java-rlreduce.Tpo -c -o ragel_java-rlreduce.o `test -f 'rlreduce.cc' || echo './'`rlreduce.cc mv -f .deps/ragel_java-rlreduce.Tpo .deps/ragel_java-rlreduce.Po make[4]: Leaving directory '/tmp/B.3pi6qc/BUILD/ragel-7.0.4/src/host-java' make[4]: Entering directory '/tmp/B.3pi6qc/BUILD/ragel-7.0.4/src/host-java' /bin/sh ../../libtool --tag=CXX --mode=link x86_64-pld-linux-g++ -O2 -fwrapv -pipe -Wformat -Werror=format-security -gdwarf-4 -fno-debug-types-section -fvar-tracking-assignments -g2 -Wp,-D_FORTIFY_SOURCE=2 -fstack-protector-strong --param=ssp-buffer-size=4 -Werror=trampolines -fPIC -march=x86-64 -mtune=generic -gdwarf-4 -fno-debug-types-section -fvar-tracking-assignments -g2 -Wl,--as-needed -Wl,--no-copy-dt-needed-entries -Wl,-z,relro -Wl,-z,combreloc -o ragel-java ragel_java-main.o ragel_java-rlhc.o ragel_java-rlparse.o ragel_java-rlreduce.o -lfsm -lcolm ../libragel.la libtool: link: x86_64-pld-linux-g++ -O2 -fwrapv -pipe -Wformat -Werror=format-security -gdwarf-4 -fno-debug-types-section -fvar-tracking-assignments -g2 -Wp,-D_FORTIFY_SOURCE=2 -fstack-protector-strong --param=ssp-buffer-size=4 -Werror=trampolines -fPIC -march=x86-64 -mtune=generic -gdwarf-4 -fno-debug-types-section -fvar-tracking-assignments -g2 -Wl,--as-needed -Wl,--no-copy-dt-needed-entries -Wl,-z -Wl,relro -Wl,-z -Wl,combreloc -o .libs/ragel-java ragel_java-main.o ragel_java-rlhc.o ragel_java-rlparse.o ragel_java-rlreduce.o -lfsm -lcolm ../.libs/libragel.so -Wl,-rpath -Wl,/usr/lib64 make[4]: Leaving directory '/tmp/B.3pi6qc/BUILD/ragel-7.0.4/src/host-java' Making all in host-rust make[3]: Entering directory '/tmp/B.3pi6qc/BUILD/ragel-7.0.4/src/host-rust' /usr/bin/colm -c -I /usr/share/colm -b rlhcRust -o rlhc.c /usr/share/colm/rlhc-rust.lm make[3]: Leaving directory '/tmp/B.3pi6qc/BUILD/ragel-7.0.4/src/host-rust' make[3]: Entering directory '/tmp/B.3pi6qc/BUILD/ragel-7.0.4/src/host-rust' /usr/bin/colm-wrap -c -I .. -b rlparseRust -o rlparse.pack -p rlparse.c -m rlreduce.cc rlparse.lm make[3]: Leaving directory '/tmp/B.3pi6qc/BUILD/ragel-7.0.4/src/host-rust' make[3]: Entering directory '/tmp/B.3pi6qc/BUILD/ragel-7.0.4/src/host-rust' /usr/bin/colm-wrap -o rlreduce.cc rlparse.pack make[3]: Leaving directory '/tmp/B.3pi6qc/BUILD/ragel-7.0.4/src/host-rust' make[3]: Entering directory '/tmp/B.3pi6qc/BUILD/ragel-7.0.4/src/host-rust' /usr/bin/colm-wrap -o rlparse.c rlparse.pack make[3]: Leaving directory '/tmp/B.3pi6qc/BUILD/ragel-7.0.4/src/host-rust' /usr/bin/make all-am make[4]: Entering directory '/tmp/B.3pi6qc/BUILD/ragel-7.0.4/src/host-rust' x86_64-pld-linux-g++ -DHAVE_CONFIG_H -I. -I../../src -I../../aapl -I../../ragel -I../../colm/include -I/usr/include/aapl -O2 -fwrapv -pipe -Wformat -Werror=format-security -gdwarf-4 -fno-debug-types-section -fvar-tracking-assignments -g2 -Wp,-D_FORTIFY_SOURCE=2 -fstack-protector-strong --param=ssp-buffer-size=4 -Werror=trampolines -fPIC -march=x86-64 -mtune=generic -gdwarf-4 -fno-debug-types-section -fvar-tracking-assignments -g2 -MT ragel_rust-main.o -MD -MP -MF .deps/ragel_rust-main.Tpo -c -o ragel_rust-main.o `test -f 'main.cc' || echo './'`main.cc mv -f .deps/ragel_rust-main.Tpo .deps/ragel_rust-main.Po make[4]: Leaving directory '/tmp/B.3pi6qc/BUILD/ragel-7.0.4/src/host-rust' make[4]: Entering directory '/tmp/B.3pi6qc/BUILD/ragel-7.0.4/src/host-rust' x86_64-pld-linux-gcc -DHAVE_CONFIG_H -I. -I../../src -I../../aapl -I../../ragel -I../../colm/include -I/usr/include/aapl -O2 -fwrapv -pipe -Wformat -Werror=format-security -gdwarf-4 -fno-debug-types-section -fvar-tracking-assignments -g2 -Wp,-D_FORTIFY_SOURCE=2 -fstack-protector-strong --param=ssp-buffer-size=4 -Werror=trampolines -fPIC -march=x86-64 -mtune=generic -gdwarf-4 -fno-debug-types-section -fvar-tracking-assignments -g2 -MT ragel_rust-rlhc.o -MD -MP -MF .deps/ragel_rust-rlhc.Tpo -c -o ragel_rust-rlhc.o `test -f 'rlhc.c' || echo './'`rlhc.c mv -f .deps/ragel_rust-rlhc.Tpo .deps/ragel_rust-rlhc.Po make[4]: Leaving directory '/tmp/B.3pi6qc/BUILD/ragel-7.0.4/src/host-rust' make[4]: Entering directory '/tmp/B.3pi6qc/BUILD/ragel-7.0.4/src/host-rust' x86_64-pld-linux-gcc -DHAVE_CONFIG_H -I. -I../../src -I../../aapl -I../../ragel -I../../colm/include -I/usr/include/aapl -O2 -fwrapv -pipe -Wformat -Werror=format-security -gdwarf-4 -fno-debug-types-section -fvar-tracking-assignments -g2 -Wp,-D_FORTIFY_SOURCE=2 -fstack-protector-strong --param=ssp-buffer-size=4 -Werror=trampolines -fPIC -march=x86-64 -mtune=generic -gdwarf-4 -fno-debug-types-section -fvar-tracking-assignments -g2 -MT ragel_rust-rlparse.o -MD -MP -MF .deps/ragel_rust-rlparse.Tpo -c -o ragel_rust-rlparse.o `test -f 'rlparse.c' || echo './'`rlparse.c mv -f .deps/ragel_rust-rlparse.Tpo .deps/ragel_rust-rlparse.Po make[4]: Leaving directory '/tmp/B.3pi6qc/BUILD/ragel-7.0.4/src/host-rust' make[4]: Entering directory '/tmp/B.3pi6qc/BUILD/ragel-7.0.4/src/host-rust' x86_64-pld-linux-g++ -DHAVE_CONFIG_H -I. -I../../src -I../../aapl -I../../ragel -I../../colm/include -I/usr/include/aapl -O2 -fwrapv -pipe -Wformat -Werror=format-security -gdwarf-4 -fno-debug-types-section -fvar-tracking-assignments -g2 -Wp,-D_FORTIFY_SOURCE=2 -fstack-protector-strong --param=ssp-buffer-size=4 -Werror=trampolines -fPIC -march=x86-64 -mtune=generic -gdwarf-4 -fno-debug-types-section -fvar-tracking-assignments -g2 -MT ragel_rust-rlreduce.o -MD -MP -MF .deps/ragel_rust-rlreduce.Tpo -c -o ragel_rust-rlreduce.o `test -f 'rlreduce.cc' || echo './'`rlreduce.cc mv -f .deps/ragel_rust-rlreduce.Tpo .deps/ragel_rust-rlreduce.Po make[4]: Leaving directory '/tmp/B.3pi6qc/BUILD/ragel-7.0.4/src/host-rust' make[4]: Entering directory '/tmp/B.3pi6qc/BUILD/ragel-7.0.4/src/host-rust' /bin/sh ../../libtool --tag=CXX --mode=link x86_64-pld-linux-g++ -O2 -fwrapv -pipe -Wformat -Werror=format-security -gdwarf-4 -fno-debug-types-section -fvar-tracking-assignments -g2 -Wp,-D_FORTIFY_SOURCE=2 -fstack-protector-strong --param=ssp-buffer-size=4 -Werror=trampolines -fPIC -march=x86-64 -mtune=generic -gdwarf-4 -fno-debug-types-section -fvar-tracking-assignments -g2 -Wl,--as-needed -Wl,--no-copy-dt-needed-entries -Wl,-z,relro -Wl,-z,combreloc -o ragel-rust ragel_rust-main.o ragel_rust-rlhc.o ragel_rust-rlparse.o ragel_rust-rlreduce.o -lfsm -lcolm ../libragel.la libtool: link: x86_64-pld-linux-g++ -O2 -fwrapv -pipe -Wformat -Werror=format-security -gdwarf-4 -fno-debug-types-section -fvar-tracking-assignments -g2 -Wp,-D_FORTIFY_SOURCE=2 -fstack-protector-strong --param=ssp-buffer-size=4 -Werror=trampolines -fPIC -march=x86-64 -mtune=generic -gdwarf-4 -fno-debug-types-section -fvar-tracking-assignments -g2 -Wl,--as-needed -Wl,--no-copy-dt-needed-entries -Wl,-z -Wl,relro -Wl,-z -Wl,combreloc -o .libs/ragel-rust ragel_rust-main.o ragel_rust-rlhc.o ragel_rust-rlparse.o ragel_rust-rlreduce.o -lfsm -lcolm ../.libs/libragel.so -Wl,-rpath -Wl,/usr/lib64 make[4]: Leaving directory '/tmp/B.3pi6qc/BUILD/ragel-7.0.4/src/host-rust' Making all in host-crack make[3]: Entering directory '/tmp/B.3pi6qc/BUILD/ragel-7.0.4/src/host-crack' /usr/bin/colm -c -I /usr/share/colm -b rlhcCrack -o rlhc.c /usr/share/colm/rlhc-crack.lm make[3]: Leaving directory '/tmp/B.3pi6qc/BUILD/ragel-7.0.4/src/host-crack' make[3]: Entering directory '/tmp/B.3pi6qc/BUILD/ragel-7.0.4/src/host-crack' /usr/bin/colm-wrap -c -I .. -b rlparseCrack -o rlparse.pack -p rlparse.c -m rlreduce.cc rlparse.lm make[3]: Leaving directory '/tmp/B.3pi6qc/BUILD/ragel-7.0.4/src/host-crack' make[3]: Entering directory '/tmp/B.3pi6qc/BUILD/ragel-7.0.4/src/host-crack' /usr/bin/colm-wrap -o rlreduce.cc rlparse.pack make[3]: Leaving directory '/tmp/B.3pi6qc/BUILD/ragel-7.0.4/src/host-crack' make[3]: Entering directory '/tmp/B.3pi6qc/BUILD/ragel-7.0.4/src/host-crack' /usr/bin/colm-wrap -o rlparse.c rlparse.pack make[3]: Leaving directory '/tmp/B.3pi6qc/BUILD/ragel-7.0.4/src/host-crack' /usr/bin/make all-am make[4]: Entering directory '/tmp/B.3pi6qc/BUILD/ragel-7.0.4/src/host-crack' x86_64-pld-linux-g++ -DHAVE_CONFIG_H -I. -I../../src -I../../aapl -I../../ragel -I../../colm/include -I/usr/include/aapl -O2 -fwrapv -pipe -Wformat -Werror=format-security -gdwarf-4 -fno-debug-types-section -fvar-tracking-assignments -g2 -Wp,-D_FORTIFY_SOURCE=2 -fstack-protector-strong --param=ssp-buffer-size=4 -Werror=trampolines -fPIC -march=x86-64 -mtune=generic -gdwarf-4 -fno-debug-types-section -fvar-tracking-assignments -g2 -MT ragel_crack-main.o -MD -MP -MF .deps/ragel_crack-main.Tpo -c -o ragel_crack-main.o `test -f 'main.cc' || echo './'`main.cc mv -f .deps/ragel_crack-main.Tpo .deps/ragel_crack-main.Po make[4]: Leaving directory '/tmp/B.3pi6qc/BUILD/ragel-7.0.4/src/host-crack' make[4]: Entering directory '/tmp/B.3pi6qc/BUILD/ragel-7.0.4/src/host-crack' x86_64-pld-linux-gcc -DHAVE_CONFIG_H -I. -I../../src -I../../aapl -I../../ragel -I../../colm/include -I/usr/include/aapl -O2 -fwrapv -pipe -Wformat -Werror=format-security -gdwarf-4 -fno-debug-types-section -fvar-tracking-assignments -g2 -Wp,-D_FORTIFY_SOURCE=2 -fstack-protector-strong --param=ssp-buffer-size=4 -Werror=trampolines -fPIC -march=x86-64 -mtune=generic -gdwarf-4 -fno-debug-types-section -fvar-tracking-assignments -g2 -MT ragel_crack-rlhc.o -MD -MP -MF .deps/ragel_crack-rlhc.Tpo -c -o ragel_crack-rlhc.o `test -f 'rlhc.c' || echo './'`rlhc.c mv -f .deps/ragel_crack-rlhc.Tpo .deps/ragel_crack-rlhc.Po make[4]: Leaving directory '/tmp/B.3pi6qc/BUILD/ragel-7.0.4/src/host-crack' make[4]: Entering directory '/tmp/B.3pi6qc/BUILD/ragel-7.0.4/src/host-crack' x86_64-pld-linux-gcc -DHAVE_CONFIG_H -I. -I../../src -I../../aapl -I../../ragel -I../../colm/include -I/usr/include/aapl -O2 -fwrapv -pipe -Wformat -Werror=format-security -gdwarf-4 -fno-debug-types-section -fvar-tracking-assignments -g2 -Wp,-D_FORTIFY_SOURCE=2 -fstack-protector-strong --param=ssp-buffer-size=4 -Werror=trampolines -fPIC -march=x86-64 -mtune=generic -gdwarf-4 -fno-debug-types-section -fvar-tracking-assignments -g2 -MT ragel_crack-rlparse.o -MD -MP -MF .deps/ragel_crack-rlparse.Tpo -c -o ragel_crack-rlparse.o `test -f 'rlparse.c' || echo './'`rlparse.c mv -f .deps/ragel_crack-rlparse.Tpo .deps/ragel_crack-rlparse.Po make[4]: Leaving directory '/tmp/B.3pi6qc/BUILD/ragel-7.0.4/src/host-crack' make[4]: Entering directory '/tmp/B.3pi6qc/BUILD/ragel-7.0.4/src/host-crack' x86_64-pld-linux-g++ -DHAVE_CONFIG_H -I. -I../../src -I../../aapl -I../../ragel -I../../colm/include -I/usr/include/aapl -O2 -fwrapv -pipe -Wformat -Werror=format-security -gdwarf-4 -fno-debug-types-section -fvar-tracking-assignments -g2 -Wp,-D_FORTIFY_SOURCE=2 -fstack-protector-strong --param=ssp-buffer-size=4 -Werror=trampolines -fPIC -march=x86-64 -mtune=generic -gdwarf-4 -fno-debug-types-section -fvar-tracking-assignments -g2 -MT ragel_crack-rlreduce.o -MD -MP -MF .deps/ragel_crack-rlreduce.Tpo -c -o ragel_crack-rlreduce.o `test -f 'rlreduce.cc' || echo './'`rlreduce.cc mv -f .deps/ragel_crack-rlreduce.Tpo .deps/ragel_crack-rlreduce.Po make[4]: Leaving directory '/tmp/B.3pi6qc/BUILD/ragel-7.0.4/src/host-crack' make[4]: Entering directory '/tmp/B.3pi6qc/BUILD/ragel-7.0.4/src/host-crack' /bin/sh ../../libtool --tag=CXX --mode=link x86_64-pld-linux-g++ -O2 -fwrapv -pipe -Wformat -Werror=format-security -gdwarf-4 -fno-debug-types-section -fvar-tracking-assignments -g2 -Wp,-D_FORTIFY_SOURCE=2 -fstack-protector-strong --param=ssp-buffer-size=4 -Werror=trampolines -fPIC -march=x86-64 -mtune=generic -gdwarf-4 -fno-debug-types-section -fvar-tracking-assignments -g2 -Wl,--as-needed -Wl,--no-copy-dt-needed-entries -Wl,-z,relro -Wl,-z,combreloc -o ragel-crack ragel_crack-main.o ragel_crack-rlhc.o ragel_crack-rlparse.o ragel_crack-rlreduce.o -lfsm -lcolm ../libragel.la libtool: link: x86_64-pld-linux-g++ -O2 -fwrapv -pipe -Wformat -Werror=format-security -gdwarf-4 -fno-debug-types-section -fvar-tracking-assignments -g2 -Wp,-D_FORTIFY_SOURCE=2 -fstack-protector-strong --param=ssp-buffer-size=4 -Werror=trampolines -fPIC -march=x86-64 -mtune=generic -gdwarf-4 -fno-debug-types-section -fvar-tracking-assignments -g2 -Wl,--as-needed -Wl,--no-copy-dt-needed-entries -Wl,-z -Wl,relro -Wl,-z -Wl,combreloc -o .libs/ragel-crack ragel_crack-main.o ragel_crack-rlhc.o ragel_crack-rlparse.o ragel_crack-rlreduce.o -lfsm -lcolm ../.libs/libragel.so -Wl,-rpath -Wl,/usr/lib64 make[4]: Leaving directory '/tmp/B.3pi6qc/BUILD/ragel-7.0.4/src/host-crack' Making all in host-js make[3]: Entering directory '/tmp/B.3pi6qc/BUILD/ragel-7.0.4/src/host-js' /usr/bin/colm -c -I /usr/share/colm -b rlhcJs -o rlhc.c /usr/share/colm/rlhc-js.lm make[3]: Leaving directory '/tmp/B.3pi6qc/BUILD/ragel-7.0.4/src/host-js' make[3]: Entering directory '/tmp/B.3pi6qc/BUILD/ragel-7.0.4/src/host-js' /usr/bin/colm-wrap -c -I .. -b rlparseJs -o rlparse.pack -p rlparse.c -m rlreduce.cc rlparse.lm make[3]: Leaving directory '/tmp/B.3pi6qc/BUILD/ragel-7.0.4/src/host-js' make[3]: Entering directory '/tmp/B.3pi6qc/BUILD/ragel-7.0.4/src/host-js' /usr/bin/colm-wrap -o rlreduce.cc rlparse.pack make[3]: Leaving directory '/tmp/B.3pi6qc/BUILD/ragel-7.0.4/src/host-js' make[3]: Entering directory '/tmp/B.3pi6qc/BUILD/ragel-7.0.4/src/host-js' /usr/bin/colm-wrap -o rlparse.c rlparse.pack make[3]: Leaving directory '/tmp/B.3pi6qc/BUILD/ragel-7.0.4/src/host-js' /usr/bin/make all-am make[4]: Entering directory '/tmp/B.3pi6qc/BUILD/ragel-7.0.4/src/host-js' x86_64-pld-linux-g++ -DHAVE_CONFIG_H -I. -I../../src -I../../aapl -I../../ragel -I../../colm/include -I/usr/include/aapl -O2 -fwrapv -pipe -Wformat -Werror=format-security -gdwarf-4 -fno-debug-types-section -fvar-tracking-assignments -g2 -Wp,-D_FORTIFY_SOURCE=2 -fstack-protector-strong --param=ssp-buffer-size=4 -Werror=trampolines -fPIC -march=x86-64 -mtune=generic -gdwarf-4 -fno-debug-types-section -fvar-tracking-assignments -g2 -MT ragel_js-main.o -MD -MP -MF .deps/ragel_js-main.Tpo -c -o ragel_js-main.o `test -f 'main.cc' || echo './'`main.cc mv -f .deps/ragel_js-main.Tpo .deps/ragel_js-main.Po make[4]: Leaving directory '/tmp/B.3pi6qc/BUILD/ragel-7.0.4/src/host-js' make[4]: Entering directory '/tmp/B.3pi6qc/BUILD/ragel-7.0.4/src/host-js' x86_64-pld-linux-gcc -DHAVE_CONFIG_H -I. -I../../src -I../../aapl -I../../ragel -I../../colm/include -I/usr/include/aapl -O2 -fwrapv -pipe -Wformat -Werror=format-security -gdwarf-4 -fno-debug-types-section -fvar-tracking-assignments -g2 -Wp,-D_FORTIFY_SOURCE=2 -fstack-protector-strong --param=ssp-buffer-size=4 -Werror=trampolines -fPIC -march=x86-64 -mtune=generic -gdwarf-4 -fno-debug-types-section -fvar-tracking-assignments -g2 -MT ragel_js-rlhc.o -MD -MP -MF .deps/ragel_js-rlhc.Tpo -c -o ragel_js-rlhc.o `test -f 'rlhc.c' || echo './'`rlhc.c mv -f .deps/ragel_js-rlhc.Tpo .deps/ragel_js-rlhc.Po make[4]: Leaving directory '/tmp/B.3pi6qc/BUILD/ragel-7.0.4/src/host-js' make[4]: Entering directory '/tmp/B.3pi6qc/BUILD/ragel-7.0.4/src/host-js' x86_64-pld-linux-gcc -DHAVE_CONFIG_H -I. -I../../src -I../../aapl -I../../ragel -I../../colm/include -I/usr/include/aapl -O2 -fwrapv -pipe -Wformat -Werror=format-security -gdwarf-4 -fno-debug-types-section -fvar-tracking-assignments -g2 -Wp,-D_FORTIFY_SOURCE=2 -fstack-protector-strong --param=ssp-buffer-size=4 -Werror=trampolines -fPIC -march=x86-64 -mtune=generic -gdwarf-4 -fno-debug-types-section -fvar-tracking-assignments -g2 -MT ragel_js-rlparse.o -MD -MP -MF .deps/ragel_js-rlparse.Tpo -c -o ragel_js-rlparse.o `test -f 'rlparse.c' || echo './'`rlparse.c mv -f .deps/ragel_js-rlparse.Tpo .deps/ragel_js-rlparse.Po make[4]: Leaving directory '/tmp/B.3pi6qc/BUILD/ragel-7.0.4/src/host-js' make[4]: Entering directory '/tmp/B.3pi6qc/BUILD/ragel-7.0.4/src/host-js' x86_64-pld-linux-g++ -DHAVE_CONFIG_H -I. -I../../src -I../../aapl -I../../ragel -I../../colm/include -I/usr/include/aapl -O2 -fwrapv -pipe -Wformat -Werror=format-security -gdwarf-4 -fno-debug-types-section -fvar-tracking-assignments -g2 -Wp,-D_FORTIFY_SOURCE=2 -fstack-protector-strong --param=ssp-buffer-size=4 -Werror=trampolines -fPIC -march=x86-64 -mtune=generic -gdwarf-4 -fno-debug-types-section -fvar-tracking-assignments -g2 -MT ragel_js-rlreduce.o -MD -MP -MF .deps/ragel_js-rlreduce.Tpo -c -o ragel_js-rlreduce.o `test -f 'rlreduce.cc' || echo './'`rlreduce.cc mv -f .deps/ragel_js-rlreduce.Tpo .deps/ragel_js-rlreduce.Po make[4]: Leaving directory '/tmp/B.3pi6qc/BUILD/ragel-7.0.4/src/host-js' make[4]: Entering directory '/tmp/B.3pi6qc/BUILD/ragel-7.0.4/src/host-js' /bin/sh ../../libtool --tag=CXX --mode=link x86_64-pld-linux-g++ -O2 -fwrapv -pipe -Wformat -Werror=format-security -gdwarf-4 -fno-debug-types-section -fvar-tracking-assignments -g2 -Wp,-D_FORTIFY_SOURCE=2 -fstack-protector-strong --param=ssp-buffer-size=4 -Werror=trampolines -fPIC -march=x86-64 -mtune=generic -gdwarf-4 -fno-debug-types-section -fvar-tracking-assignments -g2 -Wl,--as-needed -Wl,--no-copy-dt-needed-entries -Wl,-z,relro -Wl,-z,combreloc -o ragel-js ragel_js-main.o ragel_js-rlhc.o ragel_js-rlparse.o ragel_js-rlreduce.o -lfsm -lcolm ../libragel.la libtool: link: x86_64-pld-linux-g++ -O2 -fwrapv -pipe -Wformat -Werror=format-security -gdwarf-4 -fno-debug-types-section -fvar-tracking-assignments -g2 -Wp,-D_FORTIFY_SOURCE=2 -fstack-protector-strong --param=ssp-buffer-size=4 -Werror=trampolines -fPIC -march=x86-64 -mtune=generic -gdwarf-4 -fno-debug-types-section -fvar-tracking-assignments -g2 -Wl,--as-needed -Wl,--no-copy-dt-needed-entries -Wl,-z -Wl,relro -Wl,-z -Wl,combreloc -o .libs/ragel-js ragel_js-main.o ragel_js-rlhc.o ragel_js-rlparse.o ragel_js-rlreduce.o -lfsm -lcolm ../.libs/libragel.so -Wl,-rpath -Wl,/usr/lib64 make[4]: Leaving directory '/tmp/B.3pi6qc/BUILD/ragel-7.0.4/src/host-js' Making all in doc Making all in ragel make[2]: Entering directory '/tmp/B.3pi6qc/BUILD/ragel-7.0.4/doc/ragel' sedsubst: generating ragel.1 from ragel.1.in make[2]: Leaving directory '/tmp/B.3pi6qc/BUILD/ragel-7.0.4/doc/ragel' make[2]: Entering directory '/tmp/B.3pi6qc/BUILD/ragel-7.0.4/doc/ragel' fig2dev -L png -S 4 bmnull.fig bmnull.png make[2]: Leaving directory '/tmp/B.3pi6qc/BUILD/ragel-7.0.4/doc/ragel' make[2]: Entering directory '/tmp/B.3pi6qc/BUILD/ragel-7.0.4/doc/ragel' fig2dev -L png -S 4 exoutact1.fig exoutact1.png make[2]: Leaving directory '/tmp/B.3pi6qc/BUILD/ragel-7.0.4/doc/ragel' make[2]: Entering directory '/tmp/B.3pi6qc/BUILD/ragel-7.0.4/doc/ragel' fig2dev -L png -S 4 bmconcat.fig bmconcat.png make[2]: Leaving directory '/tmp/B.3pi6qc/BUILD/ragel-7.0.4/doc/ragel' make[2]: Entering directory '/tmp/B.3pi6qc/BUILD/ragel-7.0.4/doc/ragel' fig2dev -L png -S 4 exstrongsubtr.fig exstrongsubtr.png make[2]: Leaving directory '/tmp/B.3pi6qc/BUILD/ragel-7.0.4/doc/ragel' make[2]: Entering directory '/tmp/B.3pi6qc/BUILD/ragel-7.0.4/doc/ragel' fig2dev -L png -S 4 lines2.fig lines2.png make[2]: Leaving directory '/tmp/B.3pi6qc/BUILD/ragel-7.0.4/doc/ragel' make[2]: Entering directory '/tmp/B.3pi6qc/BUILD/ragel-7.0.4/doc/ragel' fig2dev -L png -S 4 smallscanner.fig smallscanner.png make[2]: Leaving directory '/tmp/B.3pi6qc/BUILD/ragel-7.0.4/doc/ragel' make[2]: Entering directory '/tmp/B.3pi6qc/BUILD/ragel-7.0.4/doc/ragel' fig2dev -L png -S 4 dropdown.fig dropdown.png make[2]: Leaving directory '/tmp/B.3pi6qc/BUILD/ragel-7.0.4/doc/ragel' make[2]: Entering directory '/tmp/B.3pi6qc/BUILD/ragel-7.0.4/doc/ragel' fig2dev -L png -S 4 exdoneact.fig exdoneact.png make[2]: Leaving directory '/tmp/B.3pi6qc/BUILD/ragel-7.0.4/doc/ragel' make[2]: Entering directory '/tmp/B.3pi6qc/BUILD/ragel-7.0.4/doc/ragel' fig2dev -L png -S 4 bmregex.fig bmregex.png make[2]: Leaving directory '/tmp/B.3pi6qc/BUILD/ragel-7.0.4/doc/ragel' make[2]: Entering directory '/tmp/B.3pi6qc/BUILD/ragel-7.0.4/doc/ragel' fig2dev -L png -S 4 exinter.fig exinter.png make[2]: Leaving directory '/tmp/B.3pi6qc/BUILD/ragel-7.0.4/doc/ragel' make[2]: Entering directory '/tmp/B.3pi6qc/BUILD/ragel-7.0.4/doc/ragel' fig2dev -L png -S 4 exoutact2.fig exoutact2.png make[2]: Leaving directory '/tmp/B.3pi6qc/BUILD/ragel-7.0.4/doc/ragel' make[2]: Entering directory '/tmp/B.3pi6qc/BUILD/ragel-7.0.4/doc/ragel' fig2dev -L png -S 4 comments1.fig comments1.png make[2]: Leaving directory '/tmp/B.3pi6qc/BUILD/ragel-7.0.4/doc/ragel' make[2]: Entering directory '/tmp/B.3pi6qc/BUILD/ragel-7.0.4/doc/ragel' fig2dev -L png -S 4 lmkleene.fig lmkleene.png make[2]: Leaving directory '/tmp/B.3pi6qc/BUILD/ragel-7.0.4/doc/ragel' make[2]: Entering directory '/tmp/B.3pi6qc/BUILD/ragel-7.0.4/doc/ragel' fig2dev -L png -S 4 stembed.fig stembed.png make[2]: Leaving directory '/tmp/B.3pi6qc/BUILD/ragel-7.0.4/doc/ragel' make[2]: Entering directory '/tmp/B.3pi6qc/BUILD/ragel-7.0.4/doc/ragel' fig2dev -L png -S 4 comments2.fig comments2.png make[2]: Leaving directory '/tmp/B.3pi6qc/BUILD/ragel-7.0.4/doc/ragel' make[2]: Entering directory '/tmp/B.3pi6qc/BUILD/ragel-7.0.4/doc/ragel' fig2dev -L png -S 4 exsubtr.fig exsubtr.png make[2]: Leaving directory '/tmp/B.3pi6qc/BUILD/ragel-7.0.4/doc/ragel' make[2]: Entering directory '/tmp/B.3pi6qc/BUILD/ragel-7.0.4/doc/ragel' fig2dev -L png -S 4 entryguard.fig entryguard.png make[2]: Leaving directory '/tmp/B.3pi6qc/BUILD/ragel-7.0.4/doc/ragel' make[2]: Entering directory '/tmp/B.3pi6qc/BUILD/ragel-7.0.4/doc/ragel' fig2dev -L png -S 4 bmnum.fig bmnum.png make[2]: Leaving directory '/tmp/B.3pi6qc/BUILD/ragel-7.0.4/doc/ragel' make[2]: Entering directory '/tmp/B.3pi6qc/BUILD/ragel-7.0.4/doc/ragel' fig2dev -L png -S 4 opconcat.fig opconcat.png make[2]: Leaving directory '/tmp/B.3pi6qc/BUILD/ragel-7.0.4/doc/ragel' make[2]: Entering directory '/tmp/B.3pi6qc/BUILD/ragel-7.0.4/doc/ragel' fig2dev -L png -S 4 exaction.fig exaction.png make[2]: Leaving directory '/tmp/B.3pi6qc/BUILD/ragel-7.0.4/doc/ragel' make[2]: Entering directory '/tmp/B.3pi6qc/BUILD/ragel-7.0.4/doc/ragel' fig2dev -L png -S 4 exnegate.fig exnegate.png make[2]: Leaving directory '/tmp/B.3pi6qc/BUILD/ragel-7.0.4/doc/ragel' make[2]: Entering directory '/tmp/B.3pi6qc/BUILD/ragel-7.0.4/doc/ragel' fig2dev -L png -S 4 explus.fig explus.png make[2]: Leaving directory '/tmp/B.3pi6qc/BUILD/ragel-7.0.4/doc/ragel' make[2]: Entering directory '/tmp/B.3pi6qc/BUILD/ragel-7.0.4/doc/ragel' fig2dev -L png -S 4 finguard.fig finguard.png make[2]: Leaving directory '/tmp/B.3pi6qc/BUILD/ragel-7.0.4/doc/ragel' make[2]: Entering directory '/tmp/B.3pi6qc/BUILD/ragel-7.0.4/doc/ragel' fig2dev -L png -S 4 bmor.fig bmor.png make[2]: Leaving directory '/tmp/B.3pi6qc/BUILD/ragel-7.0.4/doc/ragel' make[2]: Entering directory '/tmp/B.3pi6qc/BUILD/ragel-7.0.4/doc/ragel' fig2dev -L png -S 4 exallact.fig exallact.png make[2]: Leaving directory '/tmp/B.3pi6qc/BUILD/ragel-7.0.4/doc/ragel' make[2]: Entering directory '/tmp/B.3pi6qc/BUILD/ragel-7.0.4/doc/ragel' fig2dev -L png -S 4 conds1.fig conds1.png make[2]: Leaving directory '/tmp/B.3pi6qc/BUILD/ragel-7.0.4/doc/ragel' make[2]: Entering directory '/tmp/B.3pi6qc/BUILD/ragel-7.0.4/doc/ragel' fig2dev -L png -S 4 exoption.fig exoption.png make[2]: Leaving directory '/tmp/B.3pi6qc/BUILD/ragel-7.0.4/doc/ragel' make[2]: Entering directory '/tmp/B.3pi6qc/BUILD/ragel-7.0.4/doc/ragel' fig2dev -L png -S 4 exstact.fig exstact.png make[2]: Leaving directory '/tmp/B.3pi6qc/BUILD/ragel-7.0.4/doc/ragel' make[2]: Entering directory '/tmp/B.3pi6qc/BUILD/ragel-7.0.4/doc/ragel' fig2dev -L png -S 4 opor.fig opor.png make[2]: Leaving directory '/tmp/B.3pi6qc/BUILD/ragel-7.0.4/doc/ragel' make[2]: Entering directory '/tmp/B.3pi6qc/BUILD/ragel-7.0.4/doc/ragel' fig2dev -L png -S 4 bmrange.fig bmrange.png make[2]: Leaving directory '/tmp/B.3pi6qc/BUILD/ragel-7.0.4/doc/ragel' make[2]: Entering directory '/tmp/B.3pi6qc/BUILD/ragel-7.0.4/doc/ragel' fig2dev -L png -S 4 leftguard.fig leftguard.png make[2]: Leaving directory '/tmp/B.3pi6qc/BUILD/ragel-7.0.4/doc/ragel' make[2]: Entering directory '/tmp/B.3pi6qc/BUILD/ragel-7.0.4/doc/ragel' fig2dev -L png -S 4 exconcat.fig exconcat.png make[2]: Leaving directory '/tmp/B.3pi6qc/BUILD/ragel-7.0.4/doc/ragel' make[2]: Entering directory '/tmp/B.3pi6qc/BUILD/ragel-7.0.4/doc/ragel' fig2dev -L png -S 4 exor.fig exor.png make[2]: Leaving directory '/tmp/B.3pi6qc/BUILD/ragel-7.0.4/doc/ragel' make[2]: Entering directory '/tmp/B.3pi6qc/BUILD/ragel-7.0.4/doc/ragel' fig2dev -L png -S 4 conds2.fig conds2.png make[2]: Leaving directory '/tmp/B.3pi6qc/BUILD/ragel-7.0.4/doc/ragel' make[2]: Entering directory '/tmp/B.3pi6qc/BUILD/ragel-7.0.4/doc/ragel' fig2dev -L png -S 4 exstar.fig exstar.png make[2]: Leaving directory '/tmp/B.3pi6qc/BUILD/ragel-7.0.4/doc/ragel' make[2]: Entering directory '/tmp/B.3pi6qc/BUILD/ragel-7.0.4/doc/ragel' fig2dev -L png -S 4 opstar.fig opstar.png make[2]: Leaving directory '/tmp/B.3pi6qc/BUILD/ragel-7.0.4/doc/ragel' make[2]: Entering directory '/tmp/B.3pi6qc/BUILD/ragel-7.0.4/doc/ragel' fig2dev -L png -S 4 lines1.fig lines1.png make[2]: Leaving directory '/tmp/B.3pi6qc/BUILD/ragel-7.0.4/doc/ragel' make[2]: Entering directory '/tmp/B.3pi6qc/BUILD/ragel-7.0.4/doc/ragel' asciidoc -d book ragel-guide.txt make[2]: Leaving directory '/tmp/B.3pi6qc/BUILD/ragel-7.0.4/doc/ragel' make[2]: Entering directory '/tmp/B.3pi6qc/BUILD/ragel-7.0.4/doc/ragel' a2x --verbose -f pdf -d book ragel-guide.txt a2x: ERROR: "dblatex" -t pdf -p "/etc/asciidoc/dblatex/asciidoc-dblatex.xsl" -s "/etc/asciidoc/dblatex/asciidoc-dblatex.sty" -V "/tmp/B.3pi6qc/BUILD/ragel-7.0.4/doc/ragel/ragel-guide.xml" returned non-zero exit status 1 a2x: args: ['--verbose', '-f', 'pdf', '-d', 'book', 'ragel-guide.txt'] a2x: resource files: [] a2x: resource directories: ['/etc/asciidoc/images', '/etc/asciidoc/stylesheets'] a2x: executing: "/usr/bin/asciidoc" --backend docbook -a "a2x-format=pdf" --doctype book --verbose --out-file "/tmp/B.3pi6qc/BUILD/ragel-7.0.4/doc/ragel/ragel-guide.xml" "/tmp/B.3pi6qc/BUILD/ragel-7.0.4/doc/ragel/ragel-guide.txt" asciidoc: reading: /etc/asciidoc/asciidoc.conf asciidoc: reading: /tmp/B.3pi6qc/BUILD/ragel-7.0.4/doc/ragel/ragel-guide.txt asciidoc: reading: /etc/asciidoc/docbook45.conf asciidoc: reading: /etc/asciidoc/filters/code/code-filter.conf asciidoc: reading: /etc/asciidoc/filters/graphviz/graphviz-filter.conf asciidoc: reading: /etc/asciidoc/filters/latex/latex-filter.conf asciidoc: reading: /etc/asciidoc/filters/music/music-filter.conf asciidoc: reading: /etc/asciidoc/filters/source/source-highlight-filter.conf asciidoc: reading: /etc/asciidoc/lang-en.conf asciidoc: writing: /tmp/B.3pi6qc/BUILD/ragel-7.0.4/doc/ragel/ragel-guide.xml a2x: executing: "xmllint" --nonet --noout --valid "/tmp/B.3pi6qc/BUILD/ragel-7.0.4/doc/ragel/ragel-guide.xml" a2x: executing: "dblatex" -t pdf -p "/etc/asciidoc/dblatex/asciidoc-dblatex.xsl" -s "/etc/asciidoc/dblatex/asciidoc-dblatex.sty" -V "/tmp/B.3pi6qc/BUILD/ragel-7.0.4/doc/ragel/ragel-guide.xml" Build the book set list... xsltproc -o doclist.txt --xinclude --xincludestyle doclist.xsl /tmp/B.3pi6qc/BUILD/ragel-7.0.4/doc/ragel/ragel-guide.xml Build the listings... xsltproc -o listings.xml --xinclude --xincludestyle --param current.dir '/tmp/B.3pi6qc/BUILD/ragel-7.0.4/doc/ragel' /usr/share/dblatex/xsl/common/mklistings.xsl /tmp/B.3pi6qc/BUILD/ragel-7.0.4/doc/ragel/ragel-guide.xml xsltproc -o ragel-guide.rtex --xinclude --xincludestyle --param current.dir '/tmp/B.3pi6qc/BUILD/ragel-7.0.4/doc/ragel' --param listings.xml '/tmp/B.3pi6qc/BUILD/tmp/tmpJbgBEV/listings.xml' /tmp/B.3pi6qc/BUILD/tmp/tmpJbgBEV/custom.xsl /tmp/B.3pi6qc/BUILD/ragel-7.0.4/doc/ragel/ragel-guide.xml XSLT stylesheets DocBook - LaTeX 2e (0.3.8) =================================================== Image 'dblatex' not found Cannot convert 'bmconcat.png' to pdf Cannot convert 'bmor.png' to pdf Cannot convert 'bmnull.png' to pdf Cannot convert 'bmnum.png' to pdf Cannot convert 'bmregex.png' to pdf Cannot convert 'bmrange.png' to pdf Cannot convert 'opor.png' to pdf Cannot convert 'exor.png' to pdf Cannot convert 'exinter.png' to pdf Cannot convert 'exsubtr.png' to pdf Cannot convert 'exstrongsubtr.png' to pdf Cannot convert 'opconcat.png' to pdf Cannot convert 'exconcat.png' to pdf Cannot convert 'opstar.png' to pdf Cannot convert 'exstar.png' to pdf Cannot convert 'explus.png' to pdf Cannot convert 'exoption.png' to pdf Cannot convert 'exnegate.png' to pdf Cannot convert 'exstact.png' to pdf Cannot convert 'exdoneact.png' to pdf Cannot convert 'exallact.png' to pdf Cannot convert 'exoutact1.png' to pdf Cannot convert 'exoutact2.png' to pdf Cannot convert 'exaction.png' to pdf Cannot convert 'lines1.png' to pdf Cannot convert 'lines2.png' to pdf Cannot convert 'comments1.png' to pdf Cannot convert 'comments2.png' to pdf Cannot convert 'smallscanner.png' to pdf Cannot convert 'comments2.png' to pdf Cannot convert 'entryguard.png' to pdf Cannot convert 'finguard.png' to pdf Cannot convert 'leftguard.png' to pdf Cannot convert 'lmkleene.png' to pdf Cannot convert 'dropdown.png' to pdf Cannot convert 'conds1.png' to pdf Cannot convert 'conds2.png' to pdf Build ragel-guide.pdf built-in module pdftex registered no support found for ifxetex no support found for fontspec no support found for xltxtra no support found for fontenc no support found for inputenc no support found for fancybox built-in module makeidx registered no support found for asciidoc-dblatex building additional files... checking if compiling is necessary... the output file doesn't exist pdflatex -interaction=batchmode ragel-guide.tex pdflatex failed /usr/share/texmf-dist/tex/latex/hyperref/hyperref.sty: File `ifxetex.sty' not found. /usr/share/texmf-dist/tex/latex/hyperref/hyperref.sty:100: Emergency stop. /usr/share/texmf-dist/tex/latex/hyperref/hyperref.sty:100: leading text: \RequirePackage{ifxetex}[2006/08/21] Unexpected error occured Error: pdflatex compilation failed make[2]: *** [Makefile:630: ragel-guide.pdf] Error 1 make[2]: Leaving directory '/tmp/B.3pi6qc/BUILD/ragel-7.0.4/doc/ragel' make[1]: *** [Makefile:385: all-recursive] Error 1 make: *** [Makefile:488: all-recursive] Error 1 error: Bad exit status from /tmp/B.3pi6qc/BUILD/tmp/rpm-tmp.Navhr1 (%build) RPM build errors: Could not canonicalize hostname: ymir Bad exit status from /tmp/B.3pi6qc/BUILD/tmp/rpm-tmp.Navhr1 (%build) ended at: Fri May 21 19:43:27 2021, done in 0:01:54.890022 error: No files produced. + chmod -R u+rwX /tmp/B.3pi6qc/BUILD + rm -rf /tmp/B.3pi6qc/tmp /tmp/B.3pi6qc/BUILD + rm -rf /tmp/B.3pi6qc Begin-PLD-Builder-Info Build-Time: user:249.01s sys:15.41s real:126.24s (faults io:1706 non-io:3978469) End-PLD-Builder-Info
[Back to list of logs] [View rpm -qa of builder]