FailedOk

th/SRPMS[OK]
th/x32[OK]
th/i686[OK]
th/x86_64[OK]

ac/SRPMS[OK]
ac/i386[OK]
ac/i586[OK]
ac/i686[OK]
ac/alpha[OK]
ac/amd64[OK]
ac/athlon[OK]
ac/ppc[OK]
ac/sparc[OK]
ac/sparc64[OK]

Advanced Search
main()
Powered by PLD Linux
(c) 2002-2024 PLD Team
$Revision: 1.37 $
Powered by Neo.
Your IP: 3.236.112.70

rtl8812au 4ea15822-7a8e-4c58-b745-68bd125799dd

Status:Failed
Source URL:https://buildlogs.pld-linux.org/pld/th/x86_64/FAIL/rtl8812au,4ea15822-7a8e-4c58-b745-68bd125799dd.bz2
text/plain URL:View!
rpm -qa of builder:View!
Date:2024/05/18 23:33:17
Runtime:0:00:11.990289

Toc:

  • prep
  • Executing(%prep): /bin/sh -e /tmp/B.rqm7cs6f/BUILD/tmp/rpm-tmp.UvTwyK
  • build
  • Executing(%build): /bin/sh -e /tmp/B.rqm7cs6f/BUILD/tmp/rpm-tmp.RIWLJe
  • error 1
  • /tmp/B.rqm7cs6f/BUILD/8812au-20210629-main/os_dep/linux/ioctl_cfg80211.c:469:17: error: too many arguments to function 'cfg80211_ch_switch_started_notify'
  • error 2
  • /tmp/B.rqm7cs6f/BUILD/8812au-20210629-main/os_dep/linux/ioctl_cfg80211.c:488:9: error: too many arguments to function 'cfg80211_ch_switch_notify'
  • error 3
  • make[3]: *** [scripts/Makefile.build:244: /tmp/B.rqm7cs6f/BUILD/8812au-20210629-main/os_dep/linux/ioctl_cfg80211.o] Error 1
  • error 4
  • make[2]: *** [/usr/src/linux-6.9.0/Makefile:1919: /tmp/B.rqm7cs6f/BUILD/8812au-20210629-main] Error 2
  • error 5
  • make[1]: *** [Makefile:240: __sub-make] Error 2
  • error 6
  • error: Bad exit status from /tmp/B.rqm7cs6f/BUILD/tmp/rpm-tmp.RIWLJe (%build)
  • error 7
  • RPM build errors:
  • error 8
  • error: No files produced.

Content:

request from: baggins
checking if we should skip the build
started at: Sat May 18 23:32:50 2024
killing old processes on a builder
sending signal 9 to pid -1
cleaning up /tmp
fetching https://srcbuilder.pld-linux.org/th//srpms/4ea15822-7a8e-4c58-b745-68bd125799dd/rtl8812au-5.13.6.20240317-1%406.9.0_1.src.rpm
fetched 2916983 bytes, 5991.9 K/s
installing srpm: rtl8812au-5.13.6.20240317-1@6.9.0_1.src.rpm
+ install -d /tmp/B.rqm7cs6f/BUILD /tmp/B.rqm7cs6f/RPMS
+ LC_ALL=en_US.UTF-8
+ rpm -qp --changelog rtl8812au-5.13.6.20240317-1@6.9.0_1.src.rpm
* Sat May 18 2024 PLD Linux Team <feedback@pld-linux.org>
- For complete changelog see: http://git.pld-linux.org/?p=packages/rtl8812au.git;a=log;h=master
* Sun Mar 17 2024 Jan Rękorajski <baggins@pld-linux.org> b6d47df
- update to latest snap * Sun Mar 17 2024 Jan Rękorajski <baggins@pld-linux.org> a6057c1
- update str(l|s)cpy usage * Sun Dec 24 2023 Jan Rękorajski <baggins@pld-linux.org> 53c9632
- up to latest snap * Sun Jul 30 2023 Jan Rękorajski <baggins@pld-linux.org> 9947344
- up to new snap with 6.3+ support * Wed Jun 07 2023 Jan Rękorajski <baggins@pld-linux.org> 5526980
- rel 2 * Wed Jun 07 2023 Jan Rękorajski <baggins@pld-linux.org> f052070
- don't override arch for module build * Sun May 21 2023 Jan Rękorajski <baggins@pld-linux.org> ba87931
- updated to latest snap with updates for kernel 6.3 * Sat Dec 17 2022 Jan Rękorajski <baggins@pld-linux.org> e8c7da1
- updated to latest snap with fixes for kernel 6.1 * Sun Aug 28 2022 Jan Rękorajski <baggins@pld-linux.org> 043f8ec
- updated to latest snap with fixes for kernels 5.19 and 6.0 * Sat Apr 02 2022 Jan Rękorajski <baggins@pld-linux.org> 87da6a4
- up to 5.13.6 * Sun Nov 07 2021 Jan Rękorajski <baggins@pld-linux.org> 9355b06
- no IPX in kernel 5.15, rel 2 * Tue May 04 2021 Jan Rękorajski <baggins@pld-linux.org> 86b3b0a
- it's 2021... * Mon May 03 2021 Jan Rękorajski <baggins@pld-linux.org> 75a597a
- fix snap date * Mon May 03 2021 Jan Rękorajski <baggins@pld-linux.org> 3168385
- updated to latest snapshot with support for kernels up to 5.12 * Thu Feb 25 2021 Jan Rękorajski <baggins@pld-linux.org> ab7adb6
- fix building with kernl 5.11 - rel 2 * Fri Dec 18 2020 Jan Rękorajski <baggins@pld-linux.org> c044590
- up to 5.9.3.2 * Mon Aug 17 2020 Jan Rękorajski <baggins@pld-linux.org> 4f8c5a1
- restore epoch 2, rel 3 * Mon Aug 17 2020 Jan Rękorajski <baggins@pld-linux.org> 33b76a0
- rel 2 * Mon Aug 17 2020 Jan Rękorajski <baggins@pld-linux.org> 597e059
- fix version confiusion * Sun Aug 16 2020 Jan Rękorajski <baggins@pld-linux.org> f2dafbc
- move snap into version to avoid confisung rpm + rpm -Uhv --nodeps --define '_topdir /tmp/B.rqm7cs6f' --define '_specdir %{_topdir}' --define '_sourcedir %{_specdir}' --define '_rpmdir %{_topdir}/RPMS' --define '_builddir %{_topdir}/BUILD' --without userspace --define 'build_kernels head,6.1,5.15,5.10,5.4,4.19' rtl8812au-5.13.6.20240317-1@6.9.0_1.src.rpm Updating / installing... rtl8812au-2:5.13.6.20240317-1@6.9.0_1 ######################################## + rm -f rtl8812au-5.13.6.20240317-1@6.9.0_1.src.rpm + install -m 700 -d /tmp/B.rqm7cs6f/BUILD/tmp + TMPDIR=/tmp/B.rqm7cs6f/BUILD/tmp + exec nice -n 0 rpmbuild -bp --short-circuit --nodeps --define '_topdir /tmp/B.rqm7cs6f' --define '_specdir %{_topdir}' --define '_sourcedir %{_specdir}' --define '_rpmdir %{_topdir}/RPMS' --define '_builddir %{_topdir}/BUILD' --without userspace --target x86_64-pld-linux --define 'build_kernels head,6.1,5.15,5.10,5.4,4.19' --define 'prep exit 0' /tmp/B.rqm7cs6f/rtl8812au.spec warning: Could not canonicalize hostname: ymir Building target platforms: x86_64-pld-linux Building for target x86_64-pld-linux RPM build warnings: Could not canonicalize hostname: ymir checking BuildConflict-ing packages rpm: warning: Could not canonicalize hostname: ymir rpm: Building target platforms: x86_64-pld-linux rpm: Building for target x86_64-pld-linux rpm: rpm: RPM build warnings: rpm: Could not canonicalize hostname: ymir no BuildConflicts found checking BR rpm: warning: Could not canonicalize hostname: ymir rpm: Building target platforms: x86_64-pld-linux rpm: Building for target x86_64-pld-linux rpm: rpm: RPM build warnings: rpm: Could not canonicalize hostname: ymir no BR needed building RPM using: set -ex; : build-id: 4ea15822-7a8e-4c58-b745-68bd125799dd; TMPDIR=/tmp/B.rqm7cs6f/BUILD/tmp exec nice -n 0 rpmbuild -bb --define '__jobs 28' --define '_smp_mflags -j28' --define '_make_opts -Otarget' --define '_pld_builder 1' --define '_topdir /tmp/B.rqm7cs6f' --define '_specdir %{_topdir}' --define '_sourcedir %{_specdir}' --define '_rpmdir %{_topdir}/RPMS' --define '_builddir %{_topdir}/BUILD' --without userspace --target x86_64-pld-linux --define 'build_kernels head,6.1,5.15,5.10,5.4,4.19' /tmp/B.rqm7cs6f/rtl8812au.spec + : build-id: 4ea15822-7a8e-4c58-b745-68bd125799dd + TMPDIR=/tmp/B.rqm7cs6f/BUILD/tmp + exec nice -n 0 rpmbuild -bb --define '__jobs 28' --define '_smp_mflags -j28' --define '_make_opts -Otarget' --define '_pld_builder 1' --define '_topdir /tmp/B.rqm7cs6f' --define '_specdir %{_topdir}' --define '_sourcedir %{_specdir}' --define '_rpmdir %{_topdir}/RPMS' --define '_builddir %{_topdir}/BUILD' --without userspace --target x86_64-pld-linux --define 'build_kernels head,6.1,5.15,5.10,5.4,4.19' /tmp/B.rqm7cs6f/rtl8812au.spec warning: Could not canonicalize hostname: ymir Building target platforms: x86_64-pld-linux Building for target x86_64-pld-linux Executing(%prep): /bin/sh -e /tmp/B.rqm7cs6f/BUILD/tmp/rpm-tmp.UvTwyK + umask 022 + cd /tmp/B.rqm7cs6f/BUILD + cd /tmp/B.rqm7cs6f/BUILD + rm -rf 8812au-20210629-main + /bin/gzip -dc /tmp/B.rqm7cs6f/rtl8812au-5.13.6.20240317.tar.gz + /bin/tar -xof - + STATUS=0 + '[' 0 -ne 0 ']' + cd 8812au-20210629-main + /bin/chmod -Rf a+rX,u+w,g-w,o-w . + echo 'Patch #0 (no-arch-override.patch):' Patch #0 (no-arch-override.patch): + </tmp/B.rqm7cs6f/no-arch-override.patch + /usr/bin/patch -s -f -p1 '--fuzz=0' + echo 'Patch #1 (kernel-strcpy.patch):' Patch #1 (kernel-strcpy.patch): + </tmp/B.rqm7cs6f/kernel-strcpy.patch + /usr/bin/patch -s -f -p1 '--fuzz=0' + RPM_EC=0 + jobs -p + exit 0 Executing(%build): /bin/sh -e /tmp/B.rqm7cs6f/BUILD/tmp/rpm-tmp.RIWLJe TMP=/home/users/builder/tmp HOME=/home/users/builder PATH=/home/users/builder/GNUstep/Tools:/bin:/usr/bin:/usr/local/bin:/home/users/builder/bin TMPDIR=/tmp/B.rqm7cs6f/BUILD/tmp + umask 022 + cd /tmp/B.rqm7cs6f/BUILD + cd 8812au-20210629-main + /usr/bin/make -Otarget -j28 clean 'KVER=6.9.0-1' 'KSRC=/usr/src/linux' #/usr/bin/make -C /usr/src/linux M=/tmp/B.rqm7cs6f/BUILD/8812au-20210629-main clean cd hal ; rm -fr */*/*/*.mod.c */*/*/*.mod */*/*/*.o */*/*/.*.cmd */*/*/*.ko cd hal ; rm -fr */*/*.mod.c */*/*.mod */*/*.o */*/.*.cmd */*/*.ko cd hal ; rm -fr */*.mod.c */*.mod */*.o */.*.cmd */*.ko cd hal ; rm -fr *.mod.c *.mod *.o .*.cmd *.ko cd core ; rm -fr */*.mod.c */*.mod */*.o */.*.cmd */*.ko cd core ; rm -fr *.mod.c *.mod *.o .*.cmd *.ko cd os_dep/linux ; rm -fr *.mod.c *.mod *.o .*.cmd *.ko cd os_dep ; rm -fr *.mod.c *.mod *.o .*.cmd *.ko cd platform ; rm -fr *.mod.c *.mod *.o .*.cmd *.ko rm -fr Module.symvers ; rm -fr Module.markers ; rm -fr modules.order rm -fr *.mod.c *.mod *.o .*.cmd *.ko *~ rm -fr .tmp_versions rm -fr MOK.der MOK.priv + /usr/bin/make -Otarget -j28 modules 'KVER=6.9.0-1' 'KSRC=/usr/src/linux' /usr/bin/make CROSS_COMPILE= -C /usr/src/linux M=/tmp/B.rqm7cs6f/BUILD/8812au-20210629-main modules warning: the compiler differs from the one used to build the kernel The kernel was built by: x86_64-pld-linux-gcc (PLD-Linux) 13.2.0 20230727 (release) You are using: gcc (PLD-Linux) 13.2.0 20230727 (release) CC [M] /tmp/B.rqm7cs6f/BUILD/8812au-20210629-main/core/mesh/rtw_mesh_pathtbl.o CC [M] /tmp/B.rqm7cs6f/BUILD/8812au-20210629-main/core/mesh/rtw_mesh.o CC [M] /tmp/B.rqm7cs6f/BUILD/8812au-20210629-main/core/mesh/rtw_mesh_hwmp.o CC [M] /tmp/B.rqm7cs6f/BUILD/8812au-20210629-main/core/rtw_iol.o CC [M] /tmp/B.rqm7cs6f/BUILD/8812au-20210629-main/core/rtw_io.o CC [M] /tmp/B.rqm7cs6f/BUILD/8812au-20210629-main/core/rtw_rson.o CC [M] /tmp/B.rqm7cs6f/BUILD/8812au-20210629-main/core/rtw_ioctl_query.o CC [M] /tmp/B.rqm7cs6f/BUILD/8812au-20210629-main/core/monitor/rtw_radiotap.o CC [M] /tmp/B.rqm7cs6f/BUILD/8812au-20210629-main/core/rtw_ioctl_set.o CC [M] /tmp/B.rqm7cs6f/BUILD/8812au-20210629-main/core/rtw_sreset.o CC [M] /tmp/B.rqm7cs6f/BUILD/8812au-20210629-main/core/rtw_sta_mgt.o CC [M] /tmp/B.rqm7cs6f/BUILD/8812au-20210629-main/core/rtw_debug.o CC [M] /tmp/B.rqm7cs6f/BUILD/8812au-20210629-main/core/rtw_btcoex_wifionly.o CC [M] /tmp/B.rqm7cs6f/BUILD/8812au-20210629-main/core/wds/rtw_wds.o CC [M] /tmp/B.rqm7cs6f/BUILD/8812au-20210629-main/core/rtw_br_ext.o CC [M] /tmp/B.rqm7cs6f/BUILD/8812au-20210629-main/core/rtw_pwrctrl.o CC [M] /tmp/B.rqm7cs6f/BUILD/8812au-20210629-main/core/rtw_vht.o CC [M] /tmp/B.rqm7cs6f/BUILD/8812au-20210629-main/core/rtw_mi.o CC [M] /tmp/B.rqm7cs6f/BUILD/8812au-20210629-main/core/rtw_chplan.o CC [M] /tmp/B.rqm7cs6f/BUILD/8812au-20210629-main/core/rtw_recv.o CC [M] /tmp/B.rqm7cs6f/BUILD/8812au-20210629-main/core/rtw_rf.o CC [M] /tmp/B.rqm7cs6f/BUILD/8812au-20210629-main/core/rtw_p2p.o CC [M] /tmp/B.rqm7cs6f/BUILD/8812au-20210629-main/core/rtw_cmd.o CC [M] /tmp/B.rqm7cs6f/BUILD/8812au-20210629-main/core/rtw_mlme.o CC [M] /tmp/B.rqm7cs6f/BUILD/8812au-20210629-main/core/rtw_security.o CC [M] /tmp/B.rqm7cs6f/BUILD/8812au-20210629-main/core/rtw_tdls.o CC [M] /tmp/B.rqm7cs6f/BUILD/8812au-20210629-main/core/rtw_wlan_util.o CC [M] /tmp/B.rqm7cs6f/BUILD/8812au-20210629-main/core/rtw_rm_fsm.o CC [M] /tmp/B.rqm7cs6f/BUILD/8812au-20210629-main/core/rtw_ap.o CC [M] /tmp/B.rqm7cs6f/BUILD/8812au-20210629-main/core/rtw_xmit.o CC [M] /tmp/B.rqm7cs6f/BUILD/8812au-20210629-main/core/rtw_ieee80211.o CC [M] /tmp/B.rqm7cs6f/BUILD/8812au-20210629-main/core/rtw_rm.o CC [M] /tmp/B.rqm7cs6f/BUILD/8812au-20210629-main/core/rtw_ft.o CC [M] /tmp/B.rqm7cs6f/BUILD/8812au-20210629-main/core/rtw_odm.o CC [M] /tmp/B.rqm7cs6f/BUILD/8812au-20210629-main/core/crypto/aes-internal-enc.o CC [M] /tmp/B.rqm7cs6f/BUILD/8812au-20210629-main/core/rtw_rm_util.o CC [M] /tmp/B.rqm7cs6f/BUILD/8812au-20210629-main/core/rtw_roch.o CC [M] /tmp/B.rqm7cs6f/BUILD/8812au-20210629-main/core/rtw_wnm.o CC [M] /tmp/B.rqm7cs6f/BUILD/8812au-20210629-main/core/rtw_btcoex.o CC [M] /tmp/B.rqm7cs6f/BUILD/8812au-20210629-main/core/rtw_beamforming.o CC [M] /tmp/B.rqm7cs6f/BUILD/8812au-20210629-main/core/rtw_mbo.o CC [M] /tmp/B.rqm7cs6f/BUILD/8812au-20210629-main/core/crypto/aes-internal.o CC [M] /tmp/B.rqm7cs6f/BUILD/8812au-20210629-main/core/crypto/aes-ccm.o CC [M] /tmp/B.rqm7cs6f/BUILD/8812au-20210629-main/core/efuse/rtw_efuse.o CC [M] /tmp/B.rqm7cs6f/BUILD/8812au-20210629-main/core/crypto/aes-gcm.o CC [M] /tmp/B.rqm7cs6f/BUILD/8812au-20210629-main/core/crypto/aes-siv.o CC [M] /tmp/B.rqm7cs6f/BUILD/8812au-20210629-main/core/crypto/aes-omac1.o CC [M] /tmp/B.rqm7cs6f/BUILD/8812au-20210629-main/core/crypto/gcmp.o CC [M] /tmp/B.rqm7cs6f/BUILD/8812au-20210629-main/core/crypto/ccmp.o CC [M] /tmp/B.rqm7cs6f/BUILD/8812au-20210629-main/core/crypto/sha256.o CC [M] /tmp/B.rqm7cs6f/BUILD/8812au-20210629-main/core/crypto/rtw_crypto_wrap.o CC [M] /tmp/B.rqm7cs6f/BUILD/8812au-20210629-main/core/crypto/sha256-internal.o CC [M] /tmp/B.rqm7cs6f/BUILD/8812au-20210629-main/core/crypto/sha256-prf.o CC [M] /tmp/B.rqm7cs6f/BUILD/8812au-20210629-main/core/crypto/aes-ctr.o CC [M] /tmp/B.rqm7cs6f/BUILD/8812au-20210629-main/hal/hal_btcoex.o CC [M] /tmp/B.rqm7cs6f/BUILD/8812au-20210629-main/hal/hal_mcc.o CC [M] /tmp/B.rqm7cs6f/BUILD/8812au-20210629-main/core/rtw_swcrypto.o CC [M] /tmp/B.rqm7cs6f/BUILD/8812au-20210629-main/os_dep/linux/usb_ops_linux.o CC [M] /tmp/B.rqm7cs6f/BUILD/8812au-20210629-main/os_dep/linux/xmit_linux.o CC [M] /tmp/B.rqm7cs6f/BUILD/8812au-20210629-main/core/rtw_mlme_ext.o CC [M] /tmp/B.rqm7cs6f/BUILD/8812au-20210629-main/os_dep/linux/recv_linux.o CC [M] /tmp/B.rqm7cs6f/BUILD/8812au-20210629-main/os_dep/linux/usb_intf.o CC [M] /tmp/B.rqm7cs6f/BUILD/8812au-20210629-main/os_dep/osdep_service.o CC [M] /tmp/B.rqm7cs6f/BUILD/8812au-20210629-main/os_dep/linux/rtw_cfgvendor.o CC [M] /tmp/B.rqm7cs6f/BUILD/8812au-20210629-main/os_dep/linux/rtw_android.o CC [M] /tmp/B.rqm7cs6f/BUILD/8812au-20210629-main/os_dep/linux/rtw_proc.o CC [M] /tmp/B.rqm7cs6f/BUILD/8812au-20210629-main/os_dep/linux/rtw_rhashtable.o CC [M] /tmp/B.rqm7cs6f/BUILD/8812au-20210629-main/os_dep/linux/wifi_regd.o CC [M] /tmp/B.rqm7cs6f/BUILD/8812au-20210629-main/os_dep/linux/ioctl_cfg80211.o /tmp/B.rqm7cs6f/BUILD/8812au-20210629-main/os_dep/linux/ioctl_cfg80211.c: In function 'rtw_cfg80211_ch_switch_notify': /tmp/B.rqm7cs6f/BUILD/8812au-20210629-main/os_dep/linux/ioctl_cfg80211.c:469:17: error: too many arguments to function 'cfg80211_ch_switch_started_notify' 469 | cfg80211_ch_switch_started_notify(adapter->pnetdev, &chdef, 0, 0, false, 0); | ^~~~~~~~~~~~~~~~~~~~~~~~~~~~~~~~~ In file included from /tmp/B.rqm7cs6f/BUILD/8812au-20210629-main/include/osdep_service_linux.h:98, from /tmp/B.rqm7cs6f/BUILD/8812au-20210629-main/include/osdep_service.h:54, from /tmp/B.rqm7cs6f/BUILD/8812au-20210629-main/include/drv_types.h:27, from /tmp/B.rqm7cs6f/BUILD/8812au-20210629-main/os_dep/linux/ioctl_cfg80211.c:17: ./include/net/cfg80211.h:8811:6: note: declared here 8811 | void cfg80211_ch_switch_started_notify(struct net_device *dev, | ^~~~~~~~~~~~~~~~~~~~~~~~~~~~~~~~~ /tmp/B.rqm7cs6f/BUILD/8812au-20210629-main/os_dep/linux/ioctl_cfg80211.c:488:9: error: too many arguments to function 'cfg80211_ch_switch_notify' 488 | cfg80211_ch_switch_notify(adapter->pnetdev, &chdef, 0, 0); | ^~~~~~~~~~~~~~~~~~~~~~~~~ ./include/net/cfg80211.h:8795:6: note: declared here 8795 | void cfg80211_ch_switch_notify(struct net_device *dev, | ^~~~~~~~~~~~~~~~~~~~~~~~~ make[3]: *** [scripts/Makefile.build:244: /tmp/B.rqm7cs6f/BUILD/8812au-20210629-main/os_dep/linux/ioctl_cfg80211.o] Error 1 make[3]: *** Waiting for unfinished jobs.... CC [M] /tmp/B.rqm7cs6f/BUILD/8812au-20210629-main/os_dep/linux/mlme_linux.o CC [M] /tmp/B.rqm7cs6f/BUILD/8812au-20210629-main/os_dep/linux/nlrtw.o CC [M] /tmp/B.rqm7cs6f/BUILD/8812au-20210629-main/os_dep/linux/os_intfs.o CC [M] /tmp/B.rqm7cs6f/BUILD/8812au-20210629-main/hal/hal_dm_acs.o CC [M] /tmp/B.rqm7cs6f/BUILD/8812au-20210629-main/hal/hal_phy.o CC [M] /tmp/B.rqm7cs6f/BUILD/8812au-20210629-main/hal/hal_btcoex_wifionly.o CC [M] /tmp/B.rqm7cs6f/BUILD/8812au-20210629-main/hal/hal_mp.o CC [M] /tmp/B.rqm7cs6f/BUILD/8812au-20210629-main/hal/led/hal_led.o CC [M] /tmp/B.rqm7cs6f/BUILD/8812au-20210629-main/hal/hal_dm.o CC [M] /tmp/B.rqm7cs6f/BUILD/8812au-20210629-main/hal/hal_intf.o CC [M] /tmp/B.rqm7cs6f/BUILD/8812au-20210629-main/hal/HalPwrSeqCmd.o CC [M] /tmp/B.rqm7cs6f/BUILD/8812au-20210629-main/hal/rtl8812a/Hal8812PwrSeq.o CC [M] /tmp/B.rqm7cs6f/BUILD/8812au-20210629-main/hal/hal_hci/hal_usb.o CC [M] /tmp/B.rqm7cs6f/BUILD/8812au-20210629-main/hal/rtl8812a/Hal8821APwrSeq.o CC [M] /tmp/B.rqm7cs6f/BUILD/8812au-20210629-main/hal/rtl8812a/rtl8812a_sreset.o CC [M] /tmp/B.rqm7cs6f/BUILD/8812au-20210629-main/hal/rtl8812a/rtl8812a_xmit.o CC [M] /tmp/B.rqm7cs6f/BUILD/8812au-20210629-main/hal/rtl8812a/rtl8812a_rf6052.o CC [M] /tmp/B.rqm7cs6f/BUILD/8812au-20210629-main/hal/rtl8812a/rtl8812a_dm.o CC [M] /tmp/B.rqm7cs6f/BUILD/8812au-20210629-main/hal/led/hal_usb_led.o CC [M] /tmp/B.rqm7cs6f/BUILD/8812au-20210629-main/hal/rtl8812a/rtl8812a_rxdesc.o CC [M] /tmp/B.rqm7cs6f/BUILD/8812au-20210629-main/hal/hal_com.o CC [M] /tmp/B.rqm7cs6f/BUILD/8812au-20210629-main/hal/rtl8812a/rtl8812a_cmd.o CC [M] /tmp/B.rqm7cs6f/BUILD/8812au-20210629-main/hal/rtl8812a/usb/usb_halinit.o CC [M] /tmp/B.rqm7cs6f/BUILD/8812au-20210629-main/hal/rtl8812a/rtl8812a_phycfg.o CC [M] /tmp/B.rqm7cs6f/BUILD/8812au-20210629-main/os_dep/linux/ioctl_linux.o CC [M] /tmp/B.rqm7cs6f/BUILD/8812au-20210629-main/hal/hal_com_phycfg.o CC [M] /tmp/B.rqm7cs6f/BUILD/8812au-20210629-main/hal/rtl8812a/rtl8812a_hal_init.o make[2]: *** [/usr/src/linux-6.9.0/Makefile:1919: /tmp/B.rqm7cs6f/BUILD/8812au-20210629-main] Error 2 make[1]: *** [Makefile:240: __sub-make] Error 2 make: *** [Makefile:2511: modules] Error 2 error: Bad exit status from /tmp/B.rqm7cs6f/BUILD/tmp/rpm-tmp.RIWLJe (%build) RPM build warnings: Could not canonicalize hostname: ymir RPM build errors: Bad exit status from /tmp/B.rqm7cs6f/BUILD/tmp/rpm-tmp.RIWLJe (%build) ended at: Sat May 18 23:33:17 2024, done in 0:00:11.990289 error: No files produced. + chmod -R u+rwX /tmp/B.rqm7cs6f/BUILD + rm -rf /tmp/B.rqm7cs6f/tmp /tmp/B.rqm7cs6f/BUILD + rm -rf /tmp/B.rqm7cs6f Begin-PLD-Builder-Info Build-Time: user:146.96s sys:20.28s real:27.46s (faults io:4 non-io:1922179) End-PLD-Builder-Info
[Back to list of logs] [View rpm -qa of builder]