FailedOk

th/SRPMS[OK]
th/x32[OK]
th/i686[OK]
th/x86_64[OK]

ac/SRPMS[OK]
ac/i386[OK]
ac/i586[OK]
ac/i686[OK]
ac/alpha[OK]
ac/amd64[OK]
ac/athlon[OK]
ac/ppc[OK]
ac/sparc[OK]
ac/sparc64[OK]

Advanced Search
main()
Powered by PLD Linux
(c) 2002-2022 PLD Team
$Revision: 1.37 $
Powered by penguin.
Your IP: 54.80.252.84

seamonkey d8543d68-c440-4ada-98fe-097405b87f1f

Status:Failed
Source URL:https://buildlogs.pld-linux.org/pld/th/x86_64/FAIL/seamonkey,d8543d68-c440-4ada-98fe-097405b87f1f.bz2
text/plain URL:View!
rpm -qa of builder:View!
Date:2022/01/14 20:44:09
Runtime:0:01:13.712102

Toc:

  • prep
  • Executing(%prep): /bin/sh -e /tmp/B.asmimkvq/BUILD/tmp/rpm-tmp.Kyh6E8
  • build
  • Executing(%build): /bin/sh -e /tmp/B.asmimkvq/BUILD/tmp/rpm-tmp.QzoKq4
  • error 1
  • 0:03.50 IOError: [Errno 13] Permission denied: u'/usr/lib64/python2.7/sitecustomize.py'
  • error 2
  • 0:03.51 gmake[1]: *** [client.mk:109: configure] Error 1
  • error 3
  • error: Bad exit status from /tmp/B.asmimkvq/BUILD/tmp/rpm-tmp.QzoKq4 (%build)
  • error 4
  • RPM build errors:
  • error 5
  • error: No files produced.

Content:

request from: atler
checking if we should skip the build
started at: Fri Jan 14 20:42:07 2022
killing old processes on a builder
sending signal 9 to pid -1
cleaning up /tmp
fetching https://srcbuilder.pld-linux.org/th//srpms/d8543d68-c440-4ada-98fe-097405b87f1f/seamonkey-2.53.9.1-1.src.rpm
fetched 307747051 bytes, 30843.8 K/s
installing srpm: seamonkey-2.53.9.1-1.src.rpm
+ install -d /tmp/B.asmimkvq/BUILD /tmp/B.asmimkvq/RPMS
+ LC_ALL=en_US.UTF-8
+ rpm -qp --changelog seamonkey-2.53.9.1-1.src.rpm
* Fri Jan 14 2022 PLD Linux Team <feedback@pld-linux.org>
- For complete changelog see: http://git.pld-linux.org/?p=packages/seamonkey.git;a=log;h=master
* Thu Oct 28 2021 Jakub Bogusz <qboosh@pld-linux.org> 3cab66c
- updated to 2.53.9.1 * Thu Sep 16 2021 Jakub Bogusz <qboosh@pld-linux.org> b8379d7
- updated to 2.53.9 - removed obsolete rust-1.54 patch - disable system cairo by default (not supported in this version) - use ld.bfd on ix86 (gold hits internal error on this arch) * Thu Aug 26 2021 Jan Rękorajski <baggins@pld-linux.org> 8cad6b8
- rel 1 * Wed Aug 25 2021 Jan Rękorajski <baggins@pld-linux.org> 98697bc
- fix building with rust 1.54, updated files * Sun Aug 15 2021 Jan Rękorajski <baggins@pld-linux.org> 45e793c
- rel 0.1 * Sun Aug 15 2021 Jan Rękorajski <baggins@pld-linux.org> 509394b
- up to 2.53.8.1 * Sat Mar 06 2021 Jakub Bogusz <qboosh@pld-linux.org> cf1b00f
- x32 is not supported * Sat Mar 06 2021 Jakub Bogusz <qboosh@pld-linux.org> a4627aa
- rediffed enable-addons patch * Sat Mar 06 2021 Jakub Bogusz <qboosh@pld-linux.org> 010d241
- versioned Obsoletes, extended by more withdrawn packages * Thu Mar 04 2021 Jakub Bogusz <qboosh@pld-linux.org> f1319b7
- updated to 2.53.6 - updaed enable-addons,icu-detect,pld-branding,system-virtualenv patches - removed obsolete sysctl patch - added el langpack - system sqlite no longer supported * Sat Oct 10 2020 Jakub Bogusz <qboosh@pld-linux.org> 6930f27
- started update to 2.53.4 - updated pld-branging,enable-addons,system-virtualenv patches - removed agent patch (no longer applicable, there is no vendor part of UA now) - removed obsolete glibc2.30,crmf,mozilla-1389436 patches - added sysctl,mozilla-revert-1332139 patches from Fedora * Tue Jul 07 2020 Jan Rękorajski <baggins@pld-linux.org> 9979841
- fix building with gcc 10 - rel 5 * Tue Apr 21 2020 Jan Rękorajski <baggins@pld-linux.org> af7cffb
- really rebuild with libffi 3.3 - release 4 (by relup.sh) * Mon Apr 20 2020 Jan Rękorajski <baggins@pld-linux.org> 48be26c
- rebuild with libffi 3.3 - release 3 (by relup.sh) * Sat Feb 08 2020 Jan Rękorajski <baggins@pld-linux.org> 219077b
- rebuild with libevent 2.1.11 - release 2 (by relup.sh) * Wed Nov 20 2019 Jakub Bogusz <qboosh@pld-linux.org> 50d95fc
- updated to 2.49.5 (mostly security fixes; lightning, chatzilla and dom-inspector components are back) - added crmf patch (build fix based on Fedora) * Thu Oct 10 2019 Adam Gołębiowski <adamg@pld-linux.org> 8fbffe0
- release 3, glibc-2.30 provides gettid definition * Tue May 28 2019 Jan Rękorajski <baggins@pld-linux.org> e3ca3ae
- release 2 (by relup.sh) * Sun Apr 21 2019 Jakub Bogusz <qboosh@pld-linux.org> 5a870fa
- updated to 2.49.4 (constains Firefox ESR 52.9.0 security fixes) - updated pld-branding patch - removed obsolete libevent21 patch * Sun Sep 03 2017 Jan Rękorajski <baggins@pld-linux.org> 048deb2
- up to 2.48 - merge translations into main package + rpm -Uhv --nodeps --define '_topdir /tmp/B.asmimkvq' --define '_specdir %{_topdir}' --define '_sourcedir %{_specdir}' --define '_rpmdir %{_topdir}/RPMS' --define '_builddir %{_topdir}/BUILD' seamonkey-2.53.9.1-1.src.rpm Updating / installing... seamonkey-2.53.9.1-1 ######################################## + rm -f seamonkey-2.53.9.1-1.src.rpm + install -m 700 -d /tmp/B.asmimkvq/BUILD/tmp + TMPDIR=/tmp/B.asmimkvq/BUILD/tmp + exec nice -n 0 rpmbuild -bp --short-circuit --nodeps --define '_topdir /tmp/B.asmimkvq' --define '_specdir %{_topdir}' --define '_sourcedir %{_specdir}' --define '_rpmdir %{_topdir}/RPMS' --define '_builddir %{_topdir}/BUILD' --target x86_64-pld-linux --define 'prep exit 0' /tmp/B.asmimkvq/seamonkey.spec warning: Macro expanded in comment on line 1013: %{_datadir}/%{name}/extensions/langpack-lt@seamonkey.mozilla.org.xpi warning: Could not canonicalize hostname: ymir Building target platforms: x86_64-pld-linux Building for target x86_64-pld-linux checking BuildConflict-ing packages rpm: warning: Macro expanded in comment on line 1013: %{_datadir}/%{name}/extensions/langpack-lt@seamonkey.mozilla.org.xpi rpm: rpm: warning: Could not canonicalize hostname: ymir rpm: Building target platforms: x86_64-pld-linux rpm: Building for target x86_64-pld-linux no BuildConflicts found checking BR rpm: warning: Macro expanded in comment on line 1013: %{_datadir}/%{name}/extensions/langpack-lt@seamonkey.mozilla.org.xpi rpm: rpm: warning: Could not canonicalize hostname: ymir rpm: Building target platforms: x86_64-pld-linux rpm: Building for target x86_64-pld-linux no BR needed building RPM using: set -ex; : build-id: d8543d68-c440-4ada-98fe-097405b87f1f; TMPDIR=/tmp/B.asmimkvq/BUILD/tmp exec nice -n 0 rpmbuild -bb --define '_smp_mflags -j9' --define '_make_opts -Otarget' --define '_pld_builder 1' --define '_topdir /tmp/B.asmimkvq' --define '_specdir %{_topdir}' --define '_sourcedir %{_specdir}' --define '_rpmdir %{_topdir}/RPMS' --define '_builddir %{_topdir}/BUILD' --target x86_64-pld-linux /tmp/B.asmimkvq/seamonkey.spec + : build-id: d8543d68-c440-4ada-98fe-097405b87f1f + TMPDIR=/tmp/B.asmimkvq/BUILD/tmp + exec nice -n 0 rpmbuild -bb --define '_smp_mflags -j9' --define '_make_opts -Otarget' --define '_pld_builder 1' --define '_topdir /tmp/B.asmimkvq' --define '_specdir %{_topdir}' --define '_sourcedir %{_specdir}' --define '_rpmdir %{_topdir}/RPMS' --define '_builddir %{_topdir}/BUILD' --target x86_64-pld-linux /tmp/B.asmimkvq/seamonkey.spec warning: Macro expanded in comment on line 1013: %{_datadir}/%{name}/extensions/langpack-lt@seamonkey.mozilla.org.xpi warning: Could not canonicalize hostname: ymir Building target platforms: x86_64-pld-linux Building for target x86_64-pld-linux Executing(%prep): /bin/sh -e /tmp/B.asmimkvq/BUILD/tmp/rpm-tmp.Kyh6E8 + umask 022 + cd /tmp/B.asmimkvq/BUILD + cd /tmp/B.asmimkvq/BUILD + rm -rf seamonkey-2.53.9.1 + /usr/bin/xz -dc /tmp/B.asmimkvq/seamonkey-2.53.9.1.source.tar.xz + /bin/tar -xof - + STATUS=0 + '[' 0 -ne 0 ']' + cd seamonkey-2.53.9.1 + unpack -qq /tmp/B.asmimkvq/seamonkey-2.53.9.1.cs.langpack.xpi + typeset 'args=-qq' 'file=/tmp/B.asmimkvq/seamonkey-2.53.9.1.cs.langpack.xpi' + cp -p /tmp/B.asmimkvq/seamonkey-2.53.9.1.cs.langpack.xpi . + STATUS=0 + '[' 0 -ne 0 ']' + unpack -qq /tmp/B.asmimkvq/seamonkey-2.53.9.1.de.langpack.xpi + typeset 'args=-qq' 'file=/tmp/B.asmimkvq/seamonkey-2.53.9.1.de.langpack.xpi' + cp -p /tmp/B.asmimkvq/seamonkey-2.53.9.1.de.langpack.xpi . + STATUS=0 + '[' 0 -ne 0 ']' + unpack -qq /tmp/B.asmimkvq/seamonkey-2.53.9.1.el.langpack.xpi + typeset 'args=-qq' 'file=/tmp/B.asmimkvq/seamonkey-2.53.9.1.el.langpack.xpi' + cp -p /tmp/B.asmimkvq/seamonkey-2.53.9.1.el.langpack.xpi . + STATUS=0 + '[' 0 -ne 0 ']' + unpack -qq /tmp/B.asmimkvq/seamonkey-2.53.9.1.en-GB.langpack.xpi + typeset 'args=-qq' 'file=/tmp/B.asmimkvq/seamonkey-2.53.9.1.en-GB.langpack.xpi' + cp -p /tmp/B.asmimkvq/seamonkey-2.53.9.1.en-GB.langpack.xpi . + STATUS=0 + '[' 0 -ne 0 ']' + unpack -qq /tmp/B.asmimkvq/seamonkey-2.53.9.1.en-US.langpack.xpi + typeset 'args=-qq' 'file=/tmp/B.asmimkvq/seamonkey-2.53.9.1.en-US.langpack.xpi' + cp -p /tmp/B.asmimkvq/seamonkey-2.53.9.1.en-US.langpack.xpi . + STATUS=0 + '[' 0 -ne 0 ']' + unpack -qq /tmp/B.asmimkvq/seamonkey-2.53.9.1.es-AR.langpack.xpi + typeset 'args=-qq' 'file=/tmp/B.asmimkvq/seamonkey-2.53.9.1.es-AR.langpack.xpi' + cp -p /tmp/B.asmimkvq/seamonkey-2.53.9.1.es-AR.langpack.xpi . + STATUS=0 + '[' 0 -ne 0 ']' + unpack -qq /tmp/B.asmimkvq/seamonkey-2.53.9.1.es-ES.langpack.xpi + typeset 'args=-qq' 'file=/tmp/B.asmimkvq/seamonkey-2.53.9.1.es-ES.langpack.xpi' + cp -p /tmp/B.asmimkvq/seamonkey-2.53.9.1.es-ES.langpack.xpi . + STATUS=0 + '[' 0 -ne 0 ']' + unpack -qq /tmp/B.asmimkvq/seamonkey-2.53.9.1.fi.langpack.xpi + typeset 'args=-qq' 'file=/tmp/B.asmimkvq/seamonkey-2.53.9.1.fi.langpack.xpi' + cp -p /tmp/B.asmimkvq/seamonkey-2.53.9.1.fi.langpack.xpi . + STATUS=0 + '[' 0 -ne 0 ']' + unpack -qq /tmp/B.asmimkvq/seamonkey-2.53.9.1.fr.langpack.xpi + typeset 'args=-qq' 'file=/tmp/B.asmimkvq/seamonkey-2.53.9.1.fr.langpack.xpi' + cp -p /tmp/B.asmimkvq/seamonkey-2.53.9.1.fr.langpack.xpi . + STATUS=0 + '[' 0 -ne 0 ']' + unpack -qq /tmp/B.asmimkvq/seamonkey-2.53.9.1.hu.langpack.xpi + typeset 'args=-qq' 'file=/tmp/B.asmimkvq/seamonkey-2.53.9.1.hu.langpack.xpi' + cp -p /tmp/B.asmimkvq/seamonkey-2.53.9.1.hu.langpack.xpi . + STATUS=0 + '[' 0 -ne 0 ']' + unpack -qq /tmp/B.asmimkvq/seamonkey-2.53.9.1.it.langpack.xpi + typeset 'args=-qq' 'file=/tmp/B.asmimkvq/seamonkey-2.53.9.1.it.langpack.xpi' + cp -p /tmp/B.asmimkvq/seamonkey-2.53.9.1.it.langpack.xpi . + STATUS=0 + '[' 0 -ne 0 ']' + unpack -qq /tmp/B.asmimkvq/seamonkey-2.53.9.1.ja.langpack.xpi + typeset 'args=-qq' 'file=/tmp/B.asmimkvq/seamonkey-2.53.9.1.ja.langpack.xpi' + cp -p /tmp/B.asmimkvq/seamonkey-2.53.9.1.ja.langpack.xpi . + STATUS=0 + '[' 0 -ne 0 ']' + unpack -qq /tmp/B.asmimkvq/seamonkey-2.53.9.1.ka.langpack.xpi + typeset 'args=-qq' 'file=/tmp/B.asmimkvq/seamonkey-2.53.9.1.ka.langpack.xpi' + cp -p /tmp/B.asmimkvq/seamonkey-2.53.9.1.ka.langpack.xpi . + STATUS=0 + '[' 0 -ne 0 ']' + unpack -qq /tmp/B.asmimkvq/seamonkey-2.53.9.1.nb-NO.langpack.xpi + typeset 'args=-qq' 'file=/tmp/B.asmimkvq/seamonkey-2.53.9.1.nb-NO.langpack.xpi' + cp -p /tmp/B.asmimkvq/seamonkey-2.53.9.1.nb-NO.langpack.xpi . + STATUS=0 + '[' 0 -ne 0 ']' + unpack -qq /tmp/B.asmimkvq/seamonkey-2.53.9.1.nl.langpack.xpi + typeset 'args=-qq' 'file=/tmp/B.asmimkvq/seamonkey-2.53.9.1.nl.langpack.xpi' + cp -p /tmp/B.asmimkvq/seamonkey-2.53.9.1.nl.langpack.xpi . + STATUS=0 + '[' 0 -ne 0 ']' + unpack -qq /tmp/B.asmimkvq/seamonkey-2.53.9.1.pl.langpack.xpi + typeset 'args=-qq' 'file=/tmp/B.asmimkvq/seamonkey-2.53.9.1.pl.langpack.xpi' + cp -p /tmp/B.asmimkvq/seamonkey-2.53.9.1.pl.langpack.xpi . + STATUS=0 + '[' 0 -ne 0 ']' + unpack -qq /tmp/B.asmimkvq/seamonkey-2.53.9.1.pt-BR.langpack.xpi + typeset 'args=-qq' 'file=/tmp/B.asmimkvq/seamonkey-2.53.9.1.pt-BR.langpack.xpi' + cp -p /tmp/B.asmimkvq/seamonkey-2.53.9.1.pt-BR.langpack.xpi . + STATUS=0 + '[' 0 -ne 0 ']' + unpack -qq /tmp/B.asmimkvq/seamonkey-2.53.9.1.pt-PT.langpack.xpi + typeset 'args=-qq' 'file=/tmp/B.asmimkvq/seamonkey-2.53.9.1.pt-PT.langpack.xpi' + cp -p /tmp/B.asmimkvq/seamonkey-2.53.9.1.pt-PT.langpack.xpi . + STATUS=0 + '[' 0 -ne 0 ']' + unpack -qq /tmp/B.asmimkvq/seamonkey-2.53.9.1.ru.langpack.xpi + typeset 'args=-qq' 'file=/tmp/B.asmimkvq/seamonkey-2.53.9.1.ru.langpack.xpi' + cp -p /tmp/B.asmimkvq/seamonkey-2.53.9.1.ru.langpack.xpi . + STATUS=0 + '[' 0 -ne 0 ']' + unpack -qq /tmp/B.asmimkvq/seamonkey-2.53.9.1.sk.langpack.xpi + typeset 'args=-qq' 'file=/tmp/B.asmimkvq/seamonkey-2.53.9.1.sk.langpack.xpi' + cp -p /tmp/B.asmimkvq/seamonkey-2.53.9.1.sk.langpack.xpi . + STATUS=0 + '[' 0 -ne 0 ']' + unpack -qq /tmp/B.asmimkvq/seamonkey-2.53.9.1.sv-SE.langpack.xpi + typeset 'args=-qq' 'file=/tmp/B.asmimkvq/seamonkey-2.53.9.1.sv-SE.langpack.xpi' + cp -p /tmp/B.asmimkvq/seamonkey-2.53.9.1.sv-SE.langpack.xpi . + STATUS=0 + '[' 0 -ne 0 ']' + unpack -qq /tmp/B.asmimkvq/seamonkey-2.53.9.1.zh-CN.langpack.xpi + typeset 'args=-qq' 'file=/tmp/B.asmimkvq/seamonkey-2.53.9.1.zh-CN.langpack.xpi' + cp -p /tmp/B.asmimkvq/seamonkey-2.53.9.1.zh-CN.langpack.xpi . + STATUS=0 + '[' 0 -ne 0 ']' + unpack -qq /tmp/B.asmimkvq/seamonkey-2.53.9.1.zh-TW.langpack.xpi + typeset 'args=-qq' 'file=/tmp/B.asmimkvq/seamonkey-2.53.9.1.zh-TW.langpack.xpi' + cp -p /tmp/B.asmimkvq/seamonkey-2.53.9.1.zh-TW.langpack.xpi . + STATUS=0 + '[' 0 -ne 0 ']' + /bin/chmod -Rf a+rX,u+w,g-w,o-w . + echo 'Patch #1 (seamonkey-mozilla-revert-1332139.patch):' Patch #1 (seamonkey-mozilla-revert-1332139.patch): + </tmp/B.asmimkvq/seamonkey-mozilla-revert-1332139.patch + /usr/bin/patch -s -p1 '--fuzz=0' + echo 'Patch #2 (seamonkey-pld-branding.patch):' Patch #2 (seamonkey-pld-branding.patch): + </tmp/B.asmimkvq/seamonkey-pld-branding.patch + /usr/bin/patch -s -p1 '--fuzz=0' + echo 'Patch #3 (seamonkey-enable-addons.patch):' Patch #3 (seamonkey-enable-addons.patch): + </tmp/B.asmimkvq/seamonkey-enable-addons.patch + /usr/bin/patch -s -p1 '--fuzz=0' + echo 'Patch #4 (seamonkey-system-virtualenv.patch):' Patch #4 (seamonkey-system-virtualenv.patch): + </tmp/B.asmimkvq/seamonkey-system-virtualenv.patch + /usr/bin/patch -s -p1 '--fuzz=0' + echo 'Patch #5 (seamonkey-icu-detect.patch):' Patch #5 (seamonkey-icu-detect.patch): + </tmp/B.asmimkvq/seamonkey-icu-detect.patch + /usr/bin/patch -s -p1 '--fuzz=0' + RPM_EC=0 + jobs -p + exit 0 Executing(%build): /bin/sh -e /tmp/B.asmimkvq/BUILD/tmp/rpm-tmp.QzoKq4 TMP=/home/users/builder/tmp HOME=/home/users/builder PATH=/home/users/builder/GNUstep/Tools:/bin:/usr/bin:/usr/local/bin:/home/users/builder/bin TMPDIR=/tmp/B.asmimkvq/BUILD/tmp + umask 022 + cd /tmp/B.asmimkvq/BUILD + cd seamonkey-2.53.9.1 + <<EOF mk_add_options MOZ_OBJDIR=/tmp/B.asmimkvq/BUILD/seamonkey-2.53.9.1/obj-x86_64 export CFLAGS="-O2 -fwrapv -pipe -Wformat -Werror=format-security -gdwarf-4 -fno-debug-types-section -fvar-tracking-assignments -g2 -Wp,-D_FORTIFY_SOURCE=2 -fstack-protector-strong --param=ssp-buffer-size=4 -Werror=trampolines -fPIC -march=x86-64 -mtune=generic -gdwarf-4 -fno-debug-types-section -fvar-tracking-assignments -g2 -D_FILE_OFFSET_BITS=64" export CXXFLAGS="-O2 -fwrapv -pipe -Wformat -Werror=format-security -gdwarf-4 -fno-debug-types-section -fvar-tracking-assignments -g2 -Wp,-D_FORTIFY_SOURCE=2 -fstack-protector-strong --param=ssp-buffer-size=4 -Werror=trampolines -fPIC -march=x86-64 -mtune=generic -gdwarf-4 -fno-debug-types-section -fvar-tracking-assignments -g2 -D_FILE_OFFSET_BITS=64" # Options for 'configure' (same as command-line options). ac_add_options --prefix=/usr ac_add_options --libdir=/usr/lib64 ac_add_options --disable-debug ac_add_options --disable-strip ac_add_options --disable-install-strip ac_add_options --disable-tests ac_add_options --disable-crashreporter ac_add_options --disable-elf-hack ac_add_options --disable-necko-wifi ac_add_options --disable-updater ac_add_options --enable-application=comm/suite ac_add_options --enable-calendar ac_add_options --enable-chrome-format=omni ac_add_options --enable-default-toolkit=cairo-gtk3 ac_add_options --enable-dominspector ac_add_options --enable-extensions=default ac_add_options --enable-irc # breaks build #ac_add_options --enable-shared-js ac_add_options --enable-startup-notification ac_add_options --enable-system-hunspell ac_add_options --with-distribution-id=org.pld-linux ac_add_options --with-system-bz2 ac_add_options --with-system-ffi ac_add_options --with-system-icu ac_add_options --with-system-jpeg ac_add_options --with-system-libevent ac_add_options --with-system-libvpx ac_add_options --with-system-nspr ac_add_options --with-system-nss ac_add_options --with-system-pixman ac_add_options --with-system-png ac_add_options --with-system-zlib EOF + >.mozconfig + cat + /usr/bin/make -Otarget -j9 -j1 build 'AUTOCONF=/usr/bin/autoconf2_13' 'STRIP=/bin/true' 'MOZ_MAKE_FLAGS=-j9' 'installdir=/usr/lib64/seamonkey' 'XLIBS=-lX11 -lXt' 'CC=x86_64-pld-linux-gcc' 'CXX=x86_64-pld-linux-g++' ./mach build Config object not found by mach. 0:00.60 Clobber not needed. 0:00.60 Adding make options from /tmp/B.asmimkvq/BUILD/seamonkey-2.53.9.1/.mozconfig MOZ_OBJDIR=/tmp/B.asmimkvq/BUILD/seamonkey-2.53.9.1/obj-x86_64 OBJDIR=/tmp/B.asmimkvq/BUILD/seamonkey-2.53.9.1/obj-x86_64 FOUND_MOZCONFIG=/tmp/B.asmimkvq/BUILD/seamonkey-2.53.9.1/.mozconfig export FOUND_MOZCONFIG 0:00.61 /usr/bin/gmake -f client.mk -s configure 0:00.62 cd /tmp/B.asmimkvq/BUILD/seamonkey-2.53.9.1/obj-x86_64 0:00.62 /tmp/B.asmimkvq/BUILD/seamonkey-2.53.9.1/configure 0:00.80 Creating Python environment 0:01.92 created virtual environment CPython2.7.18.final.0-64 in 358ms 0:01.92 creator CPython2Posix(dest=/tmp/B.asmimkvq/BUILD/seamonkey-2.53.9.1/obj-x86_64/_virtualenv, clear=False, no_vcs_ignore=False, global=False) 0:01.92 seeder FromAppData(download=False, pip=bundle, wheel=bundle, setuptools=bundle, via=copy, app_data_dir=/home/users/builder/.local/share/virtualenv) 0:01.92 added seed packages: pip==20.3.4, setuptools==44.1.1, wheel==0.37.1 0:01.92 activators NushellActivator,PythonActivator,FishActivator,CShellActivator,PowerShellActivator,BashActivator 0:03.49 running build_ext 0:03.49 building 'psutil._psutil_linux' extension 0:03.49 creating build 0:03.49 creating build/temp.linux-x86_64-2.7 0:03.49 creating build/temp.linux-x86_64-2.7/psutil 0:03.49 x86_64-pld-linux-gcc -fno-strict-aliasing -O2 -fwrapv -pipe -Wformat -Werror=format-security -gdwarf-4 -fno-debug-types-section -fvar-tracking-assignments -g2 -Wp,-D_FORTIFY_SOURCE=2 -fstack-protector-strong --param=ssp-buffer-size=4 -Werror=trampolines -fPIC -march=x86-64 -mtune=generic -gdwarf-4 -fno-debug-types-section -fvar-tracking-assignments -g2 -DNDEBUG -O2 -fwrapv -pipe -Wformat -Werror=format-security -gdwarf-4 -fno-debug-types-section -fvar-tracking-assignments -g2 -Wp,-D_FORTIFY_SOURCE=2 -fstack-protector-strong --param=ssp-buffer-size=4 -Werror=trampolines -fPIC -march=x86-64 -mtune=generic -gdwarf-4 -fno-debug-types-section -fvar-tracking-assignments -g2 -fPIC -DPSUTIL_POSIX=1 -DPSUTIL_VERSION=543 -DPSUTIL_LINUX=1 -I/tmp/B.asmimkvq/BUILD/seamonkey-2.53.9.1/obj-x86_64/_virtualenv/include/python2.7 -c psutil/_psutil_common.c -o build/temp.linux-x86_64-2.7/psutil/_psutil_common.o 0:03.49 x86_64-pld-linux-gcc -fno-strict-aliasing -O2 -fwrapv -pipe -Wformat -Werror=format-security -gdwarf-4 -fno-debug-types-section -fvar-tracking-assignments -g2 -Wp,-D_FORTIFY_SOURCE=2 -fstack-protector-strong --param=ssp-buffer-size=4 -Werror=trampolines -fPIC -march=x86-64 -mtune=generic -gdwarf-4 -fno-debug-types-section -fvar-tracking-assignments -g2 -DNDEBUG -O2 -fwrapv -pipe -Wformat -Werror=format-security -gdwarf-4 -fno-debug-types-section -fvar-tracking-assignments -g2 -Wp,-D_FORTIFY_SOURCE=2 -fstack-protector-strong --param=ssp-buffer-size=4 -Werror=trampolines -fPIC -march=x86-64 -mtune=generic -gdwarf-4 -fno-debug-types-section -fvar-tracking-assignments -g2 -fPIC -DPSUTIL_POSIX=1 -DPSUTIL_VERSION=543 -DPSUTIL_LINUX=1 -I/tmp/B.asmimkvq/BUILD/seamonkey-2.53.9.1/obj-x86_64/_virtualenv/include/python2.7 -c psutil/_psutil_posix.c -o build/temp.linux-x86_64-2.7/psutil/_psutil_posix.o 0:03.49 x86_64-pld-linux-gcc -fno-strict-aliasing -O2 -fwrapv -pipe -Wformat -Werror=format-security -gdwarf-4 -fno-debug-types-section -fvar-tracking-assignments -g2 -Wp,-D_FORTIFY_SOURCE=2 -fstack-protector-strong --param=ssp-buffer-size=4 -Werror=trampolines -fPIC -march=x86-64 -mtune=generic -gdwarf-4 -fno-debug-types-section -fvar-tracking-assignments -g2 -DNDEBUG -O2 -fwrapv -pipe -Wformat -Werror=format-security -gdwarf-4 -fno-debug-types-section -fvar-tracking-assignments -g2 -Wp,-D_FORTIFY_SOURCE=2 -fstack-protector-strong --param=ssp-buffer-size=4 -Werror=trampolines -fPIC -march=x86-64 -mtune=generic -gdwarf-4 -fno-debug-types-section -fvar-tracking-assignments -g2 -fPIC -DPSUTIL_POSIX=1 -DPSUTIL_VERSION=543 -DPSUTIL_LINUX=1 -I/tmp/B.asmimkvq/BUILD/seamonkey-2.53.9.1/obj-x86_64/_virtualenv/include/python2.7 -c psutil/_psutil_linux.c -o build/temp.linux-x86_64-2.7/psutil/_psutil_linux.o 0:03.49 creating build/lib.linux-x86_64-2.7 0:03.49 creating build/lib.linux-x86_64-2.7/psutil 0:03.49 x86_64-pld-linux-gcc -shared -Wl,--as-needed -Wl,--no-copy-dt-needed-entries -Wl,-z,relro -Wl,-z,combreloc build/temp.linux-x86_64-2.7/psutil/_psutil_common.o build/temp.linux-x86_64-2.7/psutil/_psutil_posix.o build/temp.linux-x86_64-2.7/psutil/_psutil_linux.o -L/usr/lib64 -lpython2.7 -o build/lib.linux-x86_64-2.7/psutil/_psutil_linux.so 0:03.49 building 'psutil._psutil_posix' extension 0:03.49 x86_64-pld-linux-gcc -fno-strict-aliasing -O2 -fwrapv -pipe -Wformat -Werror=format-security -gdwarf-4 -fno-debug-types-section -fvar-tracking-assignments -g2 -Wp,-D_FORTIFY_SOURCE=2 -fstack-protector-strong --param=ssp-buffer-size=4 -Werror=trampolines -fPIC -march=x86-64 -mtune=generic -gdwarf-4 -fno-debug-types-section -fvar-tracking-assignments -g2 -DNDEBUG -O2 -fwrapv -pipe -Wformat -Werror=format-security -gdwarf-4 -fno-debug-types-section -fvar-tracking-assignments -g2 -Wp,-D_FORTIFY_SOURCE=2 -fstack-protector-strong --param=ssp-buffer-size=4 -Werror=trampolines -fPIC -march=x86-64 -mtune=generic -gdwarf-4 -fno-debug-types-section -fvar-tracking-assignments -g2 -fPIC -DPSUTIL_POSIX=1 -DPSUTIL_VERSION=543 -DPSUTIL_LINUX=1 -I/tmp/B.asmimkvq/BUILD/seamonkey-2.53.9.1/obj-x86_64/_virtualenv/include/python2.7 -c psutil/_psutil_common.c -o build/temp.linux-x86_64-2.7/psutil/_psutil_common.o 0:03.49 x86_64-pld-linux-gcc -fno-strict-aliasing -O2 -fwrapv -pipe -Wformat -Werror=format-security -gdwarf-4 -fno-debug-types-section -fvar-tracking-assignments -g2 -Wp,-D_FORTIFY_SOURCE=2 -fstack-protector-strong --param=ssp-buffer-size=4 -Werror=trampolines -fPIC -march=x86-64 -mtune=generic -gdwarf-4 -fno-debug-types-section -fvar-tracking-assignments -g2 -DNDEBUG -O2 -fwrapv -pipe -Wformat -Werror=format-security -gdwarf-4 -fno-debug-types-section -fvar-tracking-assignments -g2 -Wp,-D_FORTIFY_SOURCE=2 -fstack-protector-strong --param=ssp-buffer-size=4 -Werror=trampolines -fPIC -march=x86-64 -mtune=generic -gdwarf-4 -fno-debug-types-section -fvar-tracking-assignments -g2 -fPIC -DPSUTIL_POSIX=1 -DPSUTIL_VERSION=543 -DPSUTIL_LINUX=1 -I/tmp/B.asmimkvq/BUILD/seamonkey-2.53.9.1/obj-x86_64/_virtualenv/include/python2.7 -c psutil/_psutil_posix.c -o build/temp.linux-x86_64-2.7/psutil/_psutil_posix.o 0:03.50 x86_64-pld-linux-gcc -shared -Wl,--as-needed -Wl,--no-copy-dt-needed-entries -Wl,-z,relro -Wl,-z,combreloc build/temp.linux-x86_64-2.7/psutil/_psutil_common.o build/temp.linux-x86_64-2.7/psutil/_psutil_posix.o -L/usr/lib64 -lpython2.7 -o build/lib.linux-x86_64-2.7/psutil/_psutil_posix.so 0:03.50 copying build/lib.linux-x86_64-2.7/psutil/_psutil_linux.so -> psutil 0:03.50 copying build/lib.linux-x86_64-2.7/psutil/_psutil_posix.so -> psutil 0:03.50 Traceback (most recent call last): 0:03.50 File "/tmp/B.asmimkvq/BUILD/seamonkey-2.53.9.1/python/mozbuild/mozbuild/virtualenv.py", line 565, in <module> 0:03.50 manager.populate() 0:03.50 File "/tmp/B.asmimkvq/BUILD/seamonkey-2.53.9.1/python/mozbuild/mozbuild/virtualenv.py", line 390, in populate 0:03.50 handle_package(package) 0:03.50 File "/tmp/B.asmimkvq/BUILD/seamonkey-2.53.9.1/python/mozbuild/mozbuild/virtualenv.py", line 285, in handle_package 0:03.50 submanager.populate() 0:03.50 File "/tmp/B.asmimkvq/BUILD/seamonkey-2.53.9.1/python/mozbuild/mozbuild/virtualenv.py", line 394, in populate 0:03.50 with open(sitecustomize, 'w') as f: 0:03.50 IOError: [Errno 13] Permission denied: u'/usr/lib64/python2.7/sitecustomize.py' 0:03.50 Traceback (most recent call last): 0:03.50 File "/tmp/B.asmimkvq/BUILD/seamonkey-2.53.9.1/configure.py", line 124, in <module> 0:03.50 sys.exit(main(sys.argv)) 0:03.50 File "/tmp/B.asmimkvq/BUILD/seamonkey-2.53.9.1/configure.py", line 29, in main 0:03.50 sandbox.run(os.path.join(os.path.dirname(__file__), 'moz.configure')) 0:03.50 File "/tmp/B.asmimkvq/BUILD/seamonkey-2.53.9.1/python/mozbuild/mozbuild/configure/__init__.py", line 425, in run 0:03.50 self.include_file(path) 0:03.50 File "/tmp/B.asmimkvq/BUILD/seamonkey-2.53.9.1/python/mozbuild/mozbuild/configure/__init__.py", line 416, in include_file 0:03.50 exec_(code, self) 0:03.50 File "/tmp/B.asmimkvq/BUILD/seamonkey-2.53.9.1/python/mozbuild/mozbuild/util.py", line 59, in exec_ 0:03.50 exec(object, globals, locals) 0:03.50 File "/tmp/B.asmimkvq/BUILD/seamonkey-2.53.9.1/moz.configure", line 7, in <module> 0:03.50 include('build/moz.configure/init.configure') 0:03.50 File "/tmp/B.asmimkvq/BUILD/seamonkey-2.53.9.1/python/mozbuild/mozbuild/configure/__init__.py", line 718, in include_impl 0:03.50 self.include_file(what) 0:03.50 File "/tmp/B.asmimkvq/BUILD/seamonkey-2.53.9.1/python/mozbuild/mozbuild/configure/__init__.py", line 416, in include_file 0:03.50 exec_(code, self) 0:03.50 File "/tmp/B.asmimkvq/BUILD/seamonkey-2.53.9.1/python/mozbuild/mozbuild/util.py", line 59, in exec_ 0:03.50 exec(object, globals, locals) 0:03.50 File "/tmp/B.asmimkvq/BUILD/seamonkey-2.53.9.1/build/moz.configure/init.configure", line 207, in <module> 0:03.50 @imports('distutils.sysconfig') 0:03.50 File "/tmp/B.asmimkvq/BUILD/seamonkey-2.53.9.1/python/mozbuild/mozbuild/configure/__init__.py", line 701, in decorator 0:03.50 depends = DependsFunction(self, func, dependencies, when=when) 0:03.50 File "/tmp/B.asmimkvq/BUILD/seamonkey-2.53.9.1/python/mozbuild/mozbuild/configure/__init__.py", line 121, in __init__ 0:03.50 sandbox._value_for(self) 0:03.50 File "/tmp/B.asmimkvq/BUILD/seamonkey-2.53.9.1/python/mozbuild/mozbuild/configure/__init__.py", line 500, in _value_for 0:03.50 return self._value_for_depends(obj) 0:03.50 File "/tmp/B.asmimkvq/BUILD/seamonkey-2.53.9.1/python/mozbuild/mozbuild/util.py", line 944, in method_call 0:03.50 cache[args] = self.func(instance, *args) 0:03.50 File "/tmp/B.asmimkvq/BUILD/seamonkey-2.53.9.1/python/mozbuild/mozbuild/configure/__init__.py", line 509, in _value_for_depends 0:03.50 return obj.result() 0:03.50 File "/tmp/B.asmimkvq/BUILD/seamonkey-2.53.9.1/python/mozbuild/mozbuild/util.py", line 944, in method_call 0:03.50 cache[args] = self.func(instance, *args) 0:03.50 File "/tmp/B.asmimkvq/BUILD/seamonkey-2.53.9.1/python/mozbuild/mozbuild/configure/__init__.py", line 147, in result 0:03.50 return self._func(*resolved_args) 0:03.50 File "/tmp/B.asmimkvq/BUILD/seamonkey-2.53.9.1/python/mozbuild/mozbuild/configure/__init__.py", line 1027, in wrapped 0:03.50 return new_func(*args, **kwargs) 0:03.50 File "/tmp/B.asmimkvq/BUILD/seamonkey-2.53.9.1/build/moz.configure/init.configure", line 255, in virtualenv_python 0:03.51 manager.build(python) 0:03.51 File "/tmp/B.asmimkvq/BUILD/seamonkey-2.53.9.1/python/mozbuild/mozbuild/virtualenv.py", line 449, in build 0:03.51 raise Exception('Error populating virtualenv.') 0:03.51 Exception: Error populating virtualenv. 0:03.51 *** Fix above errors and then restart with\ 0:03.51 "./mach build" 0:03.51 gmake[1]: *** [client.mk:109: configure] Error 1 make: *** [GNUmakefile:9: build] Error 2 error: Bad exit status from /tmp/B.asmimkvq/BUILD/tmp/rpm-tmp.QzoKq4 (%build) RPM build errors: Macro expanded in comment on line 1013: %{_datadir}/%{name}/extensions/langpack-lt@seamonkey.mozilla.org.xpi Could not canonicalize hostname: ymir Bad exit status from /tmp/B.asmimkvq/BUILD/tmp/rpm-tmp.QzoKq4 (%build) ended at: Fri Jan 14 20:43:37 2022, done in 0:01:13.712102 error: No files produced. + chmod -R u+rwX /tmp/B.asmimkvq/BUILD + rm -rf /tmp/B.asmimkvq/tmp /tmp/B.asmimkvq/BUILD + rm -rf /tmp/B.asmimkvq Begin-PLD-Builder-Info Build-Time: user:32.03s sys:27.84s real:122.18s (faults io:3 non-io:246129) End-PLD-Builder-Info
[Back to list of logs] [View rpm -qa of builder]