FailedOk

th/SRPMS[OK]
th/x32[OK]
th/i686[OK]
th/x86_64[OK]

ac/SRPMS[OK]
ac/i386[OK]
ac/i586[OK]
ac/i686[OK]
ac/alpha[OK]
ac/amd64[OK]
ac/athlon[OK]
ac/ppc[OK]
ac/sparc[OK]
ac/sparc64[OK]

Advanced Search
main()
Powered by PLD Linux
(c) 2002-2021 PLD Team
$Revision: 1.37 $
Powered by matrix.
Your IP: 3.234.211.61

tf d4f6ea2b-f745-412d-9eb6-b7ee4429ad40

Status:Failed
Source URL:https://buildlogs.pld-linux.org/pld/th/x86_64/FAIL/tf,d4f6ea2b-f745-412d-9eb6-b7ee4429ad40.bz2
text/plain URL:View!
full text:View!
rpm -qa of builder:View!
Date:2021/09/27 03:39:18
Runtime:0:00:09.774698

Toc:

  • error 1
  • collect2: error: ld returned 1 exit status
  • error 2
  • make[1]: *** [Makefile:160: tf] Error 1
  • error 3
  • error: Bad exit status from /tmp/B.8ttaeri3/BUILD/tmp/rpm-tmp.hszzWb (%build)
  • error 4
  • RPM build errors:
  • error 5
  • error: No files produced.

Content:

/usr/include/string.h:140:12: note: in a call to function 'strcmp' declared 'nonnull'
  140 | extern int strcmp (const char *__s1, const char *__s2)
      |            ^~~~~~
make[1]: Leaving directory '/tmp/B.8ttaeri3/BUILD/tf-50b8/src'
make[1]: Entering directory '/tmp/B.8ttaeri3/BUILD/tf-50b8/src'
x86_64-pld-linux-gcc -O2 -fwrapv -pipe -Wformat -Werror=format-security -gdwarf-4 -fno-debug-types-section -fvar-tracking-assignments -g2 -Wp,-D_FORTIFY_SOURCE=2 -fstack-protector-strong --param=ssp-buffer-size=4 -Werror=trampolines -fPIC -march=x86-64 -mtune=generic -gdwarf-4 -fno-debug-types-section -fvar-tracking-assignments -g2   -DDATADIR=/usr/share   -c -o socket.o socket.c
In file included from socket.c:64:
socket.c: In function 'opensock':
util.h:32:37: warning: argument 1 null where non-null expected [-Wnonnull]
   32 | #define STRDUP(src)  STRNDUP((src), strlen(src))
      |                                     ^~~~~~
util.h:31:28: note: in definition of macro 'STRNDUP'
   31 |     (strcpy(xmalloc(NULL, (len) + 1, __FILE__, __LINE__), (src)))
      |                            ^~~
socket.c:1285:23: note: in expansion of macro 'STRDUP'
 1285 |         xsock->host = STRDUP(proxy_host);
      |                       ^~~~~~
In file included from port.h:85,
                 from socket.c:62:
/usr/include/string.h:391:15: note: in a call to function 'strlen' declared 'nonnull'
  391 | extern size_t strlen (const char *__s)
      |               ^~~~~~
In file included from socket.c:64:
util.h:31:6: warning: argument 2 null where non-null expected [-Wnonnull]
   31 |     (strcpy(xmalloc(NULL, (len) + 1, __FILE__, __LINE__), (src)))
      |      ^~~~~~
util.h:32:22: note: in expansion of macro 'STRNDUP'
   32 | #define STRDUP(src)  STRNDUP((src), strlen(src))
      |                      ^~~~~~~
socket.c:1285:23: note: in expansion of macro 'STRDUP'
 1285 |         xsock->host = STRDUP(proxy_host);
      |                       ^~~~~~
In file included from /usr/include/features.h:488,
                 from /usr/include/assert.h:35,
                 from tfconfig.h:106,
                 from socket.c:21:
/usr/include/bits/string_fortified.h:77:1: note: in a call to function 'strcpy' declared 'nonnull'
   77 | __NTH (strcpy (char *__restrict __dest, const char *__restrict __src))
      | ^~~~~
In file included from socket.c:64:
util.h:32:37: warning: argument 1 null where non-null expected [-Wnonnull]
   32 | #define STRDUP(src)  STRNDUP((src), strlen(src))
      |                                     ^~~~~~
util.h:31:28: note: in definition of macro 'STRNDUP'
   31 |     (strcpy(xmalloc(NULL, (len) + 1, __FILE__, __LINE__), (src)))
      |                            ^~~
socket.c:1299:25: note: in expansion of macro 'STRDUP'
 1299 |         xsock->myhost = STRDUP(tfhost);
      |                         ^~~~~~
In file included from port.h:85,
                 from socket.c:62:
/usr/include/string.h:391:15: note: in a call to function 'strlen' declared 'nonnull'
  391 | extern size_t strlen (const char *__s)
      |               ^~~~~~
In file included from socket.c:64:
util.h:31:6: warning: argument 2 null where non-null expected [-Wnonnull]
   31 |     (strcpy(xmalloc(NULL, (len) + 1, __FILE__, __LINE__), (src)))
      |      ^~~~~~
util.h:32:22: note: in expansion of macro 'STRNDUP'
   32 | #define STRDUP(src)  STRNDUP((src), strlen(src))
      |                      ^~~~~~~
socket.c:1299:25: note: in expansion of macro 'STRDUP'
 1299 |         xsock->myhost = STRDUP(tfhost);
      |                         ^~~~~~
In file included from /usr/include/features.h:488,
                 from /usr/include/assert.h:35,
                 from tfconfig.h:106,
                 from socket.c:21:
/usr/include/bits/string_fortified.h:77:1: note: in a call to function 'strcpy' declared 'nonnull'
   77 | __NTH (strcpy (char *__restrict __dest, const char *__restrict __src))
      | ^~~~~
socket.c: In function 'handle_socket_lines':
socket.c:2603:27: warning: assignment to 'String *' from incompatible pointer type 'conString *' [-Wincompatible-pointer-types]
 2603 |             incoming_text = line;
      |                           ^
socket.c: In function 'openconn':
socket.c:1468:13: warning: ignoring return value of 'read' declared with attribute 'warn_unused_result' [-Wunused-result]
 1468 |             read(xsock->fd, (char*)xsock->addrs, info.size);
      |             ^~~~~~~~~~~~~~~~~~~~~~~~~~~~~~~~~~~~~~~~~~~~~~~
socket.c: In function 'waitforhostname':
socket.c:1794:9: warning: ignoring return value of 'writev' declared with attribute 'warn_unused_result' [-Wunused-result]
 1794 |         writev(fd, iov, niov);
      |         ^~~~~~~~~~~~~~~~~~~~~
socket.c:1798:9: warning: ignoring return value of 'write' declared with attribute 'warn_unused_result' [-Wunused-result]
 1798 |         write(fd, &hdr, sizeof(hdr));
      |         ^~~~~~~~~~~~~~~~~~~~~~~~~~~~
make[1]: Leaving directory '/tmp/B.8ttaeri3/BUILD/tf-50b8/src'
make[1]: Entering directory '/tmp/B.8ttaeri3/BUILD/tf-50b8/src'
x86_64-pld-linux-gcc -Wl,--as-needed -Wl,--no-copy-dt-needed-entries -Wl,-z,relro -Wl,-z,combreloc   -o tf attr.o command.o dstring.o expand.o expr.o help.o history.o keyboard.o macro.o main.o malloc.o output.o pattern.o process.o search.o signals.o socket.o tfio.o tty.o util.o variable.o world.o  -lz -lm -lncurses -lnet  -lssl -lcrypto -lpcre
/usr/bin/ld: expand.o:/tmp/B.8ttaeri3/BUILD/tf-50b8/src/socket.h:24: multiple definition of `world_decl'; command.o:/tmp/B.8ttaeri3/BUILD/tf-50b8/src/socket.h:24: first defined here
/usr/bin/ld: expr.o:/tmp/B.8ttaeri3/BUILD/tf-50b8/src/socket.h:24: multiple definition of `world_decl'; command.o:/tmp/B.8ttaeri3/BUILD/tf-50b8/src/socket.h:24: first defined here
/usr/bin/ld: history.o:/tmp/B.8ttaeri3/BUILD/tf-50b8/src/socket.h:24: multiple definition of `world_decl'; command.o:/tmp/B.8ttaeri3/BUILD/tf-50b8/src/socket.h:24: first defined here
/usr/bin/ld: macro.o:/tmp/B.8ttaeri3/BUILD/tf-50b8/src/socket.h:24: multiple definition of `world_decl'; command.o:/tmp/B.8ttaeri3/BUILD/tf-50b8/src/socket.h:24: first defined here
/usr/bin/ld: main.o:/tmp/B.8ttaeri3/BUILD/tf-50b8/src/socket.h:24: multiple definition of `world_decl'; command.o:/tmp/B.8ttaeri3/BUILD/tf-50b8/src/socket.h:24: first defined here
/usr/bin/ld: output.o:/tmp/B.8ttaeri3/BUILD/tf-50b8/src/socket.h:24: multiple definition of `world_decl'; command.o:/tmp/B.8ttaeri3/BUILD/tf-50b8/src/socket.h:24: first defined here
/usr/bin/ld: process.o:/tmp/B.8ttaeri3/BUILD/tf-50b8/src/socket.h:24: multiple definition of `world_decl'; command.o:/tmp/B.8ttaeri3/BUILD/tf-50b8/src/socket.h:24: first defined here
/usr/bin/ld: socket.o:/tmp/B.8ttaeri3/BUILD/tf-50b8/src/socket.h:24: multiple definition of `world_decl'; command.o:/tmp/B.8ttaeri3/BUILD/tf-50b8/src/socket.h:24: first defined here
/usr/bin/ld: variable.o:/tmp/B.8ttaeri3/BUILD/tf-50b8/src/socket.h:24: multiple definition of `world_decl'; command.o:/tmp/B.8ttaeri3/BUILD/tf-50b8/src/socket.h:24: first defined here
/usr/bin/ld: world.o:/tmp/B.8ttaeri3/BUILD/tf-50b8/src/socket.h:24: multiple definition of `world_decl'; command.o:/tmp/B.8ttaeri3/BUILD/tf-50b8/src/socket.h:24: first defined here
collect2: error: ld returned 1 exit status
make[1]: *** [Makefile:160: tf] Error 1
make[1]: Leaving directory '/tmp/B.8ttaeri3/BUILD/tf-50b8/src'
make: *** [Makefile:18: files] Error 2
error: Bad exit status from /tmp/B.8ttaeri3/BUILD/tmp/rpm-tmp.hszzWb (%build)


RPM build errors:
    Could not canonicalize hostname: ymir
    Bad exit status from /tmp/B.8ttaeri3/BUILD/tmp/rpm-tmp.hszzWb (%build)
ended at: Mon Sep 27 03:39:17 2021, done in 0:00:09.774698
error: No files produced.
+ chmod -R u+rwX /tmp/B.8ttaeri3/BUILD
+ rm -rf /tmp/B.8ttaeri3/tmp /tmp/B.8ttaeri3/BUILD
+ rm -rf /tmp/B.8ttaeri3
Begin-PLD-Builder-Info
Build-Time: user:18.72s sys:3.55s real:11.60s (faults io:5 non-io:920487)

End-PLD-Builder-Info
[Back to list of logs] [View rpm -qa of builder]