FailedOk

th/SRPMS[OK]
th/x32[OK]
th/i686[OK]
th/x86_64[OK]

ac/SRPMS[OK]
ac/i386[OK]
ac/i586[OK]
ac/i686[OK]
ac/alpha[OK]
ac/amd64[OK]
ac/athlon[OK]
ac/ppc[OK]
ac/sparc[OK]
ac/sparc64[OK]

Advanced Search
main()
Powered by PLD Linux
(c) 2002-2021 PLD Team
$Revision: 1.37 $
Powered by ITS.
Your IP: 35.175.107.77

tor 0e0cfcff-bef6-4dae-94e9-266f2c904124

Status:Failed
Source URL:https://buildlogs.pld-linux.org/pld/th/x86_64/FAIL/tor,0e0cfcff-bef6-4dae-94e9-266f2c904124.bz2
text/plain URL:View!
full text:View!
rpm -qa of builder:View!
Date:2021/09/27 03:40:00
Runtime:0:00:39.656585

Toc:

  • error 1
  • src/common/tortls.c:1855:3: error: missing binary operator before token "1"
  • error 2
  • make[1]: *** [Makefile:6707: src/common/libor_crypto_testing_a-tortls.o] Error 1
  • error 3
  • error: Bad exit status from /tmp/B.dr54o7_8/BUILD/tmp/rpm-tmp.16vz3M (%build)
  • error 4
  • RPM build errors:
  • error 5
  • error: No files produced.

Content:

/usr/include/openssl/ec.h:180:40: note: declared here
  180 | OSSL_DEPRECATEDIN_3_0 const EC_METHOD *EC_GROUP_method_of(const EC_GROUP *group);
      |                                        ^~~~~~~~~~~~~~~~~~
src/common/tortls.c:403:7: warning: 'EC_GFp_simple_method' is deprecated: Since OpenSSL 3.0 [-Wdeprecated-declarations]
  403 |       const int warn = (m == EC_GFp_simple_method() ||
      |       ^~~~~
In file included from /usr/include/openssl/x509.h:33,
                 from /usr/include/openssl/ssl.h:31,
                 from src/common/tortls.c:43:
/usr/include/openssl/ec.h:119:40: note: declared here
  119 | OSSL_DEPRECATEDIN_3_0 const EC_METHOD *EC_GFp_simple_method(void);
      |                                        ^~~~~~~~~~~~~~~~~~~~
src/common/tortls.c:404:25: warning: 'EC_GFp_mont_method' is deprecated: Since OpenSSL 3.0 [-Wdeprecated-declarations]
  404 |                         m == EC_GFp_mont_method() ||
      |                         ^
In file included from /usr/include/openssl/x509.h:33,
                 from /usr/include/openssl/ssl.h:31,
                 from src/common/tortls.c:43:
/usr/include/openssl/ec.h:124:40: note: declared here
  124 | OSSL_DEPRECATEDIN_3_0 const EC_METHOD *EC_GFp_mont_method(void);
      |                                        ^~~~~~~~~~~~~~~~~~
src/common/tortls.c:405:25: warning: 'EC_GFp_nist_method' is deprecated: Since OpenSSL 3.0 [-Wdeprecated-declarations]
  405 |                         m == EC_GFp_nist_method());
      |                         ^
In file included from /usr/include/openssl/x509.h:33,
                 from /usr/include/openssl/ssl.h:31,
                 from src/common/tortls.c:43:
/usr/include/openssl/ec.h:129:40: note: declared here
  129 | OSSL_DEPRECATEDIN_3_0 const EC_METHOD *EC_GFp_nist_method(void);
      |                                        ^~~~~~~~~~~~~~~~~~
src/common/tortls.c:406:7: warning: 'EC_KEY_free' is deprecated: Since OpenSSL 3.0 [-Wdeprecated-declarations]
  406 |       EC_KEY_free(key);
      |       ^~~~~~~~~~~
In file included from /usr/include/openssl/x509.h:33,
                 from /usr/include/openssl/ssl.h:31,
                 from src/common/tortls.c:43:
/usr/include/openssl/ec.h:1001:28: note: declared here
 1001 | OSSL_DEPRECATEDIN_3_0 void EC_KEY_free(EC_KEY *key);
      |                            ^~~~~~~~~~~
src/common/tortls.c: In function 'tor_x509_cert_new__real':
src/common/tortls.c:742:7: warning: 'EVP_PKEY_get1_RSA' is deprecated: Since OpenSSL 3.0 [-Wdeprecated-declarations]
  742 |       (rsa = EVP_PKEY_get1_RSA(pkey))) {
      |       ^
In file included from /usr/include/openssl/x509.h:29,
                 from /usr/include/openssl/ssl.h:31,
                 from src/common/tortls.c:43:
/usr/include/openssl/evp.h:1348:16: note: declared here
 1348 | struct rsa_st *EVP_PKEY_get1_RSA(EVP_PKEY *pkey);
      |                ^~~~~~~~~~~~~~~~~
src/common/tortls.c: In function 'tor_tls_cert_get_key':
src/common/tortls.c:907:3: warning: 'EVP_PKEY_get1_RSA' is deprecated: Since OpenSSL 3.0 [-Wdeprecated-declarations]
  907 |   rsa = EVP_PKEY_get1_RSA(pkey);
      |   ^~~
In file included from /usr/include/openssl/x509.h:29,
                 from /usr/include/openssl/ssl.h:31,
                 from src/common/tortls.c:43:
/usr/include/openssl/evp.h:1348:16: note: declared here
 1348 | struct rsa_st *EVP_PKEY_get1_RSA(EVP_PKEY *pkey);
      |                ^~~~~~~~~~~~~~~~~
src/common/tortls.c: In function 'tor_tls_cert_matches_key__real':
src/common/tortls.c:934:3: warning: 'EVP_PKEY_cmp' is deprecated: Since OpenSSL 3.0 [-Wdeprecated-declarations]
  934 |   result = link_key && cert_key && EVP_PKEY_cmp(cert_key, link_key) == 1;
      |   ^~~~~~
In file included from /usr/include/openssl/x509.h:29,
                 from /usr/include/openssl/ssl.h:31,
                 from src/common/tortls.c:43:
/usr/include/openssl/evp.h:1418:5: note: declared here
 1418 | int EVP_PKEY_cmp(const EVP_PKEY *a, const EVP_PKEY *b);
      |     ^~~~~~~~~~~~
src/common/tortls.c: In function 'tor_tls_cert_is_valid':
src/common/tortls.c:980:5: warning: 'EVP_PKEY_get1_RSA' is deprecated: Since OpenSSL 3.0 [-Wdeprecated-declarations]
  980 |     RSA *rsa = EVP_PKEY_get1_RSA(cert_key);
      |     ^~~
In file included from /usr/include/openssl/x509.h:29,
                 from /usr/include/openssl/ssl.h:31,
                 from src/common/tortls.c:43:
/usr/include/openssl/evp.h:1348:16: note: declared here
 1348 | struct rsa_st *EVP_PKEY_get1_RSA(EVP_PKEY *pkey);
      |                ^~~~~~~~~~~~~~~~~
src/common/tortls.c:982:5: warning: 'RSA_bits' is deprecated: Since OpenSSL 3.0 [-Wdeprecated-declarations]
  982 |     if (rsa && RSA_bits(rsa) == 1024)
      |     ^~
In file included from /usr/include/openssl/x509.h:36,
                 from /usr/include/openssl/ssl.h:31,
                 from src/common/tortls.c:43:
/usr/include/openssl/rsa.h:203:27: note: declared here
  203 | OSSL_DEPRECATEDIN_3_0 int RSA_bits(const RSA *rsa);
      |                           ^~~~~~~~
src/common/tortls.c:988:7: warning: 'RSA_free' is deprecated: Since OpenSSL 3.0 [-Wdeprecated-declarations]
  988 |       RSA_free(rsa);
      |       ^~~~~~~~
In file included from /usr/include/openssl/x509.h:36,
                 from /usr/include/openssl/ssl.h:31,
                 from src/common/tortls.c:43:
/usr/include/openssl/rsa.h:293:28: note: declared here
  293 | OSSL_DEPRECATEDIN_3_0 void RSA_free(RSA *r);
      |                            ^~~~~~~~
In file included from src/common/tortls.c:43:
src/common/tortls.c: In function 'tor_tls_assert_renegotiation_unblocked':
src/common/tortls.c:1855:3: error: missing binary operator before token "1"
 1855 |   SSL_OP_ALLOW_UNSAFE_LEGACY_RENEGOTIATION != 0
      |   ^~~~~~~~~~~~~~~~~~~~~~~~~~~~~~~~~~~~~~~~
src/common/tortls.c: In function 'tor_tls_verify':
src/common/tortls.c:2303:3: warning: 'EVP_PKEY_get1_RSA' is deprecated: Since OpenSSL 3.0 [-Wdeprecated-declarations]
 2303 |   rsa = EVP_PKEY_get1_RSA(id_pkey);
      |   ^~~
In file included from /usr/include/openssl/x509.h:29,
                 from /usr/include/openssl/ssl.h:31,
                 from src/common/tortls.c:43:
/usr/include/openssl/evp.h:1348:16: note: declared here
 1348 | struct rsa_st *EVP_PKEY_get1_RSA(EVP_PKEY *pkey);
      |                ^~~~~~~~~~~~~~~~~
src/common/tortls.c: In function 'evaluate_ecgroup_for_tls':
src/common/tortls.c:2726:3: warning: 'EC_KEY_new_by_curve_name' is deprecated: Since OpenSSL 3.0 [-Wdeprecated-declarations]
 2726 |   ec_key = EC_KEY_new_by_curve_name(nid);
      |   ^~~~~~
In file included from /usr/include/openssl/x509.h:33,
                 from /usr/include/openssl/ssl.h:31,
                 from src/common/tortls.c:43:
/usr/include/openssl/ec.h:996:31: note: declared here
  996 | OSSL_DEPRECATEDIN_3_0 EC_KEY *EC_KEY_new_by_curve_name(int nid);
      |                               ^~~~~~~~~~~~~~~~~~~~~~~~
src/common/tortls.c:2728:3: warning: 'EC_KEY_free' is deprecated: Since OpenSSL 3.0 [-Wdeprecated-declarations]
 2728 |   EC_KEY_free(ec_key);
      |   ^~~~~~~~~~~
In file included from /usr/include/openssl/x509.h:33,
                 from /usr/include/openssl/ssl.h:31,
                 from src/common/tortls.c:43:
/usr/include/openssl/ec.h:1001:28: note: declared here
 1001 | OSSL_DEPRECATEDIN_3_0 void EC_KEY_free(EC_KEY *key);
      |                            ^~~~~~~~~~~
make[1]: *** [Makefile:6707: src/common/libor_crypto_testing_a-tortls.o] Error 1
make[1]: Leaving directory '/tmp/B.dr54o7_8/BUILD/tor-0.3.4.11'
make[1]: *** Waiting for unfinished jobs....
make[1]: Entering directory '/tmp/B.dr54o7_8/BUILD/tor-0.3.4.11'
x86_64-pld-linux-gcc -DHAVE_CONFIG_H -I.  -I./src/ext -Isrc/ext -I./src/ext/trunnel -I./src/trunnel -I./src/common -Isrc/common -I./src/ext/trunnel -I./src/trunnel -I./src/or -Isrc/or -DSHARE_DATADIR="\"/usr/share\"" -DLOCALSTATEDIR="\"/var\"" -DBINDIR="\"/usr/bin\"" -I./src -DTOR_UNIT_TESTS  -DHAVE_MODULE_DIRAUTH=1 -I./src/common      -O2 -fwrapv -pipe -Wformat -Werror=format-security -gdwarf-4 -fno-debug-types-section -fvar-tracking-assignments -g2 -Wp,-D_FORTIFY_SOURCE=2 -fstack-protector-strong --param=ssp-buffer-size=4 -Werror=trampolines -fPIC -march=x86-64 -mtune=generic -gdwarf-4 -fno-debug-types-section -fvar-tracking-assignments -g2  -U_FORTIFY_SOURCE -D_FORTIFY_SOURCE=2 -fstack-protector-all -Wstack-protector --param ssp-buffer-size=1 -fPIE -fasynchronous-unwind-tables -Wall -fno-strict-aliasing -Waddress -Warray-bounds -Wdate-time -Wdouble-promotion -Wduplicate-decl-specifier -Wduplicated-cond -Wenum-conversion -Wextra -Wfloat-conversion -Wignored-attributes -Wimplicit-fallthrough -Winit-self -Wlogical-op -Wmissing-field-initializers -Wmissing-format-attribute -Wmissing-noreturn -Wnormalized=nfkc -Wnull-dereference -Woverlength-strings -Woverride-init -Wshadow -Wshift-count-negative -Wshift-count-overflow -Wshift-negative-value -Wshift-overflow=2 -Wsizeof-array-argument -Wstrict-overflow=1 -Wstring-compare -Wsuggest-attribute=format -Wsuggest-attribute=noreturn -Wswitch-bool -Wsync-nand -Wtrampolines -Wunused-but-set-parameter -Wunused-but-set-variable -Wunused-const-variable=2 -Wunused-local-typedefs -Wvariadic-macros -W -Wfloat-equal -Wundef -Wpointer-arith -Wstrict-prototypes -Wmissing-prototypes -Wwrite-strings -Wredundant-decls -Wchar-subscripts -Wcomment -Wformat=2 -Wwrite-strings -Wnested-externs -Wbad-function-cast -Wswitch-enum -Waggregate-return -Wpacked -Wunused -Wunused-parameter  -Wold-style-definition -Wmissing-declarations -MT src/common/libor_testing_a-backtrace.o -MD -MP -MF src/common/.deps/libor_testing_a-backtrace.Tpo -c -o src/common/libor_testing_a-backtrace.o `test -f 'src/common/backtrace.c' || echo './'`src/common/backtrace.c
mv -f src/common/.deps/libor_testing_a-backtrace.Tpo src/common/.deps/libor_testing_a-backtrace.Po
make[1]: Leaving directory '/tmp/B.dr54o7_8/BUILD/tor-0.3.4.11'
make[1]: Entering directory '/tmp/B.dr54o7_8/BUILD/tor-0.3.4.11'
x86_64-pld-linux-gcc -DHAVE_CONFIG_H -I.  -I./src/ext -Isrc/ext -I./src/ext/trunnel -I./src/trunnel -I./src/common -Isrc/common -I./src/ext/trunnel -I./src/trunnel -I./src/or -Isrc/or -DSHARE_DATADIR="\"/usr/share\"" -DLOCALSTATEDIR="\"/var\"" -DBINDIR="\"/usr/bin\"" -I./src -DTOR_UNIT_TESTS  -DHAVE_MODULE_DIRAUTH=1 -I./src/common      -O2 -fwrapv -pipe -Wformat -Werror=format-security -gdwarf-4 -fno-debug-types-section -fvar-tracking-assignments -g2 -Wp,-D_FORTIFY_SOURCE=2 -fstack-protector-strong --param=ssp-buffer-size=4 -Werror=trampolines -fPIC -march=x86-64 -mtune=generic -gdwarf-4 -fno-debug-types-section -fvar-tracking-assignments -g2  -U_FORTIFY_SOURCE -D_FORTIFY_SOURCE=2 -fstack-protector-all -Wstack-protector --param ssp-buffer-size=1 -fPIE -fasynchronous-unwind-tables -Wall -fno-strict-aliasing -Waddress -Warray-bounds -Wdate-time -Wdouble-promotion -Wduplicate-decl-specifier -Wduplicated-cond -Wenum-conversion -Wextra -Wfloat-conversion -Wignored-attributes -Wimplicit-fallthrough -Winit-self -Wlogical-op -Wmissing-field-initializers -Wmissing-format-attribute -Wmissing-noreturn -Wnormalized=nfkc -Wnull-dereference -Woverlength-strings -Woverride-init -Wshadow -Wshift-count-negative -Wshift-count-overflow -Wshift-negative-value -Wshift-overflow=2 -Wsizeof-array-argument -Wstrict-overflow=1 -Wstring-compare -Wsuggest-attribute=format -Wsuggest-attribute=noreturn -Wswitch-bool -Wsync-nand -Wtrampolines -Wunused-but-set-parameter -Wunused-but-set-variable -Wunused-const-variable=2 -Wunused-local-typedefs -Wvariadic-macros -W -Wfloat-equal -Wundef -Wpointer-arith -Wstrict-prototypes -Wmissing-prototypes -Wwrite-strings -Wredundant-decls -Wchar-subscripts -Wcomment -Wformat=2 -Wwrite-strings -Wnested-externs -Wbad-function-cast -Wswitch-enum -Waggregate-return -Wpacked -Wunused -Wunused-parameter  -Wold-style-definition -Wmissing-declarations -MT src/common/libor_crypto_testing_a-crypto_curve25519.o -MD -MP -MF src/common/.deps/libor_crypto_testing_a-crypto_curve25519.Tpo -c -o src/common/libor_crypto_testing_a-crypto_curve25519.o `test -f 'src/common/crypto_curve25519.c' || echo './'`src/common/crypto_curve25519.c
mv -f src/common/.deps/libor_crypto_testing_a-crypto_curve25519.Tpo src/common/.deps/libor_crypto_testing_a-crypto_curve25519.Po
make[1]: Leaving directory '/tmp/B.dr54o7_8/BUILD/tor-0.3.4.11'
make[1]: Entering directory '/tmp/B.dr54o7_8/BUILD/tor-0.3.4.11'
x86_64-pld-linux-gcc -DHAVE_CONFIG_H -I.  -I./src/ext -Isrc/ext -I./src/ext/trunnel -I./src/trunnel -I./src/common -Isrc/common -I./src/ext/trunnel -I./src/trunnel -I./src/or -Isrc/or -DSHARE_DATADIR="\"/usr/share\"" -DLOCALSTATEDIR="\"/var\"" -DBINDIR="\"/usr/bin\"" -I./src -DTOR_UNIT_TESTS  -DHAVE_MODULE_DIRAUTH=1 -I./src/common      -O2 -fwrapv -pipe -Wformat -Werror=format-security -gdwarf-4 -fno-debug-types-section -fvar-tracking-assignments -g2 -Wp,-D_FORTIFY_SOURCE=2 -fstack-protector-strong --param=ssp-buffer-size=4 -Werror=trampolines -fPIC -march=x86-64 -mtune=generic -gdwarf-4 -fno-debug-types-section -fvar-tracking-assignments -g2  -U_FORTIFY_SOURCE -D_FORTIFY_SOURCE=2 -fstack-protector-all -Wstack-protector --param ssp-buffer-size=1 -fPIE -fasynchronous-unwind-tables -Wall -fno-strict-aliasing -Waddress -Warray-bounds -Wdate-time -Wdouble-promotion -Wduplicate-decl-specifier -Wduplicated-cond -Wenum-conversion -Wextra -Wfloat-conversion -Wignored-attributes -Wimplicit-fallthrough -Winit-self -Wlogical-op -Wmissing-field-initializers -Wmissing-format-attribute -Wmissing-noreturn -Wnormalized=nfkc -Wnull-dereference -Woverlength-strings -Woverride-init -Wshadow -Wshift-count-negative -Wshift-count-overflow -Wshift-negative-value -Wshift-overflow=2 -Wsizeof-array-argument -Wstrict-overflow=1 -Wstring-compare -Wsuggest-attribute=format -Wsuggest-attribute=noreturn -Wswitch-bool -Wsync-nand -Wtrampolines -Wunused-but-set-parameter -Wunused-but-set-variable -Wunused-const-variable=2 -Wunused-local-typedefs -Wvariadic-macros -W -Wfloat-equal -Wundef -Wpointer-arith -Wstrict-prototypes -Wmissing-prototypes -Wwrite-strings -Wredundant-decls -Wchar-subscripts -Wcomment -Wformat=2 -Wwrite-strings -Wnested-externs -Wbad-function-cast -Wswitch-enum -Waggregate-return -Wpacked -Wunused -Wunused-parameter  -Wold-style-definition -Wmissing-declarations -MT src/common/libor_crypto_testing_a-crypto_rsa.o -MD -MP -MF src/common/.deps/libor_crypto_testing_a-crypto_rsa.Tpo -c -o src/common/libor_crypto_testing_a-crypto_rsa.o `test -f 'src/common/crypto_rsa.c' || echo './'`src/common/crypto_rsa.c
src/common/crypto_rsa.c: In function 'crypto_log_errors':
src/common/crypto_rsa.c:58:5: warning: 'ERR_func_error_string' is deprecated: Since OpenSSL 3.0 [-Wdeprecated-declarations]
   58 |     func = (const char*)ERR_func_error_string(err);
      |     ^~~~
In file included from /usr/include/openssl/engine.h:31,
                 from src/common/crypto_openssl_mgt.h:19,
                 from src/common/crypto_curve25519.h:10,
                 from src/common/crypto_rsa.c:13:
/usr/include/openssl/err.h:447:35: note: declared here
  447 | OSSL_DEPRECATEDIN_3_0 const char *ERR_func_error_string(unsigned long e);
      |                                   ^~~~~~~~~~~~~~~~~~~~~
src/common/crypto_rsa.c: In function 'crypto_pk_private_ok':
src/common/crypto_rsa.c:103:3: warning: 'RSA_get0_factors' is deprecated: Since OpenSSL 3.0 [-Wdeprecated-declarations]
  103 |   RSA_get0_factors(k->key, &p, &q);
      |   ^~~~~~~~~~~~~~~~
In file included from /usr/include/openssl/engine.h:25,
                 from src/common/crypto_openssl_mgt.h:19,
                 from src/common/crypto_curve25519.h:10,
                 from src/common/crypto_rsa.c:13:
/usr/include/openssl/rsa.h:220:28: note: declared here
  220 | OSSL_DEPRECATEDIN_3_0 void RSA_get0_factors(const RSA *r,
      |                            ^~~~~~~~~~~~~~~~
src/common/crypto_rsa.c: In function 'crypto_pk_get_evp_pkey___real':
src/common/crypto_rsa.c:140:5: warning: 'RSAPrivateKey_dup' is deprecated: Since OpenSSL 3.0 [-Wdeprecated-declarations]
  140 |     if (!(key = RSAPrivateKey_dup(env->key)))
      |     ^~
In file included from /usr/include/openssl/rsa.h:21,
                 from /usr/include/openssl/engine.h:25,
                 from src/common/crypto_openssl_mgt.h:19,
                 from src/common/crypto_curve25519.h:10,
                 from src/common/crypto_rsa.c:13:
/usr/include/openssl/rsa.h:449:1: note: declared here
  449 | DECLARE_ASN1_DUP_FUNCTION_name_attr(OSSL_DEPRECATEDIN_3_0, RSA, RSAPrivateKey)
      | ^~~~~~~~~~~~~~~~~~~~~~~~~~~~~~~~~~~
src/common/crypto_rsa.c:143:5: warning: 'RSAPublicKey_dup' is deprecated: Since OpenSSL 3.0 [-Wdeprecated-declarations]
  143 |     if (!(key = RSAPublicKey_dup(env->key)))
      |     ^~
In file included from /usr/include/openssl/rsa.h:21,
                 from /usr/include/openssl/engine.h:25,
                 from src/common/crypto_openssl_mgt.h:19,
                 from src/common/crypto_curve25519.h:10,
                 from src/common/crypto_rsa.c:13:
/usr/include/openssl/rsa.h:448:1: note: declared here
  448 | DECLARE_ASN1_DUP_FUNCTION_name_attr(OSSL_DEPRECATEDIN_3_0, RSA, RSAPublicKey)
      | ^~~~~~~~~~~~~~~~~~~~~~~~~~~~~~~~~~~
src/common/crypto_rsa.c:148:3: warning: 'EVP_PKEY_assign' is deprecated: Since OpenSSL 3.0 [-Wdeprecated-declarations]
  148 |   if (!(EVP_PKEY_assign_RSA(pkey, key)))
      |   ^~
In file included from /usr/include/openssl/rand.h:23,
                 from /usr/include/openssl/engine.h:29,
                 from src/common/crypto_openssl_mgt.h:19,
                 from src/common/crypto_curve25519.h:10,
                 from src/common/crypto_rsa.c:13:
/usr/include/openssl/evp.h:1328:5: note: declared here
 1328 | int EVP_PKEY_assign(EVP_PKEY *pkey, int type, void *key);
      |     ^~~~~~~~~~~~~~~
src/common/crypto_rsa.c:155:5: warning: 'RSA_free' is deprecated: Since OpenSSL 3.0 [-Wdeprecated-declarations]
  155 |     RSA_free(key);
      |     ^~~~~~~~
In file included from /usr/include/openssl/engine.h:25,
                 from src/common/crypto_openssl_mgt.h:19,
                 from src/common/crypto_curve25519.h:10,
                 from src/common/crypto_rsa.c:13:
/usr/include/openssl/rsa.h:293:28: note: declared here
  293 | OSSL_DEPRECATEDIN_3_0 void RSA_free(RSA *r);
      |                            ^~~~~~~~
src/common/crypto_rsa.c: In function 'crypto_pk_new__real':
src/common/crypto_rsa.c:167:3: warning: 'RSA_new' is deprecated: Since OpenSSL 3.0 [-Wdeprecated-declarations]
  167 |   rsa = RSA_new();
      |   ^~~
In file included from /usr/include/openssl/engine.h:25,
                 from src/common/crypto_openssl_mgt.h:19,
                 from src/common/crypto_curve25519.h:10,
                 from src/common/crypto_rsa.c:13:
/usr/include/openssl/rsa.h:201:28: note: declared here
  201 | OSSL_DEPRECATEDIN_3_0 RSA *RSA_new(void);
      |                            ^~~~~~~
src/common/crypto_rsa.c: In function 'crypto_pk_free_':
src/common/crypto_rsa.c:186:5: warning: 'RSA_free' is deprecated: Since OpenSSL 3.0 [-Wdeprecated-declarations]
  186 |     RSA_free(env->key);
      |     ^~~~~~~~
In file included from /usr/include/openssl/engine.h:25,
                 from src/common/crypto_openssl_mgt.h:19,
                 from src/common/crypto_curve25519.h:10,
                 from src/common/crypto_rsa.c:13:
/usr/include/openssl/rsa.h:293:28: note: declared here
  293 | OSSL_DEPRECATEDIN_3_0 void RSA_free(RSA *r);
      |                            ^~~~~~~~
src/common/crypto_rsa.c: In function 'crypto_pk_generate_key_with_bits__real':
src/common/crypto_rsa.c:200:5: warning: 'RSA_free' is deprecated: Since OpenSSL 3.0 [-Wdeprecated-declarations]
  200 |     RSA_free(env->key);
      |     ^~~~~~~~
In file included from /usr/include/openssl/engine.h:25,
                 from src/common/crypto_openssl_mgt.h:19,
                 from src/common/crypto_curve25519.h:10,
                 from src/common/crypto_rsa.c:13:
/usr/include/openssl/rsa.h:293:28: note: declared here
  293 | OSSL_DEPRECATEDIN_3_0 void RSA_free(RSA *r);
      |                            ^~~~~~~~
src/common/crypto_rsa.c:211:5: warning: 'RSA_new' is deprecated: Since OpenSSL 3.0 [-Wdeprecated-declarations]
  211 |     r = RSA_new();
      |     ^
In file included from /usr/include/openssl/engine.h:25,
                 from src/common/crypto_openssl_mgt.h:19,
                 from src/common/crypto_curve25519.h:10,
                 from src/common/crypto_rsa.c:13:
/usr/include/openssl/rsa.h:201:28: note: declared here
  201 | OSSL_DEPRECATEDIN_3_0 RSA *RSA_new(void);
      |                            ^~~~~~~
src/common/crypto_rsa.c:214:5: warning: 'RSA_generate_key_ex' is deprecated: Since OpenSSL 3.0 [-Wdeprecated-declarations]
  214 |     if (RSA_generate_key_ex(r, bits, e, NULL) == -1)
      |     ^~
In file included from /usr/include/openssl/engine.h:25,
                 from src/common/crypto_openssl_mgt.h:19,
                 from src/common/crypto_curve25519.h:10,
                 from src/common/crypto_rsa.c:13:
/usr/include/openssl/rsa.h:260:27: note: declared here
  260 | OSSL_DEPRECATEDIN_3_0 int RSA_generate_key_ex(RSA *rsa, int bits, BIGNUM *e,
      |                           ^~~~~~~~~~~~~~~~~~~
src/common/crypto_rsa.c:223:7: warning: 'RSA_free' is deprecated: Since OpenSSL 3.0 [-Wdeprecated-declarations]
  223 |       RSA_free(r);
      |       ^~~~~~~~
In file included from /usr/include/openssl/engine.h:25,
                 from src/common/crypto_openssl_mgt.h:19,
                 from src/common/crypto_curve25519.h:10,
                 from src/common/crypto_rsa.c:13:
/usr/include/openssl/rsa.h:293:28: note: declared here
  293 | OSSL_DEPRECATEDIN_3_0 void RSA_free(RSA *r);
      |                            ^~~~~~~~
src/common/crypto_rsa.c: In function 'crypto_pk_read_private_key_from_string':
src/common/crypto_rsa.c:265:5: warning: 'RSA_free' is deprecated: Since OpenSSL 3.0 [-Wdeprecated-declarations]
  265 |     RSA_free(env->key);
      |     ^~~~~~~~
In file included from /usr/include/openssl/engine.h:25,
                 from src/common/crypto_openssl_mgt.h:19,
                 from src/common/crypto_curve25519.h:10,
                 from src/common/crypto_rsa.c:13:
/usr/include/openssl/rsa.h:293:28: note: declared here
  293 | OSSL_DEPRECATEDIN_3_0 void RSA_free(RSA *r);
      |                            ^~~~~~~~
src/common/crypto_rsa.c:267:3: warning: 'PEM_read_bio_RSAPrivateKey' is deprecated: Since OpenSSL 3.0 [-Wdeprecated-declarations]
  267 |   env->key = PEM_read_bio_RSAPrivateKey(b,NULL,pem_no_password_cb,NULL);
      |   ^~~
In file included from /usr/include/openssl/ui.h:30,
                 from /usr/include/openssl/engine.h:30,
                 from src/common/crypto_openssl_mgt.h:19,
                 from src/common/crypto_curve25519.h:10,
                 from src/common/crypto_rsa.c:13:
/usr/include/openssl/pem.h:447:1: note: declared here
  447 | DECLARE_PEM_rw_cb_attr(OSSL_DEPRECATEDIN_3_0, RSAPrivateKey, RSA)
      | ^~~~~~~~~~~~~~~~~~~~~~
src/common/crypto_rsa.c: In function 'crypto_pk_write_key_to_string_impl':
src/common/crypto_rsa.c:331:5: warning: 'PEM_write_bio_RSAPublicKey' is deprecated: Since OpenSSL 3.0 [-Wdeprecated-declarations]
  331 |     r = PEM_write_bio_RSAPublicKey(b, env->key);
      |     ^
In file included from /usr/include/openssl/ui.h:30,
                 from /usr/include/openssl/engine.h:30,
                 from src/common/crypto_openssl_mgt.h:19,
                 from src/common/crypto_curve25519.h:10,
                 from src/common/crypto_rsa.c:13:
/usr/include/openssl/pem.h:448:1: note: declared here
  448 | DECLARE_PEM_rw_attr(OSSL_DEPRECATEDIN_3_0, RSAPublicKey, RSA)
      | ^~~~~~~~~~~~~~~~~~~
src/common/crypto_rsa.c:333:5: warning: 'PEM_write_bio_RSAPrivateKey' is deprecated: Since OpenSSL 3.0 [-Wdeprecated-declarations]
  333 |     r = PEM_write_bio_RSAPrivateKey(b, env->key, NULL,NULL,0,NULL,NULL);
      |     ^
In file included from /usr/include/openssl/ui.h:30,
                 from /usr/include/openssl/engine.h:30,
                 from src/common/crypto_openssl_mgt.h:19,
                 from src/common/crypto_curve25519.h:10,
                 from src/common/crypto_rsa.c:13:
/usr/include/openssl/pem.h:447:1: note: declared here
  447 | DECLARE_PEM_rw_cb_attr(OSSL_DEPRECATEDIN_3_0, RSAPrivateKey, RSA)
      | ^~~~~~~~~~~~~~~~~~~~~~
src/common/crypto_rsa.c: In function 'crypto_pk_read_public_key_from_string':
src/common/crypto_rsa.c:398:5: warning: 'RSA_free' is deprecated: Since OpenSSL 3.0 [-Wdeprecated-declarations]
  398 |     RSA_free(env->key);
      |     ^~~~~~~~
In file included from /usr/include/openssl/engine.h:25,
                 from src/common/crypto_openssl_mgt.h:19,
                 from src/common/crypto_curve25519.h:10,
                 from src/common/crypto_rsa.c:13:
/usr/include/openssl/rsa.h:293:28: note: declared here
  293 | OSSL_DEPRECATEDIN_3_0 void RSA_free(RSA *r);
      |                            ^~~~~~~~
src/common/crypto_rsa.c:399:3: warning: 'PEM_read_bio_RSAPublicKey' is deprecated: Since OpenSSL 3.0 [-Wdeprecated-declarations]
  399 |   env->key = PEM_read_bio_RSAPublicKey(b, NULL, pem_no_password_cb, NULL);
      |   ^~~
In file included from /usr/include/openssl/ui.h:30,
                 from /usr/include/openssl/engine.h:30,
                 from src/common/crypto_openssl_mgt.h:19,
                 from src/common/crypto_curve25519.h:10,
                 from src/common/crypto_rsa.c:13:
/usr/include/openssl/pem.h:448:1: note: declared here
  448 | DECLARE_PEM_rw_attr(OSSL_DEPRECATEDIN_3_0, RSAPublicKey, RSA)
      | ^~~~~~~~~~~~~~~~~~~
src/common/crypto_rsa.c: In function 'crypto_pk_write_private_key_to_filename':
src/common/crypto_rsa.c:426:3: warning: 'PEM_write_bio_RSAPrivateKey' is deprecated: Since OpenSSL 3.0 [-Wdeprecated-declarations]
  426 |   if (PEM_write_bio_RSAPrivateKey(bio, env->key, NULL,NULL,0,NULL,NULL)
      |   ^~
In file included from /usr/include/openssl/ui.h:30,
                 from /usr/include/openssl/engine.h:30,
                 from src/common/crypto_openssl_mgt.h:19,
                 from src/common/crypto_curve25519.h:10,
                 from src/common/crypto_rsa.c:13:
/usr/include/openssl/pem.h:447:1: note: declared here
  447 | DECLARE_PEM_rw_cb_attr(OSSL_DEPRECATEDIN_3_0, RSAPrivateKey, RSA)
      | ^~~~~~~~~~~~~~~~~~~~~~
src/common/crypto_rsa.c: In function 'crypto_pk_check_key':
src/common/crypto_rsa.c:452:3: warning: 'RSA_check_key' is deprecated: Since OpenSSL 3.0 [-Wdeprecated-declarations]
  452 |   r = RSA_check_key(env->key);
      |   ^
In file included from /usr/include/openssl/engine.h:25,
                 from src/common/crypto_openssl_mgt.h:19,
                 from src/common/crypto_curve25519.h:10,
                 from src/common/crypto_rsa.c:13:
/usr/include/openssl/rsa.h:278:27: note: declared here
  278 | OSSL_DEPRECATEDIN_3_0 int RSA_check_key(const RSA *);
      |                           ^~~~~~~~~~~~~
src/common/crypto_rsa.c: In function 'crypto_pk_public_exponent_ok':
src/common/crypto_rsa.c:480:3: warning: 'RSA_get0_key' is deprecated: Since OpenSSL 3.0 [-Wdeprecated-declarations]
  480 |   RSA_get0_key(env->key, &n, &e, &d);
      |   ^~~~~~~~~~~~
In file included from /usr/include/openssl/engine.h:25,
                 from src/common/crypto_openssl_mgt.h:19,
                 from src/common/crypto_curve25519.h:10,
                 from src/common/crypto_rsa.c:13:
/usr/include/openssl/rsa.h:217:28: note: declared here
  217 | OSSL_DEPRECATEDIN_3_0 void RSA_get0_key(const RSA *r,
      |                            ^~~~~~~~~~~~
src/common/crypto_rsa.c: In function 'crypto_pk_cmp_keys':
src/common/crypto_rsa.c:510:3: warning: 'RSA_get0_key' is deprecated: Since OpenSSL 3.0 [-Wdeprecated-declarations]
  510 |   RSA_get0_key(a->key, &a_n, &a_e, &a_d);
      |   ^~~~~~~~~~~~
In file included from /usr/include/openssl/engine.h:25,
                 from src/common/crypto_openssl_mgt.h:19,
                 from src/common/crypto_curve25519.h:10,
                 from src/common/crypto_rsa.c:13:
/usr/include/openssl/rsa.h:217:28: note: declared here
  217 | OSSL_DEPRECATEDIN_3_0 void RSA_get0_key(const RSA *r,
      |                            ^~~~~~~~~~~~
src/common/crypto_rsa.c:511:3: warning: 'RSA_get0_key' is deprecated: Since OpenSSL 3.0 [-Wdeprecated-declarations]
  511 |   RSA_get0_key(b->key, &b_n, &b_e, &b_d);
      |   ^~~~~~~~~~~~
In file included from /usr/include/openssl/engine.h:25,
                 from src/common/crypto_openssl_mgt.h:19,
                 from src/common/crypto_curve25519.h:10,
                 from src/common/crypto_rsa.c:13:
/usr/include/openssl/rsa.h:217:28: note: declared here
  217 | OSSL_DEPRECATEDIN_3_0 void RSA_get0_key(const RSA *r,
      |                            ^~~~~~~~~~~~
src/common/crypto_rsa.c: In function 'crypto_pk_keysize':
src/common/crypto_rsa.c:547:3: warning: 'RSA_size' is deprecated: Since OpenSSL 3.0 [-Wdeprecated-declarations]
  547 |   return (size_t) RSA_size((RSA*)env->key);
      |   ^~~~~~
In file included from /usr/include/openssl/engine.h:25,
                 from src/common/crypto_openssl_mgt.h:19,
                 from src/common/crypto_curve25519.h:10,
                 from src/common/crypto_rsa.c:13:
/usr/include/openssl/rsa.h:204:27: note: declared here
  204 | OSSL_DEPRECATEDIN_3_0 int RSA_size(const RSA *rsa);
      |                           ^~~~~~~~
src/common/crypto_rsa.c: In function 'crypto_pk_num_bits':
src/common/crypto_rsa.c:562:3: warning: 'RSA_get0_key' is deprecated: Since OpenSSL 3.0 [-Wdeprecated-declarations]
  562 |   RSA_get0_key(env->key, &n, &e, &d);
      |   ^~~~~~~~~~~~
In file included from /usr/include/openssl/engine.h:25,
                 from src/common/crypto_openssl_mgt.h:19,
                 from src/common/crypto_curve25519.h:10,
                 from src/common/crypto_rsa.c:13:
/usr/include/openssl/rsa.h:217:28: note: declared here
  217 | OSSL_DEPRECATEDIN_3_0 void RSA_get0_key(const RSA *r,
      |                            ^~~~~~~~~~~~
src/common/crypto_rsa.c:565:3: warning: 'RSA_bits' is deprecated: Since OpenSSL 3.0 [-Wdeprecated-declarations]
  565 |   return RSA_bits(env->key);
      |   ^~~~~~
In file included from /usr/include/openssl/engine.h:25,
                 from src/common/crypto_openssl_mgt.h:19,
                 from src/common/crypto_curve25519.h:10,
                 from src/common/crypto_rsa.c:13:
/usr/include/openssl/rsa.h:203:27: note: declared here
  203 | OSSL_DEPRECATEDIN_3_0 int RSA_bits(const RSA *rsa);
      |                           ^~~~~~~~
src/common/crypto_rsa.c: In function 'crypto_pk_assign_':
src/common/crypto_rsa.c:593:3: warning: 'RSA_free' is deprecated: Since OpenSSL 3.0 [-Wdeprecated-declarations]
  593 |   RSA_free(dest->key);
      |   ^~~~~~~~
In file included from /usr/include/openssl/engine.h:25,
                 from src/common/crypto_openssl_mgt.h:19,
                 from src/common/crypto_curve25519.h:10,
                 from src/common/crypto_rsa.c:13:
/usr/include/openssl/rsa.h:293:28: note: declared here
  293 | OSSL_DEPRECATEDIN_3_0 void RSA_free(RSA *r);
      |                            ^~~~~~~~
src/common/crypto_rsa.c:594:3: warning: 'RSAPrivateKey_dup' is deprecated: Since OpenSSL 3.0 [-Wdeprecated-declarations]
  594 |   dest->key = RSAPrivateKey_dup(src->key);
      |   ^~~~
In file included from /usr/include/openssl/rsa.h:21,
                 from /usr/include/openssl/engine.h:25,
                 from src/common/crypto_openssl_mgt.h:19,
                 from src/common/crypto_curve25519.h:10,
                 from src/common/crypto_rsa.c:13:
/usr/include/openssl/rsa.h:449:1: note: declared here
  449 | DECLARE_ASN1_DUP_FUNCTION_name_attr(OSSL_DEPRECATEDIN_3_0, RSA, RSAPrivateKey)
      | ^~~~~~~~~~~~~~~~~~~~~~~~~~~~~~~~~~~
src/common/crypto_rsa.c: In function 'crypto_pk_copy_full':
src/common/crypto_rsa.c:609:5: warning: 'RSAPrivateKey_dup' is deprecated: Since OpenSSL 3.0 [-Wdeprecated-declarations]
  609 |     new_key = RSAPrivateKey_dup(env->key);
      |     ^~~~~~~
In file included from /usr/include/openssl/rsa.h:21,
                 from /usr/include/openssl/engine.h:25,
                 from src/common/crypto_openssl_mgt.h:19,
                 from src/common/crypto_curve25519.h:10,
                 from src/common/crypto_rsa.c:13:
/usr/include/openssl/rsa.h:449:1: note: declared here
  449 | DECLARE_ASN1_DUP_FUNCTION_name_attr(OSSL_DEPRECATEDIN_3_0, RSA, RSAPrivateKey)
      | ^~~~~~~~~~~~~~~~~~~~~~~~~~~~~~~~~~~
src/common/crypto_rsa.c:612:5: warning: 'RSAPublicKey_dup' is deprecated: Since OpenSSL 3.0 [-Wdeprecated-declarations]
  612 |     new_key = RSAPublicKey_dup(env->key);
      |     ^~~~~~~
In file included from /usr/include/openssl/rsa.h:21,
                 from /usr/include/openssl/engine.h:25,
                 from src/common/crypto_openssl_mgt.h:19,
                 from src/common/crypto_curve25519.h:10,
                 from src/common/crypto_rsa.c:13:
/usr/include/openssl/rsa.h:448:1: note: declared here
  448 | DECLARE_ASN1_DUP_FUNCTION_name_attr(OSSL_DEPRECATEDIN_3_0, RSA, RSAPublicKey)
      | ^~~~~~~~~~~~~~~~~~~~~~~~~~~~~~~~~~~
src/common/crypto_rsa.c: In function 'crypto_pk_public_encrypt':
src/common/crypto_rsa.c:793:3: warning: 'RSA_public_encrypt' is deprecated: Since OpenSSL 3.0 [-Wdeprecated-declarations]
  793 |   r = RSA_public_encrypt((int)fromlen,
      |   ^
In file included from /usr/include/openssl/engine.h:25,
                 from src/common/crypto_openssl_mgt.h:19,
                 from src/common/crypto_curve25519.h:10,
                 from src/common/crypto_rsa.c:13:
/usr/include/openssl/rsa.h:282:5: note: declared here
  282 | int RSA_public_encrypt(int flen, const unsigned char *from, unsigned char *to,
      |     ^~~~~~~~~~~~~~~~~~
src/common/crypto_rsa.c: In function 'crypto_pk_private_decrypt':
src/common/crypto_rsa.c:828:3: warning: 'RSA_private_decrypt' is deprecated: Since OpenSSL 3.0 [-Wdeprecated-declarations]
  828 |   r = RSA_private_decrypt((int)fromlen,
      |   ^
In file included from /usr/include/openssl/engine.h:25,
                 from src/common/crypto_openssl_mgt.h:19,
                 from src/common/crypto_curve25519.h:10,
                 from src/common/crypto_rsa.c:13:
/usr/include/openssl/rsa.h:291:5: note: declared here
  291 | int RSA_private_decrypt(int flen, const unsigned char *from, unsigned char *to,
      |     ^~~~~~~~~~~~~~~~~~~
src/common/crypto_rsa.c: In function 'crypto_pk_public_checksig__real':
src/common/crypto_rsa.c:859:3: warning: 'RSA_public_decrypt' is deprecated: Since OpenSSL 3.0 [-Wdeprecated-declarations]
  859 |   r = RSA_public_decrypt((int)fromlen,
      |   ^
In file included from /usr/include/openssl/engine.h:25,
                 from src/common/crypto_openssl_mgt.h:19,
                 from src/common/crypto_curve25519.h:10,
                 from src/common/crypto_rsa.c:13:
/usr/include/openssl/rsa.h:288:5: note: declared here
  288 | int RSA_public_decrypt(int flen, const unsigned char *from, unsigned char *to,
      |     ^~~~~~~~~~~~~~~~~~
src/common/crypto_rsa.c: In function 'crypto_pk_private_sign':
src/common/crypto_rsa.c:892:3: warning: 'RSA_private_encrypt' is deprecated: Since OpenSSL 3.0 [-Wdeprecated-declarations]
  892 |   r = RSA_private_encrypt((int)fromlen,
      |   ^
In file included from /usr/include/openssl/engine.h:25,
                 from src/common/crypto_openssl_mgt.h:19,
                 from src/common/crypto_curve25519.h:10,
                 from src/common/crypto_rsa.c:13:
/usr/include/openssl/rsa.h:285:5: note: declared here
  285 | int RSA_private_encrypt(int flen, const unsigned char *from, unsigned char *to,
      |     ^~~~~~~~~~~~~~~~~~~
src/common/crypto_rsa.c: In function 'crypto_pk_asn1_encode':
src/common/crypto_rsa.c:911:3: warning: 'i2d_RSAPublicKey' is deprecated: Since OpenSSL 3.0 [-Wdeprecated-declarations]
  911 |   len = i2d_RSAPublicKey(pk->key, &buf);
      |   ^~~
In file included from /usr/include/openssl/rsa.h:21,
                 from /usr/include/openssl/engine.h:25,
                 from src/common/crypto_openssl_mgt.h:19,
                 from src/common/crypto_curve25519.h:10,
                 from src/common/crypto_rsa.c:13:
/usr/include/openssl/rsa.h:307:1: note: declared here
  307 | DECLARE_ASN1_ENCODE_FUNCTIONS_name_attr(OSSL_DEPRECATEDIN_3_0,
      | ^~~~~~~~~~~~~~~~~~~~~~~~~~~~~~~~~~~~~~~
src/common/crypto_rsa.c: In function 'crypto_pk_asn1_decode':
src/common/crypto_rsa.c:938:3: warning: 'd2i_RSAPublicKey' is deprecated: Since OpenSSL 3.0 [-Wdeprecated-declarations]
  938 |   rsa = d2i_RSAPublicKey(NULL, &cp, len);
      |   ^~~
In file included from /usr/include/openssl/rsa.h:21,
                 from /usr/include/openssl/engine.h:25,
                 from src/common/crypto_openssl_mgt.h:19,
                 from src/common/crypto_curve25519.h:10,
                 from src/common/crypto_rsa.c:13:
/usr/include/openssl/rsa.h:307:1: note: declared here
  307 | DECLARE_ASN1_ENCODE_FUNCTIONS_name_attr(OSSL_DEPRECATEDIN_3_0,
      | ^~~~~~~~~~~~~~~~~~~~~~~~~~~~~~~~~~~~~~~
src/common/crypto_rsa.c: In function 'crypto_pk_base64_encode':
src/common/crypto_rsa.c:1128:3: warning: 'i2d_RSAPrivateKey' is deprecated: Since OpenSSL 3.0 [-Wdeprecated-declarations]
 1128 |   der_len = i2d_RSAPrivateKey(pk->key, &der);
      |   ^~~~~~~
In file included from /usr/include/openssl/rsa.h:21,
                 from /usr/include/openssl/engine.h:25,
                 from src/common/crypto_openssl_mgt.h:19,
                 from src/common/crypto_curve25519.h:10,
                 from src/common/crypto_rsa.c:13:
/usr/include/openssl/rsa.h:309:1: note: declared here
  309 | DECLARE_ASN1_ENCODE_FUNCTIONS_name_attr(OSSL_DEPRECATEDIN_3_0,
      | ^~~~~~~~~~~~~~~~~~~~~~~~~~~~~~~~~~~~~~~
src/common/crypto_rsa.c: In function 'crypto_pk_base64_decode':
src/common/crypto_rsa.c:1163:3: warning: 'd2i_RSAPrivateKey' is deprecated: Since OpenSSL 3.0 [-Wdeprecated-declarations]
 1163 |   RSA *rsa = d2i_RSAPrivateKey(NULL, &dp, der_len);
      |   ^~~
In file included from /usr/include/openssl/rsa.h:21,
                 from /usr/include/openssl/engine.h:25,
                 from src/common/crypto_openssl_mgt.h:19,
                 from src/common/crypto_curve25519.h:10,
                 from src/common/crypto_rsa.c:13:
/usr/include/openssl/rsa.h:309:1: note: declared here
  309 | DECLARE_ASN1_ENCODE_FUNCTIONS_name_attr(OSSL_DEPRECATEDIN_3_0,
      | ^~~~~~~~~~~~~~~~~~~~~~~~~~~~~~~~~~~~~~~
mv -f src/common/.deps/libor_crypto_testing_a-crypto_rsa.Tpo src/common/.deps/libor_crypto_testing_a-crypto_rsa.Po
make[1]: Leaving directory '/tmp/B.dr54o7_8/BUILD/tor-0.3.4.11'
make[1]: Entering directory '/tmp/B.dr54o7_8/BUILD/tor-0.3.4.11'
x86_64-pld-linux-gcc -DHAVE_CONFIG_H -I.  -I./src/ext -Isrc/ext -I./src/ext/trunnel -I./src/trunnel -I./src/common -Isrc/common -I./src/ext/trunnel -I./src/trunnel -I./src/or -Isrc/or -DSHARE_DATADIR="\"/usr/share\"" -DLOCALSTATEDIR="\"/var\"" -DBINDIR="\"/usr/bin\"" -I./src -DTOR_UNIT_TESTS  -DHAVE_MODULE_DIRAUTH=1 -I./src/common      -O2 -fwrapv -pipe -Wformat -Werror=format-security -gdwarf-4 -fno-debug-types-section -fvar-tracking-assignments -g2 -Wp,-D_FORTIFY_SOURCE=2 -fstack-protector-strong --param=ssp-buffer-size=4 -Werror=trampolines -fPIC -march=x86-64 -mtune=generic -gdwarf-4 -fno-debug-types-section -fvar-tracking-assignments -g2  -U_FORTIFY_SOURCE -D_FORTIFY_SOURCE=2 -fstack-protector-all -Wstack-protector --param ssp-buffer-size=1 -fPIE -fasynchronous-unwind-tables -Wall -fno-strict-aliasing -Waddress -Warray-bounds -Wdate-time -Wdouble-promotion -Wduplicate-decl-specifier -Wduplicated-cond -Wenum-conversion -Wextra -Wfloat-conversion -Wignored-attributes -Wimplicit-fallthrough -Winit-self -Wlogical-op -Wmissing-field-initializers -Wmissing-format-attribute -Wmissing-noreturn -Wnormalized=nfkc -Wnull-dereference -Woverlength-strings -Woverride-init -Wshadow -Wshift-count-negative -Wshift-count-overflow -Wshift-negative-value -Wshift-overflow=2 -Wsizeof-array-argument -Wstrict-overflow=1 -Wstring-compare -Wsuggest-attribute=format -Wsuggest-attribute=noreturn -Wswitch-bool -Wsync-nand -Wtrampolines -Wunused-but-set-parameter -Wunused-but-set-variable -Wunused-const-variable=2 -Wunused-local-typedefs -Wvariadic-macros -W -Wfloat-equal -Wundef -Wpointer-arith -Wstrict-prototypes -Wmissing-prototypes -Wwrite-strings -Wredundant-decls -Wchar-subscripts -Wcomment -Wformat=2 -Wwrite-strings -Wnested-externs -Wbad-function-cast -Wswitch-enum -Waggregate-return -Wpacked -Wunused -Wunused-parameter  -Wold-style-definition -Wmissing-declarations -MT src/common/libor_crypto_testing_a-crypto_ed25519.o -MD -MP -MF src/common/.deps/libor_crypto_testing_a-crypto_ed25519.Tpo -c -o src/common/libor_crypto_testing_a-crypto_ed25519.o `test -f 'src/common/crypto_ed25519.c' || echo './'`src/common/crypto_ed25519.c
mv -f src/common/.deps/libor_crypto_testing_a-crypto_ed25519.Tpo src/common/.deps/libor_crypto_testing_a-crypto_ed25519.Po
make[1]: Leaving directory '/tmp/B.dr54o7_8/BUILD/tor-0.3.4.11'
make[1]: Entering directory '/tmp/B.dr54o7_8/BUILD/tor-0.3.4.11'
x86_64-pld-linux-gcc -DHAVE_CONFIG_H -I.  -I./src/ext -Isrc/ext -I./src/ext/trunnel -I./src/trunnel -I./src/common -Isrc/common -I./src/ext/trunnel -I./src/trunnel -I./src/or -Isrc/or -DSHARE_DATADIR="\"/usr/share\"" -DLOCALSTATEDIR="\"/var\"" -DBINDIR="\"/usr/bin\"" -I./src -DTOR_UNIT_TESTS  -DHAVE_MODULE_DIRAUTH=1 -I./src/common      -O2 -fwrapv -pipe -Wformat -Werror=format-security -gdwarf-4 -fno-debug-types-section -fvar-tracking-assignments -g2 -Wp,-D_FORTIFY_SOURCE=2 -fstack-protector-strong --param=ssp-buffer-size=4 -Werror=trampolines -fPIC -march=x86-64 -mtune=generic -gdwarf-4 -fno-debug-types-section -fvar-tracking-assignments -g2  -U_FORTIFY_SOURCE -D_FORTIFY_SOURCE=2 -fstack-protector-all -Wstack-protector --param ssp-buffer-size=1 -fPIE -fasynchronous-unwind-tables -Wall -fno-strict-aliasing -Waddress -Warray-bounds -Wdate-time -Wdouble-promotion -Wduplicate-decl-specifier -Wduplicated-cond -Wenum-conversion -Wextra -Wfloat-conversion -Wignored-attributes -Wimplicit-fallthrough -Winit-self -Wlogical-op -Wmissing-field-initializers -Wmissing-format-attribute -Wmissing-noreturn -Wnormalized=nfkc -Wnull-dereference -Woverlength-strings -Woverride-init -Wshadow -Wshift-count-negative -Wshift-count-overflow -Wshift-negative-value -Wshift-overflow=2 -Wsizeof-array-argument -Wstrict-overflow=1 -Wstring-compare -Wsuggest-attribute=format -Wsuggest-attribute=noreturn -Wswitch-bool -Wsync-nand -Wtrampolines -Wunused-but-set-parameter -Wunused-but-set-variable -Wunused-const-variable=2 -Wunused-local-typedefs -Wvariadic-macros -W -Wfloat-equal -Wundef -Wpointer-arith -Wstrict-prototypes -Wmissing-prototypes -Wwrite-strings -Wredundant-decls -Wchar-subscripts -Wcomment -Wformat=2 -Wwrite-strings -Wnested-externs -Wbad-function-cast -Wswitch-enum -Waggregate-return -Wpacked -Wunused -Wunused-parameter  -Wold-style-definition -Wmissing-declarations -MT src/common/libor_testing_a-buffers.o -MD -MP -MF src/common/.deps/libor_testing_a-buffers.Tpo -c -o src/common/libor_testing_a-buffers.o `test -f 'src/common/buffers.c' || echo './'`src/common/buffers.c
mv -f src/common/.deps/libor_testing_a-buffers.Tpo src/common/.deps/libor_testing_a-buffers.Po
make[1]: Leaving directory '/tmp/B.dr54o7_8/BUILD/tor-0.3.4.11'
make[1]: Entering directory '/tmp/B.dr54o7_8/BUILD/tor-0.3.4.11'
x86_64-pld-linux-gcc -DHAVE_CONFIG_H -I.  -I./src/ext -Isrc/ext -I./src/ext/trunnel -I./src/trunnel -I./src/common -Isrc/common -I./src/ext/trunnel -I./src/trunnel -I./src/or -Isrc/or -DSHARE_DATADIR="\"/usr/share\"" -DLOCALSTATEDIR="\"/var\"" -DBINDIR="\"/usr/bin\"" -I./src -DTOR_UNIT_TESTS  -DHAVE_MODULE_DIRAUTH=1 -I./src/common      -O2 -fwrapv -pipe -Wformat -Werror=format-security -gdwarf-4 -fno-debug-types-section -fvar-tracking-assignments -g2 -Wp,-D_FORTIFY_SOURCE=2 -fstack-protector-strong --param=ssp-buffer-size=4 -Werror=trampolines -fPIC -march=x86-64 -mtune=generic -gdwarf-4 -fno-debug-types-section -fvar-tracking-assignments -g2  -U_FORTIFY_SOURCE -D_FORTIFY_SOURCE=2 -fstack-protector-all -Wstack-protector --param ssp-buffer-size=1 -fPIE -fasynchronous-unwind-tables -Wall -fno-strict-aliasing -Waddress -Warray-bounds -Wdate-time -Wdouble-promotion -Wduplicate-decl-specifier -Wduplicated-cond -Wenum-conversion -Wextra -Wfloat-conversion -Wignored-attributes -Wimplicit-fallthrough -Winit-self -Wlogical-op -Wmissing-field-initializers -Wmissing-format-attribute -Wmissing-noreturn -Wnormalized=nfkc -Wnull-dereference -Woverlength-strings -Woverride-init -Wshadow -Wshift-count-negative -Wshift-count-overflow -Wshift-negative-value -Wshift-overflow=2 -Wsizeof-array-argument -Wstrict-overflow=1 -Wstring-compare -Wsuggest-attribute=format -Wsuggest-attribute=noreturn -Wswitch-bool -Wsync-nand -Wtrampolines -Wunused-but-set-parameter -Wunused-but-set-variable -Wunused-const-variable=2 -Wunused-local-typedefs -Wvariadic-macros -W -Wfloat-equal -Wundef -Wpointer-arith -Wstrict-prototypes -Wmissing-prototypes -Wwrite-strings -Wredundant-decls -Wchar-subscripts -Wcomment -Wformat=2 -Wwrite-strings -Wnested-externs -Wbad-function-cast -Wswitch-enum -Waggregate-return -Wpacked -Wunused -Wunused-parameter  -Wold-style-definition -Wmissing-declarations -MT src/common/libor_testing_a-address.o -MD -MP -MF src/common/.deps/libor_testing_a-address.Tpo -c -o src/common/libor_testing_a-address.o `test -f 'src/common/address.c' || echo './'`src/common/address.c
mv -f src/common/.deps/libor_testing_a-address.Tpo src/common/.deps/libor_testing_a-address.Po
make[1]: Leaving directory '/tmp/B.dr54o7_8/BUILD/tor-0.3.4.11'
make[1]: Entering directory '/tmp/B.dr54o7_8/BUILD/tor-0.3.4.11'
x86_64-pld-linux-gcc -DHAVE_CONFIG_H -I.  -I./src/ext -Isrc/ext -I./src/ext/trunnel -I./src/trunnel -I./src/common -Isrc/common -I./src/ext/trunnel -I./src/trunnel -I./src/or -Isrc/or -DSHARE_DATADIR="\"/usr/share\"" -DLOCALSTATEDIR="\"/var\"" -DBINDIR="\"/usr/bin\"" -I./src -DTOR_UNIT_TESTS  -DHAVE_MODULE_DIRAUTH=1 -I./src/common      -O2 -fwrapv -pipe -Wformat -Werror=format-security -gdwarf-4 -fno-debug-types-section -fvar-tracking-assignments -g2 -Wp,-D_FORTIFY_SOURCE=2 -fstack-protector-strong --param=ssp-buffer-size=4 -Werror=trampolines -fPIC -march=x86-64 -mtune=generic -gdwarf-4 -fno-debug-types-section -fvar-tracking-assignments -g2  -U_FORTIFY_SOURCE -D_FORTIFY_SOURCE=2 -fstack-protector-all -Wstack-protector --param ssp-buffer-size=1 -fPIE -fasynchronous-unwind-tables -Wall -fno-strict-aliasing -Waddress -Warray-bounds -Wdate-time -Wdouble-promotion -Wduplicate-decl-specifier -Wduplicated-cond -Wenum-conversion -Wextra -Wfloat-conversion -Wignored-attributes -Wimplicit-fallthrough -Winit-self -Wlogical-op -Wmissing-field-initializers -Wmissing-format-attribute -Wmissing-noreturn -Wnormalized=nfkc -Wnull-dereference -Woverlength-strings -Woverride-init -Wshadow -Wshift-count-negative -Wshift-count-overflow -Wshift-negative-value -Wshift-overflow=2 -Wsizeof-array-argument -Wstrict-overflow=1 -Wstring-compare -Wsuggest-attribute=format -Wsuggest-attribute=noreturn -Wswitch-bool -Wsync-nand -Wtrampolines -Wunused-but-set-parameter -Wunused-but-set-variable -Wunused-const-variable=2 -Wunused-local-typedefs -Wvariadic-macros -W -Wfloat-equal -Wundef -Wpointer-arith -Wstrict-prototypes -Wmissing-prototypes -Wwrite-strings -Wredundant-decls -Wchar-subscripts -Wcomment -Wformat=2 -Wwrite-strings -Wnested-externs -Wbad-function-cast -Wswitch-enum -Waggregate-return -Wpacked -Wunused -Wunused-parameter  -Wold-style-definition -Wmissing-declarations -MT src/common/libor_testing_a-compat.o -MD -MP -MF src/common/.deps/libor_testing_a-compat.Tpo -c -o src/common/libor_testing_a-compat.o `test -f 'src/common/compat.c' || echo './'`src/common/compat.c
mv -f src/common/.deps/libor_testing_a-compat.Tpo src/common/.deps/libor_testing_a-compat.Po
make[1]: Leaving directory '/tmp/B.dr54o7_8/BUILD/tor-0.3.4.11'
make[1]: Entering directory '/tmp/B.dr54o7_8/BUILD/tor-0.3.4.11'
x86_64-pld-linux-gcc -DHAVE_CONFIG_H -I.  -I./src/ext -Isrc/ext -I./src/ext/trunnel -I./src/trunnel -I./src/common -Isrc/common -I./src/ext/trunnel -I./src/trunnel -I./src/or -Isrc/or -DSHARE_DATADIR="\"/usr/share\"" -DLOCALSTATEDIR="\"/var\"" -DBINDIR="\"/usr/bin\"" -I./src -DTOR_UNIT_TESTS  -DHAVE_MODULE_DIRAUTH=1 -I./src/common      -O2 -fwrapv -pipe -Wformat -Werror=format-security -gdwarf-4 -fno-debug-types-section -fvar-tracking-assignments -g2 -Wp,-D_FORTIFY_SOURCE=2 -fstack-protector-strong --param=ssp-buffer-size=4 -Werror=trampolines -fPIC -march=x86-64 -mtune=generic -gdwarf-4 -fno-debug-types-section -fvar-tracking-assignments -g2  -U_FORTIFY_SOURCE -D_FORTIFY_SOURCE=2 -fstack-protector-all -Wstack-protector --param ssp-buffer-size=1 -fPIE -fasynchronous-unwind-tables -Wall -fno-strict-aliasing -Waddress -Warray-bounds -Wdate-time -Wdouble-promotion -Wduplicate-decl-specifier -Wduplicated-cond -Wenum-conversion -Wextra -Wfloat-conversion -Wignored-attributes -Wimplicit-fallthrough -Winit-self -Wlogical-op -Wmissing-field-initializers -Wmissing-format-attribute -Wmissing-noreturn -Wnormalized=nfkc -Wnull-dereference -Woverlength-strings -Woverride-init -Wshadow -Wshift-count-negative -Wshift-count-overflow -Wshift-negative-value -Wshift-overflow=2 -Wsizeof-array-argument -Wstrict-overflow=1 -Wstring-compare -Wsuggest-attribute=format -Wsuggest-attribute=noreturn -Wswitch-bool -Wsync-nand -Wtrampolines -Wunused-but-set-parameter -Wunused-but-set-variable -Wunused-const-variable=2 -Wunused-local-typedefs -Wvariadic-macros -W -Wfloat-equal -Wundef -Wpointer-arith -Wstrict-prototypes -Wmissing-prototypes -Wwrite-strings -Wredundant-decls -Wchar-subscripts -Wcomment -Wformat=2 -Wwrite-strings -Wnested-externs -Wbad-function-cast -Wswitch-enum -Waggregate-return -Wpacked -Wunused -Wunused-parameter  -Wold-style-definition -Wmissing-declarations -MT src/or/dirauth/libtor_testing_a-dirvote.o -MD -MP -MF src/or/dirauth/.deps/libtor_testing_a-dirvote.Tpo -c -o src/or/dirauth/libtor_testing_a-dirvote.o `test -f 'src/or/dirauth/dirvote.c' || echo './'`src/or/dirauth/dirvote.c
mv -f src/or/dirauth/.deps/libtor_testing_a-dirvote.Tpo src/or/dirauth/.deps/libtor_testing_a-dirvote.Po
make[1]: Leaving directory '/tmp/B.dr54o7_8/BUILD/tor-0.3.4.11'
make: *** [Makefile:3992: all] Error 2
error: Bad exit status from /tmp/B.dr54o7_8/BUILD/tmp/rpm-tmp.16vz3M (%build)


RPM build errors:
    Could not canonicalize hostname: ymir
    Bad exit status from /tmp/B.dr54o7_8/BUILD/tmp/rpm-tmp.16vz3M (%build)
ended at: Mon Sep 27 03:40:00 2021, done in 0:00:39.656585
error: No files produced.
+ chmod -R u+rwX /tmp/B.dr54o7_8/BUILD
+ rm -rf /tmp/B.dr54o7_8/tmp /tmp/B.dr54o7_8/BUILD
+ rm -rf /tmp/B.dr54o7_8
Begin-PLD-Builder-Info
Build-Time: user:107.63s sys:16.64s real:41.90s (faults io:6 non-io:3713606)

End-PLD-Builder-Info
[Back to list of logs] [View rpm -qa of builder]