FailedOk

th/SRPMS[OK]
th/x32[OK]
th/i686[OK]
th/x86_64[OK]

ac/SRPMS[OK]
ac/i386[OK]
ac/i586[OK]
ac/i686[OK]
ac/alpha[OK]
ac/amd64[OK]
ac/athlon[OK]
ac/ppc[OK]
ac/sparc[OK]
ac/sparc64[OK]

Advanced Search
main()
Powered by PLD Linux
(c) 2002-2021 PLD Team
$Revision: 1.37 $
Powered by Dark Side of the Force.
Your IP: 3.83.187.254

unbound b992c801-b224-4834-9875-6b2cddf0d3c5

Status:Failed
Source URL:https://buildlogs.pld-linux.org/pld/th/x86_64/FAIL/unbound,b992c801-b224-4834-9875-6b2cddf0d3c5.bz2
text/plain URL:View!
full text:View!
rpm -qa of builder:View!
Date:2021/09/27 03:41:06
Runtime:0:00:57.657156

Toc:

  • error 1
  • /tmp/B.52zm2r1z/BUILD/unbound-1.13.1/smallapp/unbound-control.c:496: undefined reference to `ERR_GET_FUNC'
  • error 2
  • /usr/bin/ld: /tmp/B.52zm2r1z/BUILD/unbound-1.13.1/smallapp/unbound-control.c:497: undefined reference to `ERR_GET_FUNC'
  • error 3
  • collect2: error: ld returned 1 exit status
  • error 4
  • error: Bad exit status from /tmp/B.52zm2r1z/BUILD/tmp/rpm-tmp.ggohmN (%build)
  • error 5
  • RPM build errors:
  • error 6
  • error: No files produced.

Content:

./util/configyyrename.h:66: note: this is the location of the previous definition
   66 | #define yy_delete_buffer ub_c_delete_buffer
      | 
<stdout>:9: warning: "yy_scan_buffer" redefined
In file included from util/configlexer.c:2:
./util/configyyrename.h:61: note: this is the location of the previous definition
   61 | #define yy_scan_buffer ub_c_scan_buffer
      | 
<stdout>:10: warning: "yy_scan_string" redefined
In file included from util/configlexer.c:2:
./util/configyyrename.h:63: note: this is the location of the previous definition
   63 | #define yy_scan_string ub_c_scan_string
      | 
<stdout>:11: warning: "yy_scan_bytes" redefined
In file included from util/configlexer.c:2:
./util/configyyrename.h:62: note: this is the location of the previous definition
   62 | #define yy_scan_bytes ub_c_scan_bytes
      | 
<stdout>:12: warning: "yy_init_buffer" redefined
In file included from util/configlexer.c:2:
./util/configyyrename.h:60: note: this is the location of the previous definition
   60 | #define yy_init_buffer ub_c_init_buffer
      | 
<stdout>:13: warning: "yy_flush_buffer" redefined
In file included from util/configlexer.c:2:
./util/configyyrename.h:59: note: this is the location of the previous definition
   59 | #define yy_flush_buffer ub_c_flush_buffer
      | 
<stdout>:14: warning: "yy_load_buffer_state" redefined
In file included from util/configlexer.c:2:
./util/configyyrename.h:57: note: this is the location of the previous definition
   57 | #define yy_load_buffer_state ub_c_load_buffer_state
      | 
<stdout>:15: warning: "yy_switch_to_buffer" redefined
In file included from util/configlexer.c:2:
./util/configyyrename.h:58: note: this is the location of the previous definition
   58 | #define yy_switch_to_buffer ub_c_switch_to_buffer
      | 
<stdout>:19: warning: "yy_flex_debug" redefined
In file included from util/configlexer.c:2:
./util/configyyrename.h:78: note: this is the location of the previous definition
   78 | #define yy_flex_debug ub_c_flex_debug
      | 
libtool: compile:  x86_64-pld-linux-gcc -I. -I/usr/include/python3.9 -DSRCDIR=. -O2 -fwrapv -pipe -Wformat -Werror=format-security -gdwarf-4 -fno-debug-types-section -fvar-tracking-assignments -g2 -Wp,-D_FORTIFY_SOURCE=2 -fstack-protector-strong --param=ssp-buffer-size=4 -Werror=trampolines -fPIC -march=x86-64 -mtune=generic -gdwarf-4 -fno-debug-types-section -fvar-tracking-assignments -g2 -c util/configlexer.c -o configlexer.o >/dev/null 2>&1
./libtool --tag=CC --mode=compile x86_64-pld-linux-gcc -I. -I/usr/include/python3.9 -DSRCDIR=. -O2 -fwrapv -pipe -Wformat -Werror=format-security -gdwarf-4 -fno-debug-types-section -fvar-tracking-assignments -g2 -Wp,-D_FORTIFY_SOURCE=2 -fstack-protector-strong --param=ssp-buffer-size=4 -Werror=trampolines -fPIC -march=x86-64 -mtune=generic -gdwarf-4 -fno-debug-types-section -fvar-tracking-assignments -g2  -o unbound-anchor.lo -c smallapp/unbound-anchor.c
libtool: compile:  x86_64-pld-linux-gcc -I. -I/usr/include/python3.9 -DSRCDIR=. -O2 -fwrapv -pipe -Wformat -Werror=format-security -gdwarf-4 -fno-debug-types-section -fvar-tracking-assignments -g2 -Wp,-D_FORTIFY_SOURCE=2 -fstack-protector-strong --param=ssp-buffer-size=4 -Werror=trampolines -fPIC -march=x86-64 -mtune=generic -gdwarf-4 -fno-debug-types-section -fvar-tracking-assignments -g2 -c smallapp/unbound-anchor.c  -fPIC -DPIC -o .libs/unbound-anchor.o
libtool: compile:  x86_64-pld-linux-gcc -I. -I/usr/include/python3.9 -DSRCDIR=. -O2 -fwrapv -pipe -Wformat -Werror=format-security -gdwarf-4 -fno-debug-types-section -fvar-tracking-assignments -g2 -Wp,-D_FORTIFY_SOURCE=2 -fstack-protector-strong --param=ssp-buffer-size=4 -Werror=trampolines -fPIC -march=x86-64 -mtune=generic -gdwarf-4 -fno-debug-types-section -fvar-tracking-assignments -g2 -c smallapp/unbound-anchor.c -o unbound-anchor.o >/dev/null 2>&1
./libtool --tag=CC --mode=compile x86_64-pld-linux-gcc -I. -I/usr/include/python3.9 -DSRCDIR=. -O2 -fwrapv -pipe -Wformat -Werror=format-security -gdwarf-4 -fno-debug-types-section -fvar-tracking-assignments -g2 -Wp,-D_FORTIFY_SOURCE=2 -fstack-protector-strong --param=ssp-buffer-size=4 -Werror=trampolines -fPIC -march=x86-64 -mtune=generic -gdwarf-4 -fno-debug-types-section -fvar-tracking-assignments -g2  -o libunbound_wrap.lo -c libunbound/python/libunbound_wrap.c
libtool: compile:  x86_64-pld-linux-gcc -I. -I/usr/include/python3.9 -DSRCDIR=. -O2 -fwrapv -pipe -Wformat -Werror=format-security -gdwarf-4 -fno-debug-types-section -fvar-tracking-assignments -g2 -Wp,-D_FORTIFY_SOURCE=2 -fstack-protector-strong --param=ssp-buffer-size=4 -Werror=trampolines -fPIC -march=x86-64 -mtune=generic -gdwarf-4 -fno-debug-types-section -fvar-tracking-assignments -g2 -c libunbound/python/libunbound_wrap.c  -fPIC -DPIC -o .libs/libunbound_wrap.o
libunbound/python/libunbound_wrap.c: In function 'PythonCallBack':
libunbound/python/libunbound_wrap.c:3386:7: warning: 'PyEval_CallObjectWithKeywords' is deprecated [-Wdeprecated-declarations]
 3386 |       fresult = PyEval_CallObject(id->func,arglist);     // Call Python
      |       ^~~~~~~
In file included from /usr/include/python3.9/Python.h:154,
                 from libunbound/python/libunbound_wrap.c:160:
/usr/include/python3.9/ceval.h:17:43: note: declared here
   17 | Py_DEPRECATED(3.9) PyAPI_FUNC(PyObject *) PyEval_CallObjectWithKeywords(
      |                                           ^~~~~~~~~~~~~~~~~~~~~~~~~~~~~
libtool: compile:  x86_64-pld-linux-gcc -I. -I/usr/include/python3.9 -DSRCDIR=. -O2 -fwrapv -pipe -Wformat -Werror=format-security -gdwarf-4 -fno-debug-types-section -fvar-tracking-assignments -g2 -Wp,-D_FORTIFY_SOURCE=2 -fstack-protector-strong --param=ssp-buffer-size=4 -Werror=trampolines -fPIC -march=x86-64 -mtune=generic -gdwarf-4 -fno-debug-types-section -fvar-tracking-assignments -g2 -c libunbound/python/libunbound_wrap.c -o libunbound_wrap.o >/dev/null 2>&1
./libtool --tag=CC --mode=compile x86_64-pld-linux-gcc -I. -I/usr/include/python3.9 -DSRCDIR=. -O2 -fwrapv -pipe -Wformat -Werror=format-security -gdwarf-4 -fno-debug-types-section -fvar-tracking-assignments -g2 -Wp,-D_FORTIFY_SOURCE=2 -fstack-protector-strong --param=ssp-buffer-size=4 -Werror=trampolines -fPIC -march=x86-64 -mtune=generic -gdwarf-4 -fno-debug-types-section -fvar-tracking-assignments -g2  -o pythonmod.lo -c pythonmod/pythonmod.c
libtool: compile:  x86_64-pld-linux-gcc -I. -I/usr/include/python3.9 -DSRCDIR=. -O2 -fwrapv -pipe -Wformat -Werror=format-security -gdwarf-4 -fno-debug-types-section -fvar-tracking-assignments -g2 -Wp,-D_FORTIFY_SOURCE=2 -fstack-protector-strong --param=ssp-buffer-size=4 -Werror=trampolines -fPIC -march=x86-64 -mtune=generic -gdwarf-4 -fno-debug-types-section -fvar-tracking-assignments -g2 -c pythonmod/pythonmod.c  -fPIC -DPIC -o .libs/pythonmod.o
pythonmod/pythonmod.c: In function 'pythonmod_init':
pythonmod/pythonmod.c:302:7: warning: 'PyEval_InitThreads' is deprecated [-Wdeprecated-declarations]
  302 |       PyEval_InitThreads();
      |       ^~~~~~~~~~~~~~~~~~
In file included from /usr/include/python3.9/Python.h:154,
                 from pythonmod/pythonmod.c:54:
/usr/include/python3.9/ceval.h:130:37: note: declared here
  130 | Py_DEPRECATED(3.9) PyAPI_FUNC(void) PyEval_InitThreads(void);
      |                                     ^~~~~~~~~~~~~~~~~~
pythonmod/pythonmod.c:371:7: warning: 'PyParser_SimpleParseFileFlags' is deprecated [-Wdeprecated-declarations]
  371 |       (void)PyParser_SimpleParseFile(script_py, pe->fname, Py_file_input);
      |       ^
In file included from /usr/include/python3.9/Python.h:152,
                 from pythonmod/pythonmod.c:54:
/usr/include/python3.9/pythonrun.h:91:28: note: declared here
   91 | PyAPI_FUNC(struct _node *) PyParser_SimpleParseFileFlags(FILE *, const char *, int, int);
      |                            ^~~~~~~~~~~~~~~~~~~~~~~~~~~~~
libtool: compile:  x86_64-pld-linux-gcc -I. -I/usr/include/python3.9 -DSRCDIR=. -O2 -fwrapv -pipe -Wformat -Werror=format-security -gdwarf-4 -fno-debug-types-section -fvar-tracking-assignments -g2 -Wp,-D_FORTIFY_SOURCE=2 -fstack-protector-strong --param=ssp-buffer-size=4 -Werror=trampolines -fPIC -march=x86-64 -mtune=generic -gdwarf-4 -fno-debug-types-section -fvar-tracking-assignments -g2 -c pythonmod/pythonmod.c -o pythonmod.o >/dev/null 2>&1
./libtool --tag=CC --mode=link x86_64-pld-linux-gcc  -I. -I/usr/include/python3.9 -DSRCDIR=. -O2 -fwrapv -pipe -Wformat -Werror=format-security -gdwarf-4 -fno-debug-types-section -fvar-tracking-assignments -g2 -Wp,-D_FORTIFY_SOURCE=2 -fstack-protector-strong --param=ssp-buffer-size=4 -Werror=trampolines -fPIC -march=x86-64 -mtune=generic -gdwarf-4 -fno-debug-types-section -fvar-tracking-assignments -g2 -Wl,--as-needed -Wl,--no-copy-dt-needed-entries -Wl,-z,relro -Wl,-z,combreloc  -version-info 9:12:1 -no-undefined -export-symbols ./libunbound/ubsyms.def -o libunbound.la context.lo libunbound.lo libworker.lo ub_event_pluggable.lo dns.lo infra.lo rrset.lo dname.lo msgencode.lo as112.lo msgparse.lo msgreply.lo packed_rrset.lo iterator.lo iter_delegpt.lo iter_donotq.lo iter_fwd.lo iter_hints.lo iter_priv.lo iter_resptype.lo iter_scrub.lo iter_utils.lo localzone.lo mesh.lo modstack.lo view.lo outbound_list.lo alloc.lo config_file.lo configlexer.lo configparser.lo fptr_wlist.lo edns.lo locks.lo log.lo mini_event.lo module.lo net_help.lo random.lo rbtree.lo regional.lo rtt.lo dnstree.lo lookup3.lo lruhash.lo slabhash.lo tcp_conn_limit.lo timehist.lo tube.lo winsock_event.lo autotrust.lo val_anchor.lo rpz.lo validator.lo val_kcache.lo val_kentry.lo val_neg.lo val_nsec3.lo val_nsec.lo val_secalgo.lo val_sigcrypt.lo val_utils.lo dns64.lo cachedb.lo redis.lo authzone.lo  pythonmod.lo pythonmod_utils.lo       respip.lo netevent.lo listen_dnsport.lo outside_network.lo keyraw.lo sbuffer.lo wire2str.lo parse.lo parseutil.lo rrdef.lo str2wire.lo strlcat.lo strlcpy.lo arc4random.lo arc4random_uniform.lo arc4_lock.lo -rpath /usr/lib64 -lssl -levent -L/usr/lib64 -lpython3.9 -lcrypto
libtool: link: echo "{ global:" > .libs/libunbound.ver
libtool: link:  cat ./libunbound/ubsyms.def | sed -e "s/\(.*\)/\1;/" >> .libs/libunbound.ver
libtool: link:  echo "local: *; };" >> .libs/libunbound.ver
libtool: link:  x86_64-pld-linux-gcc -shared  -fPIC -DPIC  -O2 -gdwarf-4 -g2 -fstack-protector-strong -march=x86-64 -mtune=generic -gdwarf-4 -g2 -Wl,--as-needed -Wl,--no-copy-dt-needed-entries -Wl,-z -Wl,relro -Wl,-z -Wl,combreloc    .libs/context.o .libs/libunbound.o .libs/libworker.o .libs/ub_event_pluggable.o .libs/dns.o .libs/infra.o .libs/rrset.o .libs/dname.o .libs/msgencode.o .libs/as112.o .libs/msgparse.o .libs/msgreply.o .libs/packed_rrset.o .libs/iterator.o .libs/iter_delegpt.o .libs/iter_donotq.o .libs/iter_fwd.o .libs/iter_hints.o .libs/iter_priv.o .libs/iter_resptype.o .libs/iter_scrub.o .libs/iter_utils.o .libs/localzone.o .libs/mesh.o .libs/modstack.o .libs/view.o .libs/outbound_list.o .libs/alloc.o .libs/config_file.o .libs/configlexer.o .libs/configparser.o .libs/fptr_wlist.o .libs/edns.o .libs/locks.o .libs/log.o .libs/mini_event.o .libs/module.o .libs/net_help.o .libs/random.o .libs/rbtree.o .libs/regional.o .libs/rtt.o .libs/dnstree.o .libs/lookup3.o .libs/lruhash.o .libs/slabhash.o .libs/tcp_conn_limit.o .libs/timehist.o .libs/tube.o .libs/winsock_event.o .libs/autotrust.o .libs/val_anchor.o .libs/rpz.o .libs/validator.o .libs/val_kcache.o .libs/val_kentry.o .libs/val_neg.o .libs/val_nsec3.o .libs/val_nsec.o .libs/val_secalgo.o .libs/val_sigcrypt.o .libs/val_utils.o .libs/dns64.o .libs/cachedb.o .libs/redis.o .libs/authzone.o .libs/pythonmod.o .libs/pythonmod_utils.o .libs/respip.o .libs/netevent.o .libs/listen_dnsport.o .libs/outside_network.o .libs/keyraw.o .libs/sbuffer.o .libs/wire2str.o .libs/parse.o .libs/parseutil.o .libs/rrdef.o .libs/str2wire.o .libs/strlcat.o .libs/strlcpy.o .libs/arc4random.o .libs/arc4random_uniform.o .libs/arc4_lock.o   -lssl -levent -L/usr/lib64 -lpython3.9 -lcrypto -Wl,-soname -Wl,libunbound.so.8 -Wl,-version-script -Wl,.libs/libunbound.ver -o .libs/libunbound.so.8.1.12
libtool: link: (cd ".libs" && rm -f "libunbound.so.8" && ln -s "libunbound.so.8.1.12" "libunbound.so.8")
libtool: link: (cd ".libs" && rm -f "libunbound.so" && ln -s "libunbound.so.8.1.12" "libunbound.so")
libtool: link: /usr/bin/ar cru .libs/libunbound.a  context.o libunbound.o libworker.o ub_event_pluggable.o dns.o infra.o rrset.o dname.o msgencode.o as112.o msgparse.o msgreply.o packed_rrset.o iterator.o iter_delegpt.o iter_donotq.o iter_fwd.o iter_hints.o iter_priv.o iter_resptype.o iter_scrub.o iter_utils.o localzone.o mesh.o modstack.o view.o outbound_list.o alloc.o config_file.o configlexer.o configparser.o fptr_wlist.o edns.o locks.o log.o mini_event.o module.o net_help.o random.o rbtree.o regional.o rtt.o dnstree.o lookup3.o lruhash.o slabhash.o tcp_conn_limit.o timehist.o tube.o winsock_event.o autotrust.o val_anchor.o rpz.o validator.o val_kcache.o val_kentry.o val_neg.o val_nsec3.o val_nsec.o val_secalgo.o val_sigcrypt.o val_utils.o dns64.o cachedb.o redis.o authzone.o pythonmod.o pythonmod_utils.o respip.o netevent.o listen_dnsport.o outside_network.o keyraw.o sbuffer.o wire2str.o parse.o parseutil.o rrdef.o str2wire.o strlcat.o strlcpy.o arc4random.o arc4random_uniform.o arc4_lock.o
libtool: link: ranlib .libs/libunbound.a
libtool: link: ( cd ".libs" && rm -f "libunbound.la" && ln -s "../libunbound.la" "libunbound.la" )
./libtool --tag=CC --mode=link x86_64-pld-linux-gcc  -I. -I/usr/include/python3.9 -DSRCDIR=. -O2 -fwrapv -pipe -Wformat -Werror=format-security -gdwarf-4 -fno-debug-types-section -fvar-tracking-assignments -g2 -Wp,-D_FORTIFY_SOURCE=2 -fstack-protector-strong --param=ssp-buffer-size=4 -Werror=trampolines -fPIC -march=x86-64 -mtune=generic -gdwarf-4 -fno-debug-types-section -fvar-tracking-assignments -g2 -Wl,--as-needed -Wl,--no-copy-dt-needed-entries -Wl,-z,relro -Wl,-z,combreloc  -module -avoid-version -no-undefined -shared -o _unbound.la libunbound_wrap.lo -rpath /usr/lib64/python3.9/site-packages -L. -L.libs -lunbound
libtool: link: x86_64-pld-linux-gcc -shared  -fPIC -DPIC  -O2 -gdwarf-4 -g2 -fstack-protector-strong -march=x86-64 -mtune=generic -gdwarf-4 -g2 -Wl,--as-needed -Wl,--no-copy-dt-needed-entries -Wl,-z -Wl,relro -Wl,-z -Wl,combreloc    .libs/libunbound_wrap.o   -Wl,-rpath -Wl,/tmp/B.52zm2r1z/BUILD/unbound-1.13.1/.libs -L. -L.libs /tmp/B.52zm2r1z/BUILD/unbound-1.13.1/.libs/libunbound.so -L/usr/lib64 -lssl -levent -lpython3.9 -lcrypto -Wl,-soname -Wl,_unbound.so -o .libs/_unbound.so
libtool: link: ( cd ".libs" && rm -f "_unbound.la" && ln -s "../_unbound.la" "_unbound.la" )
./libtool --tag=CC --mode=link x86_64-pld-linux-gcc   -I. -I/usr/include/python3.9 -DSRCDIR=. -O2 -fwrapv -pipe -Wformat -Werror=format-security -gdwarf-4 -fno-debug-types-section -fvar-tracking-assignments -g2 -Wp,-D_FORTIFY_SOURCE=2 -fstack-protector-strong --param=ssp-buffer-size=4 -Werror=trampolines -fPIC -march=x86-64 -mtune=generic -gdwarf-4 -fno-debug-types-section -fvar-tracking-assignments -g2 -Wl,--as-needed -Wl,--no-copy-dt-needed-entries -Wl,-z,relro -Wl,-z,combreloc  -o unbound-host unbound-host.lo keyraw.lo sbuffer.lo wire2str.lo parse.lo parseutil.lo rrdef.lo str2wire.lo strlcat.lo strlcpy.lo   -L. -L.libs -lunbound -lssl -levent -L/usr/lib64 -lpython3.9 -lcrypto
libtool: link: x86_64-pld-linux-gcc -I. -I/usr/include/python3.9 -DSRCDIR=. -O2 -fwrapv -pipe -Wformat -Werror=format-security -gdwarf-4 -fno-debug-types-section -fvar-tracking-assignments -g2 -Wp,-D_FORTIFY_SOURCE=2 -fstack-protector-strong --param=ssp-buffer-size=4 -Werror=trampolines -fPIC -march=x86-64 -mtune=generic -gdwarf-4 -fno-debug-types-section -fvar-tracking-assignments -g2 -Wl,--as-needed -Wl,--no-copy-dt-needed-entries -Wl,-z -Wl,relro -Wl,-z -Wl,combreloc -o .libs/unbound-host .libs/unbound-host.o .libs/keyraw.o .libs/sbuffer.o .libs/wire2str.o .libs/parse.o .libs/parseutil.o .libs/rrdef.o .libs/str2wire.o .libs/strlcat.o .libs/strlcpy.o  -L. -L.libs /tmp/B.52zm2r1z/BUILD/unbound-1.13.1/.libs/libunbound.so -L/usr/lib64 -lssl -levent -lpython3.9 -lcrypto 
./libtool --tag=CC --mode=link x86_64-pld-linux-gcc   -I. -I/usr/include/python3.9 -DSRCDIR=. -O2 -fwrapv -pipe -Wformat -Werror=format-security -gdwarf-4 -fno-debug-types-section -fvar-tracking-assignments -g2 -Wp,-D_FORTIFY_SOURCE=2 -fstack-protector-strong --param=ssp-buffer-size=4 -Werror=trampolines -fPIC -march=x86-64 -mtune=generic -gdwarf-4 -fno-debug-types-section -fvar-tracking-assignments -g2 -Wl,--as-needed -Wl,--no-copy-dt-needed-entries -Wl,-z,relro -Wl,-z,combreloc  -o unbound-anchor unbound-anchor.lo parseutil.lo strlcat.lo strlcpy.lo arc4random.lo arc4random_uniform.lo arc4_lock.lo   -L. -L.libs -lunbound -lexpat -lssl -levent -L/usr/lib64 -lpython3.9 -lcrypto
libtool: link: x86_64-pld-linux-gcc -I. -I/usr/include/python3.9 -DSRCDIR=. -O2 -fwrapv -pipe -Wformat -Werror=format-security -gdwarf-4 -fno-debug-types-section -fvar-tracking-assignments -g2 -Wp,-D_FORTIFY_SOURCE=2 -fstack-protector-strong --param=ssp-buffer-size=4 -Werror=trampolines -fPIC -march=x86-64 -mtune=generic -gdwarf-4 -fno-debug-types-section -fvar-tracking-assignments -g2 -Wl,--as-needed -Wl,--no-copy-dt-needed-entries -Wl,-z -Wl,relro -Wl,-z -Wl,combreloc -o .libs/unbound-anchor .libs/unbound-anchor.o .libs/parseutil.o .libs/strlcat.o .libs/strlcpy.o .libs/arc4random.o .libs/arc4random_uniform.o .libs/arc4_lock.o  -L. -L.libs /tmp/B.52zm2r1z/BUILD/unbound-1.13.1/.libs/libunbound.so -L/usr/lib64 /usr/lib64/libexpat.so -lssl -levent -lpython3.9 -lcrypto 
./libtool --tag=CC --mode=link x86_64-pld-linux-gcc   -I. -I/usr/include/python3.9 -DSRCDIR=. -O2 -fwrapv -pipe -Wformat -Werror=format-security -gdwarf-4 -fno-debug-types-section -fvar-tracking-assignments -g2 -Wp,-D_FORTIFY_SOURCE=2 -fstack-protector-strong --param=ssp-buffer-size=4 -Werror=trampolines -fPIC -march=x86-64 -mtune=generic -gdwarf-4 -fno-debug-types-section -fvar-tracking-assignments -g2 -Wl,--as-needed -Wl,--no-copy-dt-needed-entries -Wl,-z,relro -Wl,-z,combreloc  -o unbound-control unbound-control.lo  worker_cb.lo dns.lo infra.lo rrset.lo dname.lo msgencode.lo as112.lo msgparse.lo msgreply.lo packed_rrset.lo iterator.lo iter_delegpt.lo iter_donotq.lo iter_fwd.lo iter_hints.lo iter_priv.lo iter_resptype.lo iter_scrub.lo iter_utils.lo localzone.lo mesh.lo modstack.lo view.lo outbound_list.lo alloc.lo config_file.lo configlexer.lo configparser.lo fptr_wlist.lo edns.lo locks.lo log.lo mini_event.lo module.lo net_help.lo random.lo rbtree.lo regional.lo rtt.lo dnstree.lo lookup3.lo lruhash.lo slabhash.lo tcp_conn_limit.lo timehist.lo tube.lo winsock_event.lo autotrust.lo val_anchor.lo rpz.lo validator.lo val_kcache.lo val_kentry.lo val_neg.lo val_nsec3.lo val_nsec.lo val_secalgo.lo val_sigcrypt.lo val_utils.lo dns64.lo cachedb.lo redis.lo authzone.lo  pythonmod.lo pythonmod_utils.lo       respip.lo netevent.lo listen_dnsport.lo outside_network.lo ub_event.lo keyraw.lo sbuffer.lo wire2str.lo parse.lo parseutil.lo rrdef.lo str2wire.lo strlcat.lo strlcpy.lo arc4random.lo arc4random_uniform.lo arc4_lock.lo   -lssl -levent -L/usr/lib64 -lpython3.9 -lcrypto
libtool: link: x86_64-pld-linux-gcc -I. -I/usr/include/python3.9 -DSRCDIR=. -O2 -fwrapv -pipe -Wformat -Werror=format-security -gdwarf-4 -fno-debug-types-section -fvar-tracking-assignments -g2 -Wp,-D_FORTIFY_SOURCE=2 -fstack-protector-strong --param=ssp-buffer-size=4 -Werror=trampolines -fPIC -march=x86-64 -mtune=generic -gdwarf-4 -fno-debug-types-section -fvar-tracking-assignments -g2 -Wl,--as-needed -Wl,--no-copy-dt-needed-entries -Wl,-z -Wl,relro -Wl,-z -Wl,combreloc -o unbound-control .libs/unbound-control.o .libs/worker_cb.o .libs/dns.o .libs/infra.o .libs/rrset.o .libs/dname.o .libs/msgencode.o .libs/as112.o .libs/msgparse.o .libs/msgreply.o .libs/packed_rrset.o .libs/iterator.o .libs/iter_delegpt.o .libs/iter_donotq.o .libs/iter_fwd.o .libs/iter_hints.o .libs/iter_priv.o .libs/iter_resptype.o .libs/iter_scrub.o .libs/iter_utils.o .libs/localzone.o .libs/mesh.o .libs/modstack.o .libs/view.o .libs/outbound_list.o .libs/alloc.o .libs/config_file.o .libs/configlexer.o .libs/configparser.o .libs/fptr_wlist.o .libs/edns.o .libs/locks.o .libs/log.o .libs/mini_event.o .libs/module.o .libs/net_help.o .libs/random.o .libs/rbtree.o .libs/regional.o .libs/rtt.o .libs/dnstree.o .libs/lookup3.o .libs/lruhash.o .libs/slabhash.o .libs/tcp_conn_limit.o .libs/timehist.o .libs/tube.o .libs/winsock_event.o .libs/autotrust.o .libs/val_anchor.o .libs/rpz.o .libs/validator.o .libs/val_kcache.o .libs/val_kentry.o .libs/val_neg.o .libs/val_nsec3.o .libs/val_nsec.o .libs/val_secalgo.o .libs/val_sigcrypt.o .libs/val_utils.o .libs/dns64.o .libs/cachedb.o .libs/redis.o .libs/authzone.o .libs/pythonmod.o .libs/pythonmod_utils.o .libs/respip.o .libs/netevent.o .libs/listen_dnsport.o .libs/outside_network.o .libs/ub_event.o .libs/keyraw.o .libs/sbuffer.o .libs/wire2str.o .libs/parse.o .libs/parseutil.o .libs/rrdef.o .libs/str2wire.o .libs/strlcat.o .libs/strlcpy.o .libs/arc4random.o .libs/arc4random_uniform.o .libs/arc4_lock.o  -lssl -levent -L/usr/lib64 -lpython3.9 -lcrypto 
/usr/bin/ld: .libs/unbound-control.o: in function `ssl_path_err':
/tmp/B.52zm2r1z/BUILD/unbound-1.13.1/smallapp/unbound-control.c:496: undefined reference to `ERR_GET_FUNC'
/usr/bin/ld: /tmp/B.52zm2r1z/BUILD/unbound-1.13.1/smallapp/unbound-control.c:497: undefined reference to `ERR_GET_FUNC'
collect2: error: ld returned 1 exit status
make: *** [Makefile:356: unbound-control] Error 1
make: *** Waiting for unfinished jobs....
./libtool --tag=CC --mode=link x86_64-pld-linux-gcc   -I. -I/usr/include/python3.9 -DSRCDIR=. -O2 -fwrapv -pipe -Wformat -Werror=format-security -gdwarf-4 -fno-debug-types-section -fvar-tracking-assignments -g2 -Wp,-D_FORTIFY_SOURCE=2 -fstack-protector-strong --param=ssp-buffer-size=4 -Werror=trampolines -fPIC -march=x86-64 -mtune=generic -gdwarf-4 -fno-debug-types-section -fvar-tracking-assignments -g2 -Wl,--as-needed -Wl,--no-copy-dt-needed-entries -Wl,-z,relro -Wl,-z,combreloc  -o unbound-checkconf unbound-checkconf.lo worker_cb.lo dns.lo infra.lo rrset.lo dname.lo msgencode.lo as112.lo msgparse.lo msgreply.lo packed_rrset.lo iterator.lo iter_delegpt.lo iter_donotq.lo iter_fwd.lo iter_hints.lo iter_priv.lo iter_resptype.lo iter_scrub.lo iter_utils.lo localzone.lo mesh.lo modstack.lo view.lo outbound_list.lo alloc.lo config_file.lo configlexer.lo configparser.lo fptr_wlist.lo edns.lo locks.lo log.lo mini_event.lo module.lo net_help.lo random.lo rbtree.lo regional.lo rtt.lo dnstree.lo lookup3.lo lruhash.lo slabhash.lo tcp_conn_limit.lo timehist.lo tube.lo winsock_event.lo autotrust.lo val_anchor.lo rpz.lo validator.lo val_kcache.lo val_kentry.lo val_neg.lo val_nsec3.lo val_nsec.lo val_secalgo.lo val_sigcrypt.lo val_utils.lo dns64.lo cachedb.lo redis.lo authzone.lo  pythonmod.lo pythonmod_utils.lo       respip.lo netevent.lo listen_dnsport.lo outside_network.lo ub_event.lo keyraw.lo sbuffer.lo wire2str.lo parse.lo parseutil.lo rrdef.lo str2wire.lo strlcat.lo strlcpy.lo arc4random.lo arc4random_uniform.lo arc4_lock.lo   -lssl -levent -L/usr/lib64 -lpython3.9 -lcrypto
libtool: link: x86_64-pld-linux-gcc -I. -I/usr/include/python3.9 -DSRCDIR=. -O2 -fwrapv -pipe -Wformat -Werror=format-security -gdwarf-4 -fno-debug-types-section -fvar-tracking-assignments -g2 -Wp,-D_FORTIFY_SOURCE=2 -fstack-protector-strong --param=ssp-buffer-size=4 -Werror=trampolines -fPIC -march=x86-64 -mtune=generic -gdwarf-4 -fno-debug-types-section -fvar-tracking-assignments -g2 -Wl,--as-needed -Wl,--no-copy-dt-needed-entries -Wl,-z -Wl,relro -Wl,-z -Wl,combreloc -o unbound-checkconf .libs/unbound-checkconf.o .libs/worker_cb.o .libs/dns.o .libs/infra.o .libs/rrset.o .libs/dname.o .libs/msgencode.o .libs/as112.o .libs/msgparse.o .libs/msgreply.o .libs/packed_rrset.o .libs/iterator.o .libs/iter_delegpt.o .libs/iter_donotq.o .libs/iter_fwd.o .libs/iter_hints.o .libs/iter_priv.o .libs/iter_resptype.o .libs/iter_scrub.o .libs/iter_utils.o .libs/localzone.o .libs/mesh.o .libs/modstack.o .libs/view.o .libs/outbound_list.o .libs/alloc.o .libs/config_file.o .libs/configlexer.o .libs/configparser.o .libs/fptr_wlist.o .libs/edns.o .libs/locks.o .libs/log.o .libs/mini_event.o .libs/module.o .libs/net_help.o .libs/random.o .libs/rbtree.o .libs/regional.o .libs/rtt.o .libs/dnstree.o .libs/lookup3.o .libs/lruhash.o .libs/slabhash.o .libs/tcp_conn_limit.o .libs/timehist.o .libs/tube.o .libs/winsock_event.o .libs/autotrust.o .libs/val_anchor.o .libs/rpz.o .libs/validator.o .libs/val_kcache.o .libs/val_kentry.o .libs/val_neg.o .libs/val_nsec3.o .libs/val_nsec.o .libs/val_secalgo.o .libs/val_sigcrypt.o .libs/val_utils.o .libs/dns64.o .libs/cachedb.o .libs/redis.o .libs/authzone.o .libs/pythonmod.o .libs/pythonmod_utils.o .libs/respip.o .libs/netevent.o .libs/listen_dnsport.o .libs/outside_network.o .libs/ub_event.o .libs/keyraw.o .libs/sbuffer.o .libs/wire2str.o .libs/parse.o .libs/parseutil.o .libs/rrdef.o .libs/str2wire.o .libs/strlcat.o .libs/strlcpy.o .libs/arc4random.o .libs/arc4random_uniform.o .libs/arc4_lock.o  -lssl -levent -L/usr/lib64 -lpython3.9 -lcrypto 
./libtool --tag=CC --mode=link x86_64-pld-linux-gcc   -I. -I/usr/include/python3.9 -DSRCDIR=. -O2 -fwrapv -pipe -Wformat -Werror=format-security -gdwarf-4 -fno-debug-types-section -fvar-tracking-assignments -g2 -Wp,-D_FORTIFY_SOURCE=2 -fstack-protector-strong --param=ssp-buffer-size=4 -Werror=trampolines -fPIC -march=x86-64 -mtune=generic -gdwarf-4 -fno-debug-types-section -fvar-tracking-assignments -g2 -Wl,--as-needed -Wl,--no-copy-dt-needed-entries -Wl,-z,relro -Wl,-z,combreloc  -o unbound acl_list.lo cachedump.lo daemon.lo shm_main.lo remote.lo stats.lo unbound.lo worker.lo  dns.lo infra.lo rrset.lo dname.lo msgencode.lo as112.lo msgparse.lo msgreply.lo packed_rrset.lo iterator.lo iter_delegpt.lo iter_donotq.lo iter_fwd.lo iter_hints.lo iter_priv.lo iter_resptype.lo iter_scrub.lo iter_utils.lo localzone.lo mesh.lo modstack.lo view.lo outbound_list.lo alloc.lo config_file.lo configlexer.lo configparser.lo fptr_wlist.lo edns.lo locks.lo log.lo mini_event.lo module.lo net_help.lo random.lo rbtree.lo regional.lo rtt.lo dnstree.lo lookup3.lo lruhash.lo slabhash.lo tcp_conn_limit.lo timehist.lo tube.lo winsock_event.lo autotrust.lo val_anchor.lo rpz.lo validator.lo val_kcache.lo val_kentry.lo val_neg.lo val_nsec3.lo val_nsec.lo val_secalgo.lo val_sigcrypt.lo val_utils.lo dns64.lo cachedb.lo redis.lo authzone.lo  pythonmod.lo pythonmod_utils.lo       respip.lo netevent.lo listen_dnsport.lo outside_network.lo ub_event.lo keyraw.lo sbuffer.lo wire2str.lo parse.lo parseutil.lo rrdef.lo str2wire.lo strlcat.lo strlcpy.lo arc4random.lo arc4random_uniform.lo arc4_lock.lo   -lssl -levent -L/usr/lib64 -lpython3.9 -lcrypto 
libtool: link: x86_64-pld-linux-gcc -I. -I/usr/include/python3.9 -DSRCDIR=. -O2 -fwrapv -pipe -Wformat -Werror=format-security -gdwarf-4 -fno-debug-types-section -fvar-tracking-assignments -g2 -Wp,-D_FORTIFY_SOURCE=2 -fstack-protector-strong --param=ssp-buffer-size=4 -Werror=trampolines -fPIC -march=x86-64 -mtune=generic -gdwarf-4 -fno-debug-types-section -fvar-tracking-assignments -g2 -Wl,--as-needed -Wl,--no-copy-dt-needed-entries -Wl,-z -Wl,relro -Wl,-z -Wl,combreloc -o unbound .libs/acl_list.o .libs/cachedump.o .libs/daemon.o .libs/shm_main.o .libs/remote.o .libs/stats.o .libs/unbound.o .libs/worker.o .libs/dns.o .libs/infra.o .libs/rrset.o .libs/dname.o .libs/msgencode.o .libs/as112.o .libs/msgparse.o .libs/msgreply.o .libs/packed_rrset.o .libs/iterator.o .libs/iter_delegpt.o .libs/iter_donotq.o .libs/iter_fwd.o .libs/iter_hints.o .libs/iter_priv.o .libs/iter_resptype.o .libs/iter_scrub.o .libs/iter_utils.o .libs/localzone.o .libs/mesh.o .libs/modstack.o .libs/view.o .libs/outbound_list.o .libs/alloc.o .libs/config_file.o .libs/configlexer.o .libs/configparser.o .libs/fptr_wlist.o .libs/edns.o .libs/locks.o .libs/log.o .libs/mini_event.o .libs/module.o .libs/net_help.o .libs/random.o .libs/rbtree.o .libs/regional.o .libs/rtt.o .libs/dnstree.o .libs/lookup3.o .libs/lruhash.o .libs/slabhash.o .libs/tcp_conn_limit.o .libs/timehist.o .libs/tube.o .libs/winsock_event.o .libs/autotrust.o .libs/val_anchor.o .libs/rpz.o .libs/validator.o .libs/val_kcache.o .libs/val_kentry.o .libs/val_neg.o .libs/val_nsec3.o .libs/val_nsec.o .libs/val_secalgo.o .libs/val_sigcrypt.o .libs/val_utils.o .libs/dns64.o .libs/cachedb.o .libs/redis.o .libs/authzone.o .libs/pythonmod.o .libs/pythonmod_utils.o .libs/respip.o .libs/netevent.o .libs/listen_dnsport.o .libs/outside_network.o .libs/ub_event.o .libs/keyraw.o .libs/sbuffer.o .libs/wire2str.o .libs/parse.o .libs/parseutil.o .libs/rrdef.o .libs/str2wire.o .libs/strlcat.o .libs/strlcpy.o .libs/arc4random.o .libs/arc4random_uniform.o .libs/arc4_lock.o  -lssl -levent -L/usr/lib64 -lpython3.9 -lcrypto 
error: Bad exit status from /tmp/B.52zm2r1z/BUILD/tmp/rpm-tmp.ggohmN (%build)


RPM build errors:
    Could not canonicalize hostname: ymir
    Bad exit status from /tmp/B.52zm2r1z/BUILD/tmp/rpm-tmp.ggohmN (%build)
ended at: Mon Sep 27 03:41:05 2021, done in 0:00:57.657156
error: No files produced.
+ chmod -R u+rwX /tmp/B.52zm2r1z/BUILD
+ rm -rf /tmp/B.52zm2r1z/tmp /tmp/B.52zm2r1z/BUILD
+ rm -rf /tmp/B.52zm2r1z
Begin-PLD-Builder-Info
Build-Time: user:142.59s sys:20.68s real:60.04s (faults io:25 non-io:4846933)

End-PLD-Builder-Info
[Back to list of logs] [View rpm -qa of builder]