FailedOk

th/SRPMS[OK]
th/x32[OK]
th/i686[OK]
th/x86_64[OK]

ac/SRPMS[OK]
ac/i386[OK]
ac/i586[OK]
ac/i686[OK]
ac/alpha[OK]
ac/amd64[OK]
ac/athlon[OK]
ac/ppc[OK]
ac/sparc[OK]
ac/sparc64[OK]

Advanced Search
main()
Powered by PLD Linux
(c) 2002-2023 PLD Team
$Revision: 1.37 $
Powered by matrix.
Your IP: 44.192.38.49

wl 4cc56904-df04-4a5d-953a-95d0b7542ff6

Status:Failed
Source URL:https://buildlogs.pld-linux.org/pld/th/x86_64/FAIL/wl,4cc56904-df04-4a5d-953a-95d0b7542ff6.bz2
text/plain URL:View!
rpm -qa of builder:View!
Date:2022/10/28 16:46:40
Runtime:0:00:26.200951

Toc:

  • prep
  • Executing(%prep): /bin/sh -e /tmp/B.48nszj6l/BUILD/tmp/rpm-tmp.ARhBBc
  • build
  • Executing(%build): /bin/sh -e /tmp/B.48nszj6l/BUILD/tmp/rpm-tmp.sy8Ixg
  • error 1
  • /tmp/B.48nszj6l/BUILD/wl-6.30.223.271/wl/src/wl/sys/wl_cfg80211_hybrid.c:2391:18: error: 'struct cfg80211_roam_info' has no member named 'bss'
  • error 2
  • /tmp/B.48nszj6l/BUILD/wl-6.30.223.271/wl/src/wl/sys/wl_cfg80211_hybrid.c:2391:24: error: initialization of 'const u8 *' {aka 'const unsigned char *'} from incompatible pointer type 'struct cfg80211_bss *' [-Werror=incompatible-pointer-types]
  • error 3
  • make[2]: *** [scripts/Makefile.build:249: /tmp/B.48nszj6l/BUILD/wl-6.30.223.271/wl/src/wl/sys/wl_cfg80211_hybrid.o] Error 1
  • error 4
  • make[1]: *** [Makefile:1852: /tmp/B.48nszj6l/BUILD/wl-6.30.223.271/wl] Error 2
  • error 5
  • error: Bad exit status from /tmp/B.48nszj6l/BUILD/tmp/rpm-tmp.sy8Ixg (%build)
  • error 6
  • RPM build errors:
  • error 7
  • error: No files produced.

Content:

request from: baggins
checking if we should skip the build
started at: Fri Oct 28 16:45:56 2022
killing old processes on a builder
sending signal 9 to pid -1
cleaning up /tmp
fetching https://srcbuilder.pld-linux.org/th//srpms/4cc56904-df04-4a5d-953a-95d0b7542ff6/wl-kernel-6.30.223.271-17%406.0.5_1.src.rpm
fetched 5769114 bytes, 9545.6 K/s
installing srpm: wl-kernel-6.30.223.271-17@6.0.5_1.src.rpm
+ install -d /tmp/B.48nszj6l/BUILD /tmp/B.48nszj6l/RPMS
+ LC_ALL=en_US.UTF-8
+ rpm -qp --changelog wl-kernel-6.30.223.271-17@6.0.5_1.src.rpm
* Fri Oct 28 2022 PLD Linux Team <feedback@pld-linux.org>
- For complete changelog see: http://git.pld-linux.org/?p=packages/wl.git;a=log;h=auto/th/wl-6.30.223.271-17
* Thu May 26 2022 Jan Rękorajski <baggins@pld-linux.org> 052445a
- fix building with kernel 5.18, rel 17 * Sat Apr 02 2022 Jan Rękorajski <baggins@pld-linux.org> 2d967bf
- fix kernel version in patch for 5.17, rel 16 * Sat Apr 02 2022 Jan Rękorajski <baggins@pld-linux.org> 0061e56
- build fix for kernel 5.17, rel 15 * Fri Feb 26 2021 Jan Rękorajski <baggins@pld-linux.org> 5ec0a12
- drop noarchpackage macro * Fri Feb 26 2021 Jan Rękorajski <baggins@pld-linux.org> 3d88db0
- fix noarch package - rel 14 * Thu Feb 25 2021 Jan Rękorajski <baggins@pld-linux.org> c90561b
- fix prep and rediff patches - rel 13 * Thu Dec 24 2020 Jan Rękorajski <baggins@pld-linux.org> c504579
- fix building with kernel 5.10 - fix bad call since kernel 4.14 - rel 12 * Wed Oct 21 2020 Jan Rękorajski <baggins@pld-linux.org> 4b51e5e
- fix building with kernel 5.9 - rel 11 * Sun Apr 05 2020 Jan Rękorajski <baggins@pld-linux.org> 221b3eb
- fix building for kernel 5.6 - rel 10 * Tue May 07 2019 Jan Rękorajski <baggins@pld-linux.org> 263b171
- fix building with kernel 5.1 - rel 9 * Tue Jan 30 2018 Jan Rękorajski <baggins@pld-linux.org> 3f0dc04
- fix for kernel 4.15 from arch https://bugs.archlinux.org/task/57261 - rel 8 * Mon Jul 31 2017 Jan Rękorajski <baggins@pld-linux.org> 6030187
- rel 7 - fix building with kernel 4.12 * Wed May 10 2017 Jan Rękorajski <baggins@pld-linux.org> 94191af
- fix building with kerbel 4.11 - rel 6 * Thu Jan 19 2017 Jan Rękorajski <baggins@pld-linux.org> f316d7d
- * added 17-fix-kernel-warnings.patch from Debian (avoid useless kernel warnings and possibly add better tracibility of bogus auth failures) - rel 5 * Tue Dec 27 2016 Jan Rękorajski <baggins@pld-linux.org> 18f1113
- rel 4 * Mon Nov 21 2016 Jan Rękorajski <baggins@pld-linux.org> f36814b
- updated URL * Mon Oct 10 2016 Jan Rękorajski <baggins@pld-linux.org> 0e2168f
- added patches from Debian to fix old crash and new one on linux 4.8 - rel 3 * Sun Jul 31 2016 Jan Rękorajski <baggins@pld-linux.org> 5bfd004
- fix building with linux 4.7 - rel 2 * Thu Mar 17 2016 Jan Rękorajski <baggins@pld-linux.org> 726f0ca
- updated to 6.30.223.271 - don't use handcrafted Makefile, it produces useless shit - add blacklist configuration for conflicting drivers * Sat Dec 05 2015 Jan Rękorajski <baggins@pld-linux.org> c9fb484
- remove unused code that breaks build on i686 with linux 4.3 - rel 9 + rpm -Uhv --nodeps --define '_topdir /tmp/B.48nszj6l' --define '_specdir %{_topdir}' --define '_sourcedir %{_specdir}' --define '_rpmdir %{_topdir}/RPMS' --define '_builddir %{_topdir}/BUILD' --without userspace --define 'build_kernels 5.4,4.19,head,4.14,4.9,5.10,5.15' wl-kernel-6.30.223.271-17@6.0.5_1.src.rpm Updating / installing... wl-kernel-6.30.223.271-17@6.0.5_1 ######################################## + rm -f wl-kernel-6.30.223.271-17@6.0.5_1.src.rpm + install -m 700 -d /tmp/B.48nszj6l/BUILD/tmp + TMPDIR=/tmp/B.48nszj6l/BUILD/tmp + exec nice -n 0 rpmbuild -bp --short-circuit --nodeps --define '_topdir /tmp/B.48nszj6l' --define '_specdir %{_topdir}' --define '_sourcedir %{_specdir}' --define '_rpmdir %{_topdir}/RPMS' --define '_builddir %{_topdir}/BUILD' --without userspace --target x86_64-pld-linux --define 'build_kernels 5.4,4.19,head,4.14,4.9,5.10,5.15' --define 'prep exit 0' /tmp/B.48nszj6l/wl.spec warning: Could not canonicalize hostname: ymir Building target platforms: x86_64-pld-linux Building for target x86_64-pld-linux RPM build warnings: Could not canonicalize hostname: ymir checking BuildConflict-ing packages rpm: warning: Could not canonicalize hostname: ymir rpm: Building target platforms: x86_64-pld-linux rpm: Building for target x86_64-pld-linux rpm: rpm: RPM build warnings: rpm: Could not canonicalize hostname: ymir no BuildConflicts found checking BR rpm: warning: Could not canonicalize hostname: ymir rpm: Building target platforms: x86_64-pld-linux rpm: Building for target x86_64-pld-linux rpm: rpm: RPM build warnings: rpm: Could not canonicalize hostname: ymir no BR needed building RPM using: set -ex; : build-id: 4cc56904-df04-4a5d-953a-95d0b7542ff6; TMPDIR=/tmp/B.48nszj6l/BUILD/tmp exec nice -n 0 rpmbuild -bb --define '__jobs 28' --define '_smp_mflags -j28' --define '_make_opts -Otarget' --define '_pld_builder 1' --define '_topdir /tmp/B.48nszj6l' --define '_specdir %{_topdir}' --define '_sourcedir %{_specdir}' --define '_rpmdir %{_topdir}/RPMS' --define '_builddir %{_topdir}/BUILD' --without userspace --target x86_64-pld-linux --define 'build_kernels 5.4,4.19,head,4.14,4.9,5.10,5.15' /tmp/B.48nszj6l/wl.spec + : build-id: 4cc56904-df04-4a5d-953a-95d0b7542ff6 + TMPDIR=/tmp/B.48nszj6l/BUILD/tmp + exec nice -n 0 rpmbuild -bb --define '__jobs 28' --define '_smp_mflags -j28' --define '_make_opts -Otarget' --define '_pld_builder 1' --define '_topdir /tmp/B.48nszj6l' --define '_specdir %{_topdir}' --define '_sourcedir %{_specdir}' --define '_rpmdir %{_topdir}/RPMS' --define '_builddir %{_topdir}/BUILD' --without userspace --target x86_64-pld-linux --define 'build_kernels 5.4,4.19,head,4.14,4.9,5.10,5.15' /tmp/B.48nszj6l/wl.spec warning: Could not canonicalize hostname: ymir Building target platforms: x86_64-pld-linux Building for target x86_64-pld-linux Executing(%prep): /bin/sh -e /tmp/B.48nszj6l/BUILD/tmp/rpm-tmp.ARhBBc + umask 022 + cd /tmp/B.48nszj6l/BUILD + cd /tmp/B.48nszj6l/BUILD + rm -rf wl-6.30.223.271 + /bin/mkdir -p wl-6.30.223.271 + cd wl-6.30.223.271 + /bin/gzip -dc /tmp/B.48nszj6l/hybrid-v35-nodebug-pcoem-6_30_223_271.tar.gz + /bin/tar -xof - + STATUS=0 + '[' 0 -ne 0 ']' + /bin/gzip -dc /tmp/B.48nszj6l/hybrid-v35_64-nodebug-pcoem-6_30_223_271.tar.gz + /bin/tar -xof - + STATUS=0 + '[' 0 -ne 0 ']' + /bin/chmod -Rf a+rX,u+w,g-w,o-w . + echo 'Patch #0 (13-broadcom-sta-6.30.223.248-linux-3.18-null-pointer-crash.patch):' Patch #0 (13-broadcom-sta-6.30.223.248-linux-3.18-null-pointer-crash.patch): + </tmp/B.48nszj6l/13-broadcom-sta-6.30.223.248-linux-3.18-null-pointer-crash.patch + /usr/bin/patch -s -f -p1 '--fuzz=0' + echo 'Patch #1 (gcc-4.9.patch):' Patch #1 (gcc-4.9.patch): + </tmp/B.48nszj6l/gcc-4.9.patch + /usr/bin/patch -s -f -p1 '--fuzz=0' + echo 'Patch #2 (no-dead-code.patch):' Patch #2 (no-dead-code.patch): + </tmp/B.48nszj6l/no-dead-code.patch + /usr/bin/patch -s -f -p1 '--fuzz=0' + echo 'Patch #3 (linux-4.7.patch):' Patch #3 (linux-4.7.patch): + </tmp/B.48nszj6l/linux-4.7.patch + /usr/bin/patch -s -f -p1 '--fuzz=0' + echo 'Patch #4 (linux-4.8.patch):' Patch #4 (linux-4.8.patch): + </tmp/B.48nszj6l/linux-4.8.patch + /usr/bin/patch -s -f -p1 '--fuzz=0' + echo 'Patch #5 (17-fix-kernel-warnings.patch):' Patch #5 (17-fix-kernel-warnings.patch): + </tmp/B.48nszj6l/17-fix-kernel-warnings.patch + /usr/bin/patch -s -f -p2 '--fuzz=0' + echo 'Patch #6 (linux-4.11.patch):' Patch #6 (linux-4.11.patch): + </tmp/B.48nszj6l/linux-4.11.patch + /usr/bin/patch -s -f -p1 '--fuzz=0' + echo 'Patch #7 (linux-4.12.patch):' Patch #7 (linux-4.12.patch): + </tmp/B.48nszj6l/linux-4.12.patch + /usr/bin/patch -s -f -p1 '--fuzz=0' + echo 'Patch #8 (008-linux415.patch):' Patch #8 (008-linux415.patch): + </tmp/B.48nszj6l/008-linux415.patch + /usr/bin/patch -s -f -p1 '--fuzz=0' + echo 'Patch #9 (kernel-4.14.patch):' Patch #9 (kernel-4.14.patch): + </tmp/B.48nszj6l/kernel-4.14.patch + /usr/bin/patch -s -f -p1 '--fuzz=0' + echo 'Patch #10 (linux-5.6.patch):' Patch #10 (linux-5.6.patch): + </tmp/B.48nszj6l/linux-5.6.patch + /usr/bin/patch -s -f -p2 '--fuzz=0' + echo 'Patch #11 (kernel-5.10.patch):' Patch #11 (kernel-5.10.patch): + </tmp/B.48nszj6l/kernel-5.10.patch + /usr/bin/patch -s -f -p1 '--fuzz=0' + echo 'Patch #12 (kernel-5.17.patch):' Patch #12 (kernel-5.17.patch): + </tmp/B.48nszj6l/kernel-5.17.patch + /usr/bin/patch -s -f -p2 '--fuzz=0' + echo 'Patch #13 (kernel-5.18.patch):' Patch #13 (kernel-5.18.patch): + </tmp/B.48nszj6l/kernel-5.18.patch + /usr/bin/patch -s -f -p2 '--fuzz=0' + mkdir wl + mv lib src Makefile wl/ + cp -p /tmp/B.48nszj6l/README.txt . + find '(' -name '*~' -o -name '*.orig' ')' -print0 + xargs -0 -r -l512 rm -f + RPM_EC=0 + jobs -p + exit 0 Executing(%build): /bin/sh -e /tmp/B.48nszj6l/BUILD/tmp/rpm-tmp.sy8Ixg TMP=/home/users/builder/tmp HOME=/home/users/builder PATH=/home/users/builder/GNUstep/Tools:/bin:/usr/bin:/usr/local/bin:/home/users/builder/bin TMPDIR=/tmp/B.48nszj6l/BUILD/tmp + umask 022 + cd /tmp/B.48nszj6l/BUILD + cd wl-6.30.223.271 + /usr/bin/make -Otarget -j28 -C wl 'KERNELRELEASE=5.4.220-1' 'KBUILD_DIR=/usr/src/linux-5.4' clean make: Entering directory '/tmp/B.48nszj6l/BUILD/wl-6.30.223.271/wl' Wireless Extension is the only possible API for this kernel version Using Wireless Extension API make: Leaving directory '/tmp/B.48nszj6l/BUILD/wl-6.30.223.271/wl' make: Entering directory '/tmp/B.48nszj6l/BUILD/wl-6.30.223.271/wl' KBUILD_NOPEDANTIC=1 make -C /usr/src/linux-5.4 M=`pwd` clean make[1]: Entering directory '/usr/src/linux-5.4-5.4.220' make[1]: warning: jobserver unavailable: using -j1. Add '+' to parent make rule. make[1]: Leaving directory '/usr/src/linux-5.4-5.4.220' make[1]: Entering directory '/usr/src/linux-5.4-5.4.220' CFG80211 API is prefered for this kernel version /tmp/B.48nszj6l/BUILD/wl-6.30.223.271/wl/Makefile:85: Neither CFG80211 nor Wireless Extension is enabled in kernel make[1]: Leaving directory '/usr/src/linux-5.4-5.4.220' make: Leaving directory '/tmp/B.48nszj6l/BUILD/wl-6.30.223.271/wl' + /usr/bin/make -Otarget -j28 -C wl 'KERNELRELEASE=5.4.220-1' 'KBUILD_DIR=/usr/src/linux-5.4' make: Entering directory '/tmp/B.48nszj6l/BUILD/wl-6.30.223.271/wl' Wireless Extension is the only possible API for this kernel version Using Wireless Extension API make: Leaving directory '/tmp/B.48nszj6l/BUILD/wl-6.30.223.271/wl' make: Entering directory '/tmp/B.48nszj6l/BUILD/wl-6.30.223.271/wl' KBUILD_NOPEDANTIC=1 make -C /usr/src/linux-5.4 M=`pwd` make[1]: Entering directory '/usr/src/linux-5.4-5.4.220' make[1]: warning: jobserver unavailable: using -j1. Add '+' to parent make rule. make[1]: Leaving directory '/usr/src/linux-5.4-5.4.220' make[1]: Entering directory '/usr/src/linux-5.4-5.4.220' CFG80211 API is prefered for this kernel version Using CFG80211 API AR /tmp/B.48nszj6l/BUILD/wl-6.30.223.271/wl/built-in.a CC [M] /tmp/B.48nszj6l/BUILD/wl-6.30.223.271/wl/src/shared/linux_osl.o CC [M] /tmp/B.48nszj6l/BUILD/wl-6.30.223.271/wl/src/wl/sys/wl_linux.o /tmp/B.48nszj6l/BUILD/wl-6.30.223.271/wl/src/wl/sys/wl_linux.c: In function 'wl_pci_probe': /tmp/B.48nszj6l/BUILD/wl-6.30.223.271/wl/src/wl/sys/wl_linux.c:787:9: warning: this 'if' clause does not guard... [-Wmisleading-indentation] 787 | if ((val & 0x0000ff00) != 0) | ^~ /tmp/B.48nszj6l/BUILD/wl-6.30.223.271/wl/src/wl/sys/wl_linux.c:789:17: note: ...this statement, but the latter is misleadingly indented as if it were guarded by the 'if' 789 | bar1_size = pci_resource_len(pdev, 2); | ^~~~~~~~~ CC [M] /tmp/B.48nszj6l/BUILD/wl-6.30.223.271/wl/src/wl/sys/wl_iw.o CC [M] /tmp/B.48nszj6l/BUILD/wl-6.30.223.271/wl/src/wl/sys/wl_cfg80211_hybrid.o /tmp/B.48nszj6l/BUILD/wl-6.30.223.271/wl/src/wl/sys/wl_cfg80211_hybrid.c: In function 'wl_bss_roaming_done': /tmp/B.48nszj6l/BUILD/wl-6.30.223.271/wl/src/wl/sys/wl_cfg80211_hybrid.c:2390:9: warning: ISO C90 forbids mixed declarations and code [-Wdeclaration-after-statement] 2390 | struct cfg80211_roam_info roam_info = { | ^~~~~~ In file included from /tmp/B.48nszj6l/BUILD/wl-6.30.223.271/wl/src/wl/sys/wl_cfg80211_hybrid.c:43: /tmp/B.48nszj6l/BUILD/wl-6.30.223.271/wl/src/wl/sys/wl_cfg80211_hybrid.c: In function 'wl_set_auth_type': /tmp/B.48nszj6l/BUILD/wl-6.30.223.271/wl/src/wl/sys/wl_cfg80211_hybrid.h:52:12: warning: this statement may fall through [-Wimplicit-fallthrough=] 52 | if (wl_dbg_level & WL_DBG_DBG) { \ | ^ /tmp/B.48nszj6l/BUILD/wl-6.30.223.271/wl/src/wl/sys/wl_cfg80211_hybrid.c:800:17: note: in expansion of macro 'WL_DBG' 800 | WL_DBG(("network eap\n")); | ^~~~~~ /tmp/B.48nszj6l/BUILD/wl-6.30.223.271/wl/src/wl/sys/wl_cfg80211_hybrid.c:801:9: note: here 801 | default: | ^~~~~~~ LD [M] /tmp/B.48nszj6l/BUILD/wl-6.30.223.271/wl/wl.o CFG80211 API is prefered for this kernel version Using CFG80211 API Building modules, stage 2. MODPOST 1 modules CC [M] /tmp/B.48nszj6l/BUILD/wl-6.30.223.271/wl/wl.mod.o LD [M] /tmp/B.48nszj6l/BUILD/wl-6.30.223.271/wl/wl.ko make[1]: Leaving directory '/usr/src/linux-5.4-5.4.220' make: Leaving directory '/tmp/B.48nszj6l/BUILD/wl-6.30.223.271/wl' + INSTALLROOT=installed + '[' -n installed ']' + set +x make: Entering directory '/tmp/B.48nszj6l/BUILD/wl-6.30.223.271/wl' Wireless Extension is the only possible API for this kernel version Using Wireless Extension API make: Leaving directory '/tmp/B.48nszj6l/BUILD/wl-6.30.223.271/wl' make: Entering directory '/tmp/B.48nszj6l/BUILD/wl-6.30.223.271/wl' KBUILD_NOPEDANTIC=1 make -C /usr/src/linux-4.19 M=`pwd` clean make[1]: Entering directory '/usr/src/linux-4.19-4.19.262' make[1]: warning: jobserver unavailable: using -j1. Add '+' to parent make rule. make[1]: Leaving directory '/usr/src/linux-4.19-4.19.262' make[1]: Entering directory '/usr/src/linux-4.19-4.19.262' CFG80211 API is prefered for this kernel version /tmp/B.48nszj6l/BUILD/wl-6.30.223.271/wl/Makefile:85: Neither CFG80211 nor Wireless Extension is enabled in kernel CLEAN /tmp/B.48nszj6l/BUILD/wl-6.30.223.271/wl/Module.symvers make[1]: Leaving directory '/usr/src/linux-4.19-4.19.262' make: Leaving directory '/tmp/B.48nszj6l/BUILD/wl-6.30.223.271/wl' make: Entering directory '/tmp/B.48nszj6l/BUILD/wl-6.30.223.271/wl' Wireless Extension is the only possible API for this kernel version Using Wireless Extension API make: Leaving directory '/tmp/B.48nszj6l/BUILD/wl-6.30.223.271/wl' make: Entering directory '/tmp/B.48nszj6l/BUILD/wl-6.30.223.271/wl' KBUILD_NOPEDANTIC=1 make -C /usr/src/linux-4.19 M=`pwd` make[1]: Entering directory '/usr/src/linux-4.19-4.19.262' make[1]: warning: jobserver unavailable: using -j1. Add '+' to parent make rule. make[1]: Leaving directory '/usr/src/linux-4.19-4.19.262' make[1]: Entering directory '/usr/src/linux-4.19-4.19.262' CFG80211 API is prefered for this kernel version Using CFG80211 API CC [M] /tmp/B.48nszj6l/BUILD/wl-6.30.223.271/wl/src/shared/linux_osl.o CC [M] /tmp/B.48nszj6l/BUILD/wl-6.30.223.271/wl/src/wl/sys/wl_linux.o /tmp/B.48nszj6l/BUILD/wl-6.30.223.271/wl/src/wl/sys/wl_linux.c: In function 'wl_pci_probe': /tmp/B.48nszj6l/BUILD/wl-6.30.223.271/wl/src/wl/sys/wl_linux.c:787:9: warning: this 'if' clause does not guard... [-Wmisleading-indentation] 787 | if ((val & 0x0000ff00) != 0) | ^~ /tmp/B.48nszj6l/BUILD/wl-6.30.223.271/wl/src/wl/sys/wl_linux.c:789:17: note: ...this statement, but the latter is misleadingly indented as if it were guarded by the 'if' 789 | bar1_size = pci_resource_len(pdev, 2); | ^~~~~~~~~ CC [M] /tmp/B.48nszj6l/BUILD/wl-6.30.223.271/wl/src/wl/sys/wl_iw.o CC [M] /tmp/B.48nszj6l/BUILD/wl-6.30.223.271/wl/src/wl/sys/wl_cfg80211_hybrid.o /tmp/B.48nszj6l/BUILD/wl-6.30.223.271/wl/src/wl/sys/wl_cfg80211_hybrid.c: In function 'wl_bss_roaming_done': /tmp/B.48nszj6l/BUILD/wl-6.30.223.271/wl/src/wl/sys/wl_cfg80211_hybrid.c:2390:9: warning: ISO C90 forbids mixed declarations and code [-Wdeclaration-after-statement] 2390 | struct cfg80211_roam_info roam_info = { | ^~~~~~ LD [M] /tmp/B.48nszj6l/BUILD/wl-6.30.223.271/wl/wl.o Building modules, stage 2. CFG80211 API is prefered for this kernel version Using CFG80211 API MODPOST 1 modules CC /tmp/B.48nszj6l/BUILD/wl-6.30.223.271/wl/wl.mod.o LD [M] /tmp/B.48nszj6l/BUILD/wl-6.30.223.271/wl/wl.ko make[1]: Leaving directory '/usr/src/linux-4.19-4.19.262' make: Leaving directory '/tmp/B.48nszj6l/BUILD/wl-6.30.223.271/wl' make: Entering directory '/tmp/B.48nszj6l/BUILD/wl-6.30.223.271/wl' Wireless Extension is the only possible API for this kernel version Using Wireless Extension API make: Leaving directory '/tmp/B.48nszj6l/BUILD/wl-6.30.223.271/wl' make: Entering directory '/tmp/B.48nszj6l/BUILD/wl-6.30.223.271/wl' KBUILD_NOPEDANTIC=1 make -C /usr/src/linux M=`pwd` clean make[1]: Entering directory '/usr/src/linux-6.0.5' make[1]: warning: jobserver unavailable: using -j1. Add '+' to parent make rule. make[1]: Leaving directory '/usr/src/linux-6.0.5' make[1]: Entering directory '/usr/src/linux-6.0.5' CFG80211 API is prefered for this kernel version /tmp/B.48nszj6l/BUILD/wl-6.30.223.271/wl/Makefile:85: Neither CFG80211 nor Wireless Extension is enabled in kernel CLEAN /tmp/B.48nszj6l/BUILD/wl-6.30.223.271/wl/Module.symvers make[1]: Leaving directory '/usr/src/linux-6.0.5' make: Leaving directory '/tmp/B.48nszj6l/BUILD/wl-6.30.223.271/wl' make: Entering directory '/tmp/B.48nszj6l/BUILD/wl-6.30.223.271/wl' Wireless Extension is the only possible API for this kernel version Using Wireless Extension API make: Leaving directory '/tmp/B.48nszj6l/BUILD/wl-6.30.223.271/wl' make: Entering directory '/tmp/B.48nszj6l/BUILD/wl-6.30.223.271/wl' KBUILD_NOPEDANTIC=1 make -C /usr/src/linux M=`pwd` make[1]: Entering directory '/usr/src/linux-6.0.5' make[1]: warning: jobserver unavailable: using -j1. Add '+' to parent make rule. make[1]: Leaving directory '/usr/src/linux-6.0.5' make[1]: Entering directory '/usr/src/linux-6.0.5' warning: the compiler differs from the one used to build the kernel The kernel was built by: x86_64-pld-linux-gcc (PLD-Linux) 12.2.0 20220819 (release) You are using: gcc (PLD-Linux) 12.2.0 20220819 (release) CFG80211 API is prefered for this kernel version Using CFG80211 API CC [M] /tmp/B.48nszj6l/BUILD/wl-6.30.223.271/wl/src/shared/linux_osl.o CC [M] /tmp/B.48nszj6l/BUILD/wl-6.30.223.271/wl/src/wl/sys/wl_linux.o In file included from /tmp/B.48nszj6l/BUILD/wl-6.30.223.271/wl/src/wl/sys/wl_linux.c:81: /tmp/B.48nszj6l/BUILD/wl-6.30.223.271/wl/src/wl/sys/wl_iw.h:73: warning: "isprint" redefined 73 | #define isprint(c) bcm_isprint(c) | In file included from ./include/linux/string_helpers.h:6, from ./include/linux/seq_file.h:7, from ./include/linux/seq_file_net.h:5, from ./include/net/net_namespace.h:191, from ./include/linux/netdevice.h:38, from /tmp/B.48nszj6l/BUILD/wl-6.30.223.271/wl/src/include/linuxver.h:69, from /tmp/B.48nszj6l/BUILD/wl-6.30.223.271/wl/src/wl/sys/wl_linux.c:27: ./include/linux/ctype.h:30: note: this is the location of the previous definition 30 | #define isprint(c) ((__ismask(c)&(_P|_U|_L|_D|_SP)) != 0) | In file included from ./include/linux/string.h:253, from ./include/linux/bitmap.h:11, from ./include/linux/cpumask.h:12, from ./arch/x86/include/asm/cpumask.h:5, from ./arch/x86/include/asm/msr.h:11, from ./arch/x86/include/asm/processor.h:22, from ./arch/x86/include/asm/timex.h:5, from ./include/linux/timex.h:67, from ./include/linux/time32.h:13, from ./include/linux/time.h:60, from ./include/linux/stat.h:19, from ./include/linux/module.h:13, from /tmp/B.48nszj6l/BUILD/wl-6.30.223.271/wl/src/include/linuxver.h:40: /tmp/B.48nszj6l/BUILD/wl-6.30.223.271/wl/src/wl/sys/wl_linux.c: In function 'wl_attach': /tmp/B.48nszj6l/BUILD/wl-6.30.223.271/wl/src/wl/sys/wl_linux.c:641:43: warning: passing argument 1 of '__builtin_memcpy' discards 'const' qualifier from pointer target type [-Wdiscarded-qualifiers] 641 | bcopy(&wl->pub->cur_etheraddr, dev->dev_addr, ETHER_ADDR_LEN); ./include/linux/fortify-string.h:379:27: note: in definition of macro '__fortify_memcpy_chk' 379 | __underlying_##op(p, q, __fortify_size); \ | ^ /tmp/B.48nszj6l/BUILD/wl-6.30.223.271/wl/src/include/linux_osl.h:156:41: note: in expansion of macro 'memcpy' 156 | #define bcopy(src, dst, len) memcpy((dst), (src), (len)) | ^~~~~~ /tmp/B.48nszj6l/BUILD/wl-6.30.223.271/wl/src/wl/sys/wl_linux.c:641:9: note: in expansion of macro 'bcopy' 641 | bcopy(&wl->pub->cur_etheraddr, dev->dev_addr, ETHER_ADDR_LEN); | ^~~~~ /tmp/B.48nszj6l/BUILD/wl-6.30.223.271/wl/src/wl/sys/wl_linux.c:641:43: note: expected 'void *' but argument is of type 'const unsigned char *' 641 | bcopy(&wl->pub->cur_etheraddr, dev->dev_addr, ETHER_ADDR_LEN); ./include/linux/fortify-string.h:379:27: note: in definition of macro '__fortify_memcpy_chk' 379 | __underlying_##op(p, q, __fortify_size); \ | ^ /tmp/B.48nszj6l/BUILD/wl-6.30.223.271/wl/src/include/linux_osl.h:156:41: note: in expansion of macro 'memcpy' 156 | #define bcopy(src, dst, len) memcpy((dst), (src), (len)) | ^~~~~~ /tmp/B.48nszj6l/BUILD/wl-6.30.223.271/wl/src/wl/sys/wl_linux.c:641:9: note: in expansion of macro 'bcopy' 641 | bcopy(&wl->pub->cur_etheraddr, dev->dev_addr, ETHER_ADDR_LEN); | ^~~~~ /tmp/B.48nszj6l/BUILD/wl-6.30.223.271/wl/src/wl/sys/wl_linux.c: In function 'wl_pci_probe': /tmp/B.48nszj6l/BUILD/wl-6.30.223.271/wl/src/wl/sys/wl_linux.c:787:9: warning: this 'if' clause does not guard... [-Wmisleading-indentation] 787 | if ((val & 0x0000ff00) != 0) | ^~ /tmp/B.48nszj6l/BUILD/wl-6.30.223.271/wl/src/wl/sys/wl_linux.c:789:17: note: ...this statement, but the latter is misleadingly indented as if it were guarded by the 'if' 789 | bar1_size = pci_resource_len(pdev, 2); | ^~~~~~~~~ /tmp/B.48nszj6l/BUILD/wl-6.30.223.271/wl/src/wl/sys/wl_linux.c: In function 'wl_set_mac_address': /tmp/B.48nszj6l/BUILD/wl-6.30.223.271/wl/src/wl/sys/wl_linux.c:1853:31: warning: passing argument 1 of '__builtin_memcpy' discards 'const' qualifier from pointer target type [-Wdiscarded-qualifiers] 1853 | bcopy(sa->sa_data, dev->dev_addr, ETHER_ADDR_LEN); ./include/linux/fortify-string.h:379:27: note: in definition of macro '__fortify_memcpy_chk' 379 | __underlying_##op(p, q, __fortify_size); \ | ^ /tmp/B.48nszj6l/BUILD/wl-6.30.223.271/wl/src/include/linux_osl.h:156:41: note: in expansion of macro 'memcpy' 156 | #define bcopy(src, dst, len) memcpy((dst), (src), (len)) | ^~~~~~ /tmp/B.48nszj6l/BUILD/wl-6.30.223.271/wl/src/wl/sys/wl_linux.c:1853:9: note: in expansion of macro 'bcopy' 1853 | bcopy(sa->sa_data, dev->dev_addr, ETHER_ADDR_LEN); | ^~~~~ /tmp/B.48nszj6l/BUILD/wl-6.30.223.271/wl/src/wl/sys/wl_linux.c:1853:31: note: expected 'void *' but argument is of type 'const unsigned char *' 1853 | bcopy(sa->sa_data, dev->dev_addr, ETHER_ADDR_LEN); ./include/linux/fortify-string.h:379:27: note: in definition of macro '__fortify_memcpy_chk' 379 | __underlying_##op(p, q, __fortify_size); \ | ^ /tmp/B.48nszj6l/BUILD/wl-6.30.223.271/wl/src/include/linux_osl.h:156:41: note: in expansion of macro 'memcpy' 156 | #define bcopy(src, dst, len) memcpy((dst), (src), (len)) | ^~~~~~ /tmp/B.48nszj6l/BUILD/wl-6.30.223.271/wl/src/wl/sys/wl_linux.c:1853:9: note: in expansion of macro 'bcopy' 1853 | bcopy(sa->sa_data, dev->dev_addr, ETHER_ADDR_LEN); | ^~~~~ /tmp/B.48nszj6l/BUILD/wl-6.30.223.271/wl/src/wl/sys/wl_linux.c: In function '_wl_add_monitor_if': /tmp/B.48nszj6l/BUILD/wl-6.30.223.271/wl/src/wl/sys/wl_linux.c:3035:37: warning: passing argument 1 of '__builtin_memcpy' discards 'const' qualifier from pointer target type [-Wdiscarded-qualifiers] 3035 | bcopy(wl->dev->dev_addr, dev->dev_addr, ETHER_ADDR_LEN); ./include/linux/fortify-string.h:379:27: note: in definition of macro '__fortify_memcpy_chk' 379 | __underlying_##op(p, q, __fortify_size); \ | ^ /tmp/B.48nszj6l/BUILD/wl-6.30.223.271/wl/src/include/linux_osl.h:156:41: note: in expansion of macro 'memcpy' 156 | #define bcopy(src, dst, len) memcpy((dst), (src), (len)) | ^~~~~~ /tmp/B.48nszj6l/BUILD/wl-6.30.223.271/wl/src/wl/sys/wl_linux.c:3035:9: note: in expansion of macro 'bcopy' 3035 | bcopy(wl->dev->dev_addr, dev->dev_addr, ETHER_ADDR_LEN); | ^~~~~ /tmp/B.48nszj6l/BUILD/wl-6.30.223.271/wl/src/wl/sys/wl_linux.c:3035:37: note: expected 'void *' but argument is of type 'const unsigned char *' 3035 | bcopy(wl->dev->dev_addr, dev->dev_addr, ETHER_ADDR_LEN); ./include/linux/fortify-string.h:379:27: note: in definition of macro '__fortify_memcpy_chk' 379 | __underlying_##op(p, q, __fortify_size); \ | ^ /tmp/B.48nszj6l/BUILD/wl-6.30.223.271/wl/src/include/linux_osl.h:156:41: note: in expansion of macro 'memcpy' 156 | #define bcopy(src, dst, len) memcpy((dst), (src), (len)) | ^~~~~~ /tmp/B.48nszj6l/BUILD/wl-6.30.223.271/wl/src/wl/sys/wl_linux.c:3035:9: note: in expansion of macro 'bcopy' 3035 | bcopy(wl->dev->dev_addr, dev->dev_addr, ETHER_ADDR_LEN); | ^~~~~ CC [M] /tmp/B.48nszj6l/BUILD/wl-6.30.223.271/wl/src/wl/sys/wl_iw.o CC [M] /tmp/B.48nszj6l/BUILD/wl-6.30.223.271/wl/src/wl/sys/wl_cfg80211_hybrid.o /tmp/B.48nszj6l/BUILD/wl-6.30.223.271/wl/src/wl/sys/wl_cfg80211_hybrid.c: In function 'wl_bss_roaming_done': /tmp/B.48nszj6l/BUILD/wl-6.30.223.271/wl/src/wl/sys/wl_cfg80211_hybrid.c:2391:18: error: 'struct cfg80211_roam_info' has no member named 'bss' 2391 | .bss = bss, | ^~~ /tmp/B.48nszj6l/BUILD/wl-6.30.223.271/wl/src/wl/sys/wl_cfg80211_hybrid.c:2391:24: error: initialization of 'const u8 *' {aka 'const unsigned char *'} from incompatible pointer type 'struct cfg80211_bss *' [-Werror=incompatible-pointer-types] 2391 | .bss = bss, | ^~~ /tmp/B.48nszj6l/BUILD/wl-6.30.223.271/wl/src/wl/sys/wl_cfg80211_hybrid.c:2391:24: note: (near initialization for 'roam_info.req_ie') /tmp/B.48nszj6l/BUILD/wl-6.30.223.271/wl/src/wl/sys/wl_cfg80211_hybrid.c:2390:9: warning: ISO C90 forbids mixed declarations and code [-Wdeclaration-after-statement] 2390 | struct cfg80211_roam_info roam_info = { | ^~~~~~ In file included from /tmp/B.48nszj6l/BUILD/wl-6.30.223.271/wl/src/wl/sys/wl_cfg80211_hybrid.c:43: /tmp/B.48nszj6l/BUILD/wl-6.30.223.271/wl/src/wl/sys/wl_cfg80211_hybrid.c: In function 'wl_set_auth_type': /tmp/B.48nszj6l/BUILD/wl-6.30.223.271/wl/src/wl/sys/wl_cfg80211_hybrid.h:52:12: warning: this statement may fall through [-Wimplicit-fallthrough=] 52 | if (wl_dbg_level & WL_DBG_DBG) { \ | ^ /tmp/B.48nszj6l/BUILD/wl-6.30.223.271/wl/src/wl/sys/wl_cfg80211_hybrid.c:800:17: note: in expansion of macro 'WL_DBG' 800 | WL_DBG(("network eap\n")); | ^~~~~~ /tmp/B.48nszj6l/BUILD/wl-6.30.223.271/wl/src/wl/sys/wl_cfg80211_hybrid.c:801:9: note: here 801 | default: | ^~~~~~~ cc1: some warnings being treated as errors make[2]: *** [scripts/Makefile.build:249: /tmp/B.48nszj6l/BUILD/wl-6.30.223.271/wl/src/wl/sys/wl_cfg80211_hybrid.o] Error 1 make[1]: *** [Makefile:1852: /tmp/B.48nszj6l/BUILD/wl-6.30.223.271/wl] Error 2 make[1]: Leaving directory '/usr/src/linux-6.0.5' make: *** [Makefile:159: all] Error 2 make: Leaving directory '/tmp/B.48nszj6l/BUILD/wl-6.30.223.271/wl' error: Bad exit status from /tmp/B.48nszj6l/BUILD/tmp/rpm-tmp.sy8Ixg (%build) RPM build warnings: Could not canonicalize hostname: ymir RPM build errors: Bad exit status from /tmp/B.48nszj6l/BUILD/tmp/rpm-tmp.sy8Ixg (%build) ended at: Fri Oct 28 16:46:40 2022, done in 0:00:26.200951 error: No files produced. + chmod -R u+rwX /tmp/B.48nszj6l/BUILD + rm -rf /tmp/B.48nszj6l/tmp /tmp/B.48nszj6l/BUILD + rm -rf /tmp/B.48nszj6l Begin-PLD-Builder-Info Build-Time: user:30.83s sys:14.12s real:44.52s (faults io:2 non-io:1970158) End-PLD-Builder-Info
[Back to list of logs] [View rpm -qa of builder]