FailedOk

th/SRPMS[OK]
th/x32[OK]
th/i686[OK]
th/x86_64[OK]

ac/SRPMS[OK]
ac/i386[OK]
ac/i586[OK]
ac/i686[OK]
ac/alpha[OK]
ac/amd64[OK]
ac/athlon[OK]
ac/ppc[OK]
ac/sparc[OK]
ac/sparc64[OK]

Advanced Search
main()
Powered by PLD Linux
(c) 2002-2021 PLD Team
$Revision: 1.37 $
Powered by KDE.
Your IP: 35.175.107.77

x11vnc 093b2728-8cf3-40dc-92d4-bf94f9515c0c

Status:Failed
Source URL:https://buildlogs.pld-linux.org/pld/th/x86_64/FAIL/x11vnc,093b2728-8cf3-40dc-92d4-bf94f9515c0c.bz2
text/plain URL:View!
rpm -qa of builder:View!
Date:2021/09/27 03:43:14
Runtime:0:00:20.982354

Toc:

  • prep
  • Executing(%prep): /bin/sh -e /tmp/B.hlvenwku/BUILD/tmp/rpm-tmp.MWHxdf
  • build
  • Executing(%build): /bin/sh -e /tmp/B.hlvenwku/BUILD/tmp/rpm-tmp.y40W8C
  • error 1
  • collect2: error: ld returned 1 exit status
  • error 2
  • make[2]: *** [Makefile:551: x11vnc] Error 1
  • error 3
  • make[1]: *** [Makefile:503: all-recursive] Error 1
  • error 4
  • error: Bad exit status from /tmp/B.hlvenwku/BUILD/tmp/rpm-tmp.y40W8C (%build)
  • error 5
  • RPM build errors:
  • error 6
  • error: No files produced.

Content:

request from: baggins
checking if we should skip the build
started at: Mon Sep 27 03:42:51 2021
killing old processes on a builder
sending signal 9 to pid -1
cleaning up /tmp
fetching https://srcbuilder.pld-linux.org/th//srpms/093b2728-8cf3-40dc-92d4-bf94f9515c0c/x11vnc-0.9.16-1.src.rpm
fetched 1720211 bytes, 3707.6 K/s
installing srpm: x11vnc-0.9.16-1.src.rpm
+ install -d /tmp/B.hlvenwku/BUILD /tmp/B.hlvenwku/RPMS
+ LC_ALL=en_US.UTF-8
+ rpm -qp --changelog x11vnc-0.9.16-1.src.rpm
* Mon Sep 27 2021 PLD Linux Team <feedback@pld-linux.org>
- For complete changelog see: http://git.pld-linux.org/?p=packages/x11vnc.git;a=log;h=master
* Mon Nov 11 2019 Bartek Szady <bszx@bszx.eu> a0ad82b
- updated to 0.9.16 * Sat Sep 15 2018 Arkadiusz Miśkiewicz <arekm@maven.pl> 7254823
- release 2 (by relup.sh) * Fri Mar 10 2017 Jakub Bogusz <qboosh@pld-linux.org> 912b059
- updated to 0.9.14 * Sat Dec 06 2014 Jakub Bogusz <qboosh@pld-linux.org> 720c513
- updated to 0.9.13 - updated URL, noted new Source0 URL (no releases yet there) * Sat Nov 13 2010 pawelz <pawelz@pld-linux.org> 405e6d6
- release 2 * Sat Oct 02 2010 Adam Gołębiowski <adamg@pld-linux.org> ef3e21a
- updated to 0.9.12 * Tue Apr 13 2010 Marcin Banasiak <marcin.banasiak@gmail.com> a006b97
- release 3 * Thu Jan 28 2010 amateja <amateja@pld-linux.org> 2301a83
- release 2 * Mon Jan 11 2010 sparky <sparky@pld-linux.org> 5789dd2
- dropped BR: xorg-lib-libXTrap-devel * Sun Jan 03 2010 Adam Gołębiowski <adamg@pld-linux.org> 65edcce
- updated to 0.9.9 * Sun Jan 03 2010 Adam Gołębiowski <adamg@pld-linux.org> a25ea14
- adapterized * Sun Jul 12 2009 Arkadiusz Miśkiewicz <arekm@maven.pl> 1207d6c
- release 2 * Fri May 29 2009 amateja <amateja@pld-linux.org> 4928457
- updated to 0.9.8 * Wed Feb 11 2009 duddits <duddits@pld-linux.org> bef07b4
- up to 0.9.7 - more %files * Sat Dec 27 2008 Adam Gołębiowski <adamg@pld-linux.org> c5b3fa2
- updated to 0.9.6 * Tue Jan 22 2008 pascalek <pascalek@pld-linux.org> 9839081
- init scripts * Tue Jan 22 2008 pascalek <pascalek@pld-linux.org> 3483860
- initial revision * Sat Aug 25 2007 undefine <undefine@pld-linux.org> 9969b6c
- up to 0.9.3 * Mon Jun 18 2007 Robert Tomasik <rotom@pld-linux.org> 40f7453
- up to 0.9.2 * Sun Apr 22 2007 Robert Tomasik <rotom@pld-linux.org> 02486a5
- up to 0.9.1 + rpm -Uhv --nodeps --define '_topdir /tmp/B.hlvenwku' --define '_specdir %{_topdir}' --define '_sourcedir %{_specdir}' --define '_rpmdir %{_topdir}/RPMS' --define '_builddir %{_topdir}/BUILD' x11vnc-0.9.16-1.src.rpm Updating / installing... x11vnc-0.9.16-1 ######################################## + rm -f x11vnc-0.9.16-1.src.rpm + install -m 700 -d /tmp/B.hlvenwku/BUILD/tmp + TMPDIR=/tmp/B.hlvenwku/BUILD/tmp + exec nice -n 0 rpmbuild -bp --short-circuit --nodeps --define '_topdir /tmp/B.hlvenwku' --define '_specdir %{_topdir}' --define '_sourcedir %{_specdir}' --define '_rpmdir %{_topdir}/RPMS' --define '_builddir %{_topdir}/BUILD' --target x86_64-pld-linux --define 'prep exit 0' /tmp/B.hlvenwku/x11vnc.spec warning: Could not canonicalize hostname: ymir Building target platforms: x86_64-pld-linux Building for target x86_64-pld-linux checking BuildConflict-ing packages rpm: warning: Could not canonicalize hostname: ymir rpm: Building target platforms: x86_64-pld-linux rpm: Building for target x86_64-pld-linux no BuildConflicts found checking BR rpm: warning: Could not canonicalize hostname: ymir rpm: Building target platforms: x86_64-pld-linux rpm: Building for target x86_64-pld-linux no BR needed building RPM using: set -ex; : build-id: 093b2728-8cf3-40dc-92d4-bf94f9515c0c; TMPDIR=/tmp/B.hlvenwku/BUILD/tmp exec nice -n 0 rpmbuild -bb --define '_smp_mflags -j9' --define '_make_opts -Otarget' --define '_pld_builder 1' --define '_topdir /tmp/B.hlvenwku' --define '_specdir %{_topdir}' --define '_sourcedir %{_specdir}' --define '_rpmdir %{_topdir}/RPMS' --define '_builddir %{_topdir}/BUILD' --target x86_64-pld-linux /tmp/B.hlvenwku/x11vnc.spec + : build-id: 093b2728-8cf3-40dc-92d4-bf94f9515c0c + TMPDIR=/tmp/B.hlvenwku/BUILD/tmp + exec nice -n 0 rpmbuild -bb --define '_smp_mflags -j9' --define '_make_opts -Otarget' --define '_pld_builder 1' --define '_topdir /tmp/B.hlvenwku' --define '_specdir %{_topdir}' --define '_sourcedir %{_specdir}' --define '_rpmdir %{_topdir}/RPMS' --define '_builddir %{_topdir}/BUILD' --target x86_64-pld-linux /tmp/B.hlvenwku/x11vnc.spec warning: Could not canonicalize hostname: ymir Building target platforms: x86_64-pld-linux Building for target x86_64-pld-linux Executing(%prep): /bin/sh -e /tmp/B.hlvenwku/BUILD/tmp/rpm-tmp.MWHxdf + umask 022 + cd /tmp/B.hlvenwku/BUILD + cd /tmp/B.hlvenwku/BUILD + rm -rf x11vnc-0.9.16 + /bin/gzip -dc /tmp/B.hlvenwku/x11vnc-0.9.16.tar.gz + /bin/tar -xof - + STATUS=0 + '[' 0 -ne 0 ']' + cd x11vnc-0.9.16 + /bin/chmod -Rf a+rX,u+w,g-w,o-w . + RPM_EC=0 + jobs -p + exit 0 Executing(%build): /bin/sh -e /tmp/B.hlvenwku/BUILD/tmp/rpm-tmp.y40W8C TMP=/home/users/builder/tmp HOME=/home/users/builder PATH=/home/users/builder/GNUstep/Tools:/bin:/usr/bin:/usr/local/bin:/home/users/builder/bin TMPDIR=/tmp/B.hlvenwku/BUILD/tmp + umask 022 + cd /tmp/B.hlvenwku/BUILD + cd x11vnc-0.9.16 + aclocal + autoconf configure.ac:5: warning: 'AM_CONFIG_HEADER': this macro is obsolete. configure.ac:5: You should use the 'AC_CONFIG_HEADERS' macro instead. ./lib/autoconf/general.m4:2434: AC_DIAGNOSE is expanded from... aclocal.m4:1039: AM_CONFIG_HEADER is expanded from... configure.ac:5: the top level configure.ac:444: warning: The macro `AC_HEADER_STDC' is obsolete. configure.ac:444: You should run autoupdate. ./lib/autoconf/headers.m4:704: AC_HEADER_STDC is expanded from... configure.ac:444: the top level configure.ac:454: warning: The macro `AC_HEADER_TIME' is obsolete. configure.ac:454: You should run autoupdate. ./lib/autoconf/headers.m4:743: AC_HEADER_TIME is expanded from... configure.ac:454: the top level configure.ac:456: warning: The macro `AC_TRY_COMPILE' is obsolete. configure.ac:456: You should run autoupdate. ./lib/autoconf/general.m4:2847: AC_TRY_COMPILE is expanded from... lib/m4sugar/m4sh.m4:692: _AS_IF_ELSE is expanded from... lib/m4sugar/m4sh.m4:699: AS_IF is expanded from... ./lib/autoconf/general.m4:2249: AC_CACHE_VAL is expanded from... ./lib/autoconf/general.m4:2270: AC_CACHE_CHECK is expanded from... m4/ax_type_socklen_t.m4:48: AX_TYPE_SOCKLEN_T is expanded from... configure.ac:456: the top level configure.ac:457: warning: The macro `AC_TRY_COMPILE' is obsolete. configure.ac:457: You should run autoupdate. ./lib/autoconf/general.m4:2847: AC_TRY_COMPILE is expanded from... lib/m4sugar/m4sh.m4:692: _AS_IF_ELSE is expanded from... lib/m4sugar/m4sh.m4:699: AS_IF is expanded from... ./lib/autoconf/general.m4:2249: AC_CACHE_VAL is expanded from... ./lib/autoconf/general.m4:2270: AC_CACHE_CHECK is expanded from... configure.ac:457: the top level + autoheader + automake -a -c -f --foreign configure.ac:10: installing './compile' configure.ac:432: installing './config.guess' configure.ac:432: installing './config.sub' configure.ac:3: installing './install-sh' configure.ac:3: installing './missing' src/Makefile.am: installing './depcomp' + ./configure 'LDFLAGS=-Wl,--as-needed -Wl,--no-copy-dt-needed-entries -Wl,-z,relro -Wl,-z,combreloc ' 'CFLAGS=-O2 -fwrapv -pipe -Wformat -Werror=format-security -gdwarf-4 -fno-debug-types-section -fvar-tracking-assignments -g2 -Wp,-D_FORTIFY_SOURCE=2 -fstack-protector-strong --param=ssp-buffer-size=4 -Werror=trampolines -fPIC -march=x86-64 -mtune=generic -gdwarf-4 -fno-debug-types-section -fvar-tracking-assignments -g2 ' 'CXXFLAGS=-O2 -fwrapv -pipe -Wformat -Werror=format-security -gdwarf-4 -fno-debug-types-section -fvar-tracking-assignments -g2 -Wp,-D_FORTIFY_SOURCE=2 -fstack-protector-strong --param=ssp-buffer-size=4 -Werror=trampolines -fPIC -march=x86-64 -mtune=generic -gdwarf-4 -fno-debug-types-section -fvar-tracking-assignments -g2 ' 'FFLAGS=-O2 -fwrapv -pipe -Wformat -Werror=format-security -gdwarf-4 -fno-debug-types-section -fvar-tracking-assignments -g2 -Wp,-D_FORTIFY_SOURCE=2 -fstack-protector-strong --param=ssp-buffer-size=4 -Werror=trampolines -fPIC -march=x86-64 -mtune=generic -gdwarf-4 -fno-debug-types-section -fvar-tracking-assignments -g2 ' 'FCFLAGS=-O2 -fwrapv -pipe -Wformat -Werror=format-security -gdwarf-4 -fno-debug-types-section -fvar-tracking-assignments -g2 -Wp,-D_FORTIFY_SOURCE=2 -fstack-protector-strong --param=ssp-buffer-size=4 -Werror=trampolines -fPIC -march=x86-64 -mtune=generic -gdwarf-4 -fno-debug-types-section -fvar-tracking-assignments -g2 ' 'CPPFLAGS=' 'CC=x86_64-pld-linux-gcc' 'CXX=x86_64-pld-linux-g++' '--host=x86_64-pld-linux' '--build=x86_64-pld-linux' '--prefix=/usr' '--exec-prefix=/usr' '--bindir=/usr/bin' '--sbindir=/usr/sbin' '--sysconfdir=/etc' '--datadir=/usr/share' '--includedir=/usr/include' '--libdir=/usr/lib64' '--libexecdir=/usr/libexec' '--localstatedir=/var' '--sharedstatedir=/var/lib' '--mandir=/usr/share/man' '--infodir=/usr/share/info' '--x-libraries=/usr/lib64' --with-x checking for a BSD-compatible install... /usr/bin/install -c checking whether build environment is sane... yes checking for a race-free mkdir -p... /bin/mkdir -p checking for mawk... mawk checking whether make sets $(MAKE)... yes checking whether make supports nested variables... yes checking whether make supports nested variables... (cached) yes checking whether to enable maintainer-specific portions of Makefiles... yes checking for x86_64-pld-linux-gcc... x86_64-pld-linux-gcc checking whether the C compiler works... yes checking for C compiler default output file name... a.out checking for suffix of executables... checking whether we are cross compiling... no checking for suffix of object files... o checking whether the compiler supports GNU C... yes checking whether x86_64-pld-linux-gcc accepts -g... yes checking for x86_64-pld-linux-gcc option to enable C11 features... none needed checking whether x86_64-pld-linux-gcc understands -c and -o together... yes checking whether make supports the include directive... yes (GNU style) checking dependency style of x86_64-pld-linux-gcc... gcc3 checking for a sed that does not truncate output... /bin/sed checking for x86_64-pld-linux-pkg-config... no checking for pkg-config... /usr/bin/pkg-config checking pkg-config is at least version 0.9.0... yes checking for RAND_file_name in -lcrypto... yes checking for crypt... no checking for crypt in -lcrypt... yes checking for openssl >= 1.0.0... yes checking how to run the C preprocessor... x86_64-pld-linux-gcc -E checking for X... libraries /usr/lib64, headers checking whether -R must be followed by a space... no checking for gethostbyname... yes checking for connect... yes checking for remove... yes checking for shmat... yes checking for IceConnectionNumber in -lICE... yes checking for XGetImage in -lX11... yes checking for XShmGetImage in -lXext... yes checking for XReadScreen in -lXext... no checking for X11/extensions/readdisplay.h... no checking for FBPMForceLevel in -lXext... no checking for DPMSForceLevel in -lXext... yes checking for XTestGrabControl in -lXtst... yes checking for XTestFakeKeyEvent in -lXtst... yes checking for XRecordEnableContextAsync in -lXtst... yes checking for X11/XKBlib.h... yes checking for XkbSelectEvents in -lX11... yes checking for XineramaQueryScreens in -lXinerama... yes checking for XRRSelectInput in -lXrandr... yes checking for XFixesGetCursorImage in -lXfixes... yes checking for XDamageQueryExtension in -lXdamage... yes checking for XCompositeQueryExtension in -lXcomposite... yes checking for xi >= 1.2.99 inputproto >= 1.9.99.9... yes checking for XcursorImageLoadCursor in -lXcursor... yes checking for stdio.h... yes checking for stdlib.h... yes checking for string.h... yes checking for inttypes.h... yes checking for stdint.h... yes checking for strings.h... yes checking for sys/stat.h... yes checking for sys/types.h... yes checking for unistd.h... yes checking for sys/time.h... yes checking for vfork.h... no checking for linux/videodev.h... no checking for linux/fb.h... yes checking for linux/input.h... yes checking for linux/uinput.h... yes checking for OpenGL/OpenGL.h... no checking for avahi... yes checking for cairo... yes checking for libvncserver >= 0.9.8... yes checking for libvncclient >= 0.9.8... yes checking build system type... x86_64-pld-linux-gnu checking host system type... x86_64-pld-linux-gnu checking for grep that handles long lines and -e... /bin/grep checking for egrep... /bin/grep -E checking for arpa/inet.h... yes checking for endian.h... yes checking for fcntl.h... yes checking for netdb.h... yes checking for netinet/in.h... yes checking for stdlib.h... (cached) yes checking for string.h... (cached) yes checking for sys/endian.h... no checking for sys/socket.h... yes checking for sys/time.h... (cached) yes checking for sys/timeb.h... yes checking for syslog.h... yes checking for unistd.h... (cached) yes checking for ws2tcpip.h... no checking for pwd.h... yes checking for sys/wait.h... yes checking for utmpx.h... yes checking for termios.h... yes checking for sys/ioctl.h... yes checking for sys/stropts.h... no checking for an ANSI C-conforming const... yes checking for inline... inline checking whether byte ordering is bigendian... no checking for size_t... yes checking for sys/wait.h that is POSIX.1 compatible... (cached) yes checking for socklen_t... yes checking for in_addr_t... checking for working memcmp... yes checking whether lstat correctly handles trailing slash... yes checking whether stat accepts an empty string... no checking for strftime... yes checking for vprintf... yes checking for fork... yes checking for vfork... yes checking for pid_t... yes checking for working fork... yes checking for working vfork... (cached) yes checking for gethostbyname in -lnsl... yes checking for socket in -lsocket... no checking for ftime... yes checking for gethostbyname... (cached) yes checking for gethostname... yes checking for gettimeofday... yes checking for inet_ntoa... yes checking for memmove... yes checking for memset... yes checking for mmap... yes checking for mkfifo... yes checking for select... yes checking for socket... yes checking for strchr... yes checking for strcspn... yes checking for strdup... yes checking for strerror... yes checking for strstr... yes checking for setsid... yes checking for setpgrp... yes checking for getpwuid... yes checking for getpwnam... yes checking for getspnam... yes checking for getuid... yes checking for geteuid... yes checking for setuid... yes checking for setgid... yes checking for seteuid... yes checking for setegid... yes checking for initgroups... yes checking for waitpid... yes checking for setutxent... yes checking for grantpt... yes checking for shmat... (cached) yes checking for shmget in -lcygipc... no checking for ApplicationServices/ApplicationServices.h... no checking for android/api-level.h... no checking for rpm sources path... NOT-FOUND checking that generated files are newer than configure... done configure: creating ./config.status config.status: creating Makefile config.status: creating src/Makefile config.status: creating misc/Makefile config.status: creating misc/turbovnc/Makefile config.status: creating config.h config.status: executing depfiles commands + /usr/bin/make -Otarget -j9 /usr/bin/make all-recursive Making all in src make[2]: Entering directory '/tmp/B.hlvenwku/BUILD/x11vnc-0.9.16/src' CC x11vnc-help.o make[2]: Leaving directory '/tmp/B.hlvenwku/BUILD/x11vnc-0.9.16/src' make[2]: Entering directory '/tmp/B.hlvenwku/BUILD/x11vnc-0.9.16/src' CC x11vnc-avahi.o avahi.c: In function '_avahi_entry_group_callback': avahi.c:279:53: warning: passing argument 2 of '_avahi_create_services' discards 'const' qualifier from pointer target type [-Wdiscarded-qualifiers] 279 | _avahi_create_services(new_name, svc->host, svc->port); | ~~~^~~~~~ avahi.c:252:54: note: expected 'char *' but argument is of type 'const char *' 252 | static void _avahi_create_services(char *name, char *host, | ~~~~~~^~~~ make[2]: Leaving directory '/tmp/B.hlvenwku/BUILD/x11vnc-0.9.16/src' make[2]: Entering directory '/tmp/B.hlvenwku/BUILD/x11vnc-0.9.16/src' CC x11vnc-cleanup.o cleanup.c: In function 'crash_shell': cleanup.c:511:25: warning: ignoring return value of 'system' declared with attribute 'warn_unused_result' [-Wunused-result] 511 | system(cmd); | ^~~~~~~~~~~ cleanup.c:517:25: warning: ignoring return value of 'system' declared with attribute 'warn_unused_result' [-Wunused-result] 517 | system(cmd); | ^~~~~~~~~~~ make[2]: Leaving directory '/tmp/B.hlvenwku/BUILD/x11vnc-0.9.16/src' make[2]: Entering directory '/tmp/B.hlvenwku/BUILD/x11vnc-0.9.16/src' CC x11vnc-inet.o make[2]: Leaving directory '/tmp/B.hlvenwku/BUILD/x11vnc-0.9.16/src' make[2]: Entering directory '/tmp/B.hlvenwku/BUILD/x11vnc-0.9.16/src' CC x11vnc-gui.o gui.c: In function 'do_gui': gui.c:754:17: warning: ignoring return value of 'write' declared with attribute 'warn_unused_result' [-Wunused-result] 754 | write(fd, gui_code, strlen(gui_code)); | ^~~~~~~~~~~~~~~~~~~~~~~~~~~~~~~~~~~~~ gui.c:811:17: warning: ignoring return value of 'system' declared with attribute 'warn_unused_result' [-Wunused-result] 811 | system(cmd); | ^~~~~~~~~~~ gui.c:818:25: warning: ignoring return value of 'fgets' declared with attribute 'warn_unused_result' [-Wunused-result] 818 | fgets(line, 128, fp); | ^~~~~~~~~~~~~~~~~~~~ make[2]: Leaving directory '/tmp/B.hlvenwku/BUILD/x11vnc-0.9.16/src' make[2]: Entering directory '/tmp/B.hlvenwku/BUILD/x11vnc-0.9.16/src' CC x11vnc-macosxCG.o make[2]: Leaving directory '/tmp/B.hlvenwku/BUILD/x11vnc-0.9.16/src' make[2]: Entering directory '/tmp/B.hlvenwku/BUILD/x11vnc-0.9.16/src' CC x11vnc-macosxCGP.o make[2]: Leaving directory '/tmp/B.hlvenwku/BUILD/x11vnc-0.9.16/src' make[2]: Entering directory '/tmp/B.hlvenwku/BUILD/x11vnc-0.9.16/src' CC x11vnc-macosxCGS.o make[2]: Leaving directory '/tmp/B.hlvenwku/BUILD/x11vnc-0.9.16/src' make[2]: Entering directory '/tmp/B.hlvenwku/BUILD/x11vnc-0.9.16/src' CC x11vnc-linuxfb.o linuxfb.c: In function 'console_guess': linuxfb.c:156:25: warning: ignoring return value of 'read' declared with attribute 'warn_unused_result' [-Wunused-result] 156 | read(fd, tmp, 4); | ^~~~~~~~~~~~~~~~ make[2]: Leaving directory '/tmp/B.hlvenwku/BUILD/x11vnc-0.9.16/src' make[2]: Entering directory '/tmp/B.hlvenwku/BUILD/x11vnc-0.9.16/src' CC x11vnc-macosx_opengl.o make[2]: Leaving directory '/tmp/B.hlvenwku/BUILD/x11vnc-0.9.16/src' make[2]: Entering directory '/tmp/B.hlvenwku/BUILD/x11vnc-0.9.16/src' CC x11vnc-macosx.o make[2]: Leaving directory '/tmp/B.hlvenwku/BUILD/x11vnc-0.9.16/src' make[2]: Entering directory '/tmp/B.hlvenwku/BUILD/x11vnc-0.9.16/src' CC x11vnc-options.o make[2]: Leaving directory '/tmp/B.hlvenwku/BUILD/x11vnc-0.9.16/src' make[2]: Entering directory '/tmp/B.hlvenwku/BUILD/x11vnc-0.9.16/src' CC x11vnc-pm.o make[2]: Leaving directory '/tmp/B.hlvenwku/BUILD/x11vnc-0.9.16/src' make[2]: Entering directory '/tmp/B.hlvenwku/BUILD/x11vnc-0.9.16/src' CC x11vnc-cursor.o make[2]: Leaving directory '/tmp/B.hlvenwku/BUILD/x11vnc-0.9.16/src' make[2]: Entering directory '/tmp/B.hlvenwku/BUILD/x11vnc-0.9.16/src' CC x11vnc-8to24.o make[2]: Leaving directory '/tmp/B.hlvenwku/BUILD/x11vnc-0.9.16/src' make[2]: Entering directory '/tmp/B.hlvenwku/BUILD/x11vnc-0.9.16/src' CC x11vnc-rates.o make[2]: Leaving directory '/tmp/B.hlvenwku/BUILD/x11vnc-0.9.16/src' make[2]: Entering directory '/tmp/B.hlvenwku/BUILD/x11vnc-0.9.16/src' CC x11vnc-appshare.o appshare.c: In function 'stop': appshare.c:533:9: warning: ignoring return value of 'system' declared with attribute 'warn_unused_result' [-Wunused-result] 533 | system(cmd); | ^~~~~~~~~~~ appshare.c:537:9: warning: ignoring return value of 'system' declared with attribute 'warn_unused_result' [-Wunused-result] 537 | system(cmd); | ^~~~~~~~~~~ appshare.c: In function 'launch': appshare.c:497:9: warning: ignoring return value of 'system' declared with attribute 'warn_unused_result' [-Wunused-result] 497 | system(cmd); | ^~~~~~~~~~~ appshare.c: In function 'handle_shell': appshare.c:1711:41: warning: ignoring return value of 'system' declared with attribute 'warn_unused_result' [-Wunused-result] 1711 | system(str+1); | ^~~~~~~~~~~~~ appshare.c:1715:41: warning: ignoring return value of 'system' declared with attribute 'warn_unused_result' [-Wunused-result] 1715 | system(cmd); | ^~~~~~~~~~~ appshare.c: In function 'appshare_cleanup': appshare.c:639:17: warning: ignoring return value of 'system' declared with attribute 'warn_unused_result' [-Wunused-result] 639 | system(cmd); | ^~~~~~~~~~~ make[2]: Leaving directory '/tmp/B.hlvenwku/BUILD/x11vnc-0.9.16/src' make[2]: Entering directory '/tmp/B.hlvenwku/BUILD/x11vnc-0.9.16/src' CC x11vnc-pointer.o make[2]: Leaving directory '/tmp/B.hlvenwku/BUILD/x11vnc-0.9.16/src' make[2]: Entering directory '/tmp/B.hlvenwku/BUILD/x11vnc-0.9.16/src' CC x11vnc-selection.o make[2]: Leaving directory '/tmp/B.hlvenwku/BUILD/x11vnc-0.9.16/src' make[2]: Entering directory '/tmp/B.hlvenwku/BUILD/x11vnc-0.9.16/src' CC x11vnc-solid.o solid.c: In function 'solid_macosx': solid.c:1217:25: warning: ignoring return value of 'write' declared with attribute 'warn_unused_result' [-Wunused-result] 1217 | write(fd, macosx_solid_background, strlen(macosx_solid_background)); | ^~~~~~~~~~~~~~~~~~~~~~~~~~~~~~~~~~~~~~~~~~~~~~~~~~~~~~~~~~~~~~~~~~~ make[2]: Leaving directory '/tmp/B.hlvenwku/BUILD/x11vnc-0.9.16/src' make[2]: Entering directory '/tmp/B.hlvenwku/BUILD/x11vnc-0.9.16/src' CC x11vnc-sslcmds.o sslcmds.c: In function 'sslGenCA': sslcmds.c:604:9: warning: ignoring return value of 'system' declared with attribute 'warn_unused_result' [-Wunused-result] 604 | system(cmd); | ^~~~~~~~~~~ sslcmds.c: In function 'sslGenCert': sslcmds.c:640:9: warning: ignoring return value of 'system' declared with attribute 'warn_unused_result' [-Wunused-result] 640 | system(cmd); | ^~~~~~~~~~~ sslcmds.c: In function 'sslEncKey': sslcmds.c:730:17: warning: ignoring return value of 'system' declared with attribute 'warn_unused_result' [-Wunused-result] 730 | system(tca); | ^~~~~~~~~~~ sslcmds.c:744:17: warning: ignoring return value of 'write' declared with attribute 'warn_unused_result' [-Wunused-result] 744 | write(tmp_fd, genCert, strlen(genCert)); | ^~~~~~~~~~~~~~~~~~~~~~~~~~~~~~~~~~~~~~~ sslcmds.c:758:17: warning: ignoring return value of 'system' declared with attribute 'warn_unused_result' [-Wunused-result] 758 | system(scr); | ^~~~~~~~~~~ sslcmds.c:855:9: warning: ignoring return value of 'write' declared with attribute 'warn_unused_result' [-Wunused-result] 855 | write(tmp_fd, genCert, strlen(genCert)); | ^~~~~~~~~~~~~~~~~~~~~~~~~~~~~~~~~~~~~~~ sslcmds.c:871:9: warning: ignoring return value of 'system' declared with attribute 'warn_unused_result' [-Wunused-result] 871 | system(scr); | ^~~~~~~~~~~ make[2]: Leaving directory '/tmp/B.hlvenwku/BUILD/x11vnc-0.9.16/src' make[2]: Entering directory '/tmp/B.hlvenwku/BUILD/x11vnc-0.9.16/src' CC x11vnc-keyboard.o make[2]: Leaving directory '/tmp/B.hlvenwku/BUILD/x11vnc-0.9.16/src' make[2]: Entering directory '/tmp/B.hlvenwku/BUILD/x11vnc-0.9.16/src' CC x11vnc-connections.o connections.c: In function 'run_user_command': connections.c:644:25: warning: ignoring return value of 'write' declared with attribute 'warn_unused_result' [-Wunused-result] 644 | write(tmp_fd, input, len); | ^~~~~~~~~~~~~~~~~~~~~~~~~ connections.c:670:33: warning: ignoring return value of 'write' declared with attribute 'warn_unused_result' [-Wunused-result] 670 | write(fileno(output), line, k+1); | ^~~~~~~~~~~~~~~~~~~~~~~~~~~~~~~~ connections.c:691:17: warning: ignoring return value of 'write' declared with attribute 'warn_unused_result' [-Wunused-result] 691 | write(fileno(ph), input, len); | ^~~~~~~~~~~~~~~~~~~~~~~~~~~~~ connections.c: In function 'do_reverse_connect': connections.c:2720:25: warning: ignoring return value of 'write' declared with attribute 'warn_unused_result' [-Wunused-result] 2720 | write(vncsock, prestring, prestring_len); | ^~~~~~~~~~~~~~~~~~~~~~~~~~~~~~~~~~~~~~~~ connections.c:2792:33: warning: ignoring return value of 'write' declared with attribute 'warn_unused_result' [-Wunused-result] 2792 | write(sock, prestring, prestring_len); | ^~~~~~~~~~~~~~~~~~~~~~~~~~~~~~~~~~~~~ connections.c:2803:25: warning: ignoring return value of 'write' declared with attribute 'warn_unused_result' [-Wunused-result] 2803 | write(sock, prestring, prestring_len); | ^~~~~~~~~~~~~~~~~~~~~~~~~~~~~~~~~~~~~ connections.c: In function 'pconnect': connections.c:2249:9: warning: ignoring return value of 'write' declared with attribute 'warn_unused_result' [-Wunused-result] 2249 | write(psock, req, strlen(req)); | ^~~~~~~~~~~~~~~~~~~~~~~~~~~~~~ connections.c:2253:17: warning: ignoring return value of 'write' declared with attribute 'warn_unused_result' [-Wunused-result] 2253 | write(psock, t, strlen(t)); | ^~~~~~~~~~~~~~~~~~~~~~~~~~ connections.c:2266:9: warning: ignoring return value of 'write' declared with attribute 'warn_unused_result' [-Wunused-result] 2266 | write(psock, req, strlen(req)); | ^~~~~~~~~~~~~~~~~~~~~~~~~~~~~~ connections.c: In function 'socks_proxy': connections.c:2148:9: warning: ignoring return value of 'write' declared with attribute 'warn_unused_result' [-Wunused-result] 2148 | write(sock, buf, len); | ^~~~~~~~~~~~~~~~~~~~~ connections.c: In function 'socks5_proxy': connections.c:2023:9: warning: ignoring return value of 'write' declared with attribute 'warn_unused_result' [-Wunused-result] 2023 | write(sock, buf, 3); | ^~~~~~~~~~~~~~~~~~~ connections.c:2051:9: warning: ignoring return value of 'write' declared with attribute 'warn_unused_result' [-Wunused-result] 2051 | write(sock, buf, len+2); | ^~~~~~~~~~~~~~~~~~~~~~~ connections.c:2074:17: warning: ignoring return value of 'read' declared with attribute 'warn_unused_result' [-Wunused-result] 2074 | read(sock, reply+4, 4 + 2); | ^~~~~~~~~~~~~~~~~~~~~~~~~~ connections.c:2078:17: warning: ignoring return value of 'read' declared with attribute 'warn_unused_result' [-Wunused-result] 2078 | read(sock, reply+5, (int) reply[4] + 2); | ^~~~~~~~~~~~~~~~~~~~~~~~~~~~~~~~~~~~~~~ connections.c:2080:17: warning: ignoring return value of 'read' declared with attribute 'warn_unused_result' [-Wunused-result] 2080 | read(sock, reply+4, 16 + 2); | ^~~~~~~~~~~~~~~~~~~~~~~~~~~ connections.c: In function 'check_gui_inputs': connections.c:3807:33: warning: ignoring return value of 'write' declared with attribute 'warn_unused_result' [-Wunused-result] 3807 | write(fd, "\n", 1); | ^~~~~~~~~~~~~~~~~~ connections.c: In function 'start_client_info_sock': connections.c:4258:25: warning: ignoring return value of 'write' declared with attribute 'warn_unused_result' [-Wunused-result] 4258 | write(sock, "COOKIE:", strlen("COOKIE:")); | ^~~~~~~~~~~~~~~~~~~~~~~~~~~~~~~~~~~~~~~~~ connections.c:4259:25: warning: ignoring return value of 'write' declared with attribute 'warn_unused_result' [-Wunused-result] 4259 | write(sock, cookie, strlen(cookie)); | ^~~~~~~~~~~~~~~~~~~~~~~~~~~~~~~~~~~ connections.c:4260:25: warning: ignoring return value of 'write' declared with attribute 'warn_unused_result' [-Wunused-result] 4260 | write(sock, "\n", strlen("\n")); | ^~~~~~~~~~~~~~~~~~~~~~~~~~~~~~~ connections.c:4261:25: warning: ignoring return value of 'write' declared with attribute 'warn_unused_result' [-Wunused-result] 4261 | write(sock, "none\n", strlen("none\n")); | ^~~~~~~~~~~~~~~~~~~~~~~~~~~~~~~~~~~~~~~ connections.c:4262:25: warning: ignoring return value of 'write' declared with attribute 'warn_unused_result' [-Wunused-result] 4262 | write(sock, "none\n", strlen("none\n")); | ^~~~~~~~~~~~~~~~~~~~~~~~~~~~~~~~~~~~~~~ connections.c:4263:25: warning: ignoring return value of 'write' declared with attribute 'warn_unused_result' [-Wunused-result] 4263 | write(sock, lst, strlen(lst)); | ^~~~~~~~~~~~~~~~~~~~~~~~~~~~~ connections.c:4264:25: warning: ignoring return value of 'write' declared with attribute 'warn_unused_result' [-Wunused-result] 4264 | write(sock, "\n", strlen("\n")); | ^~~~~~~~~~~~~~~~~~~~~~~~~~~~~~~ connections.c: In function 'send_client_info': connections.c:4317:32: warning: ignoring return value of 'write' declared with attribute 'warn_unused_result' [-Wunused-result] 4317 | if (0) write(sock, "\n", 1); | ^~~~~~~~~~~~~~~~~~~~ make[2]: Leaving directory '/tmp/B.hlvenwku/BUILD/x11vnc-0.9.16/src' make[2]: Entering directory '/tmp/B.hlvenwku/BUILD/x11vnc-0.9.16/src' CC x11vnc-uinput.o uinput.c: In function 'initialize_uinput': uinput.c:490:9: warning: ignoring return value of 'write' declared with attribute 'warn_unused_result' [-Wunused-result] 490 | write(fd, &udev, sizeof(udev)); | ^~~~~~~~~~~~~~~~~~~~~~~~~~~~~~ uinput.c: In function 'ptr_move': uinput.c:727:9: warning: ignoring return value of 'write' declared with attribute 'warn_unused_result' [-Wunused-result] 727 | write(d, &ev, sizeof(ev)); | ^~~~~~~~~~~~~~~~~~~~~~~~~ uinput.c:732:9: warning: ignoring return value of 'write' declared with attribute 'warn_unused_result' [-Wunused-result] 732 | write(d, &ev, sizeof(ev)); | ^~~~~~~~~~~~~~~~~~~~~~~~~ uinput.c:737:9: warning: ignoring return value of 'write' declared with attribute 'warn_unused_result' [-Wunused-result] 737 | write(d, &ev, sizeof(ev)); | ^~~~~~~~~~~~~~~~~~~~~~~~~ uinput.c: In function 'button_click': uinput.c:983:9: warning: ignoring return value of 'write' declared with attribute 'warn_unused_result' [-Wunused-result] 983 | write(d, &ev, sizeof(ev)); | ^~~~~~~~~~~~~~~~~~~~~~~~~ uinput.c:988:9: warning: ignoring return value of 'write' declared with attribute 'warn_unused_result' [-Wunused-result] 988 | write(d, &ev, sizeof(ev)); | ^~~~~~~~~~~~~~~~~~~~~~~~~ uinput.c: In function 'ptr_abs': uinput.c:780:9: warning: ignoring return value of 'write' declared with attribute 'warn_unused_result' [-Wunused-result] 780 | write(d, &ev, sizeof(ev)); | ^~~~~~~~~~~~~~~~~~~~~~~~~ uinput.c:785:9: warning: ignoring return value of 'write' declared with attribute 'warn_unused_result' [-Wunused-result] 785 | write(d, &ev, sizeof(ev)); | ^~~~~~~~~~~~~~~~~~~~~~~~~ uinput.c:791:17: warning: ignoring return value of 'write' declared with attribute 'warn_unused_result' [-Wunused-result] 791 | write(d, &ev, sizeof(ev)); | ^~~~~~~~~~~~~~~~~~~~~~~~~ uinput.c:797:25: warning: ignoring return value of 'write' declared with attribute 'warn_unused_result' [-Wunused-result] 797 | write(d, &ev, sizeof(ev)); | ^~~~~~~~~~~~~~~~~~~~~~~~~ uinput.c:804:9: warning: ignoring return value of 'write' declared with attribute 'warn_unused_result' [-Wunused-result] 804 | write(d, &ev, sizeof(ev)); | ^~~~~~~~~~~~~~~~~~~~~~~~~ uinput.c: In function 'uinput_key_command': uinput.c:1261:9: warning: ignoring return value of 'write' declared with attribute 'warn_unused_result' [-Wunused-result] 1261 | write(d, &ev, sizeof(ev)); | ^~~~~~~~~~~~~~~~~~~~~~~~~ uinput.c:1266:9: warning: ignoring return value of 'write' declared with attribute 'warn_unused_result' [-Wunused-result] 1266 | write(d, &ev, sizeof(ev)); | ^~~~~~~~~~~~~~~~~~~~~~~~~ make[2]: Leaving directory '/tmp/B.hlvenwku/BUILD/x11vnc-0.9.16/src' make[2]: Entering directory '/tmp/B.hlvenwku/BUILD/x11vnc-0.9.16/src' CC x11vnc-util.o make[2]: Leaving directory '/tmp/B.hlvenwku/BUILD/x11vnc-0.9.16/src' make[2]: Entering directory '/tmp/B.hlvenwku/BUILD/x11vnc-0.9.16/src' CC x11vnc-unixpw.o unixpw.c: In function 'try_to_be_nobody': unixpw.c:648:17: warning: ignoring return value of 'setuid' declared with attribute 'warn_unused_result' [-Wunused-result] 648 | setuid(pw->pw_uid); | ^~~~~~~~~~~~~~~~~~ unixpw.c:651:17: warning: ignoring return value of 'seteuid' declared with attribute 'warn_unused_result' [-Wunused-result] 651 | seteuid(pw->pw_uid); | ^~~~~~~~~~~~~~~~~~~ unixpw.c:654:17: warning: ignoring return value of 'setgid' declared with attribute 'warn_unused_result' [-Wunused-result] 654 | setgid(pw->pw_gid); | ^~~~~~~~~~~~~~~~~~ unixpw.c:657:17: warning: ignoring return value of 'setegid' declared with attribute 'warn_unused_result' [-Wunused-result] 657 | setegid(pw->pw_gid); | ^~~~~~~~~~~~~~~~~~~ unixpw.c: In function 'su_verify': unixpw.c:1120:33: warning: ignoring return value of 'system' declared with attribute 'warn_unused_result' [-Wunused-result] 1120 | system(nam); | ^~~~~~~~~~~ unixpw.c:1122:33: warning: ignoring return value of 'write' declared with attribute 'warn_unused_result' [-Wunused-result] 1122 | write(tfd, "NOTTTY\n", 7); | ^~~~~~~~~~~~~~~~~~~~~~~~~ unixpw.c:1127:17: warning: ignoring return value of 'chdir' declared with attribute 'warn_unused_result' [-Wunused-result] 1127 | chdir("/"); | ^~~~~~~~~~ unixpw.c:1157:17: warning: ignoring return value of 'write' declared with attribute 'warn_unused_result' [-Wunused-result] 1157 | write(2, "C", 1); | ^~~~~~~~~~~~~~~~ unixpw.c:1252:33: warning: ignoring return value of 'system' declared with attribute 'warn_unused_result' [-Wunused-result] 1252 | system(cmd0); | ^~~~~~~~~~~~ unixpw.c:1254:33: warning: ignoring return value of 'system' declared with attribute 'warn_unused_result' [-Wunused-result] 1254 | system(cmd0); | ^~~~~~~~~~~~ unixpw.c:1339:25: warning: ignoring return value of 'write' declared with attribute 'warn_unused_result' [-Wunused-result] 1339 | write(fd, pass+k, 1); | ^~~~~~~~~~~~~~~~~~~~ unixpw.c:1343:17: warning: ignoring return value of 'write' declared with attribute 'warn_unused_result' [-Wunused-result] 1343 | write(fd, pass, strlen(pass)); | ^~~~~~~~~~~~~~~~~~~~~~~~~~~~~ unixpw.c: In function 'check_unixpw_userprefs': unixpw.c:1541:33: warning: ignoring return value of 'fgets' declared with attribute 'warn_unused_result' [-Wunused-result] 1541 | fgets(buf, 1024, f); | ^~~~~~~~~~~~~~~~~~~ make[2]: Leaving directory '/tmp/B.hlvenwku/BUILD/x11vnc-0.9.16/src' make[2]: Entering directory '/tmp/B.hlvenwku/BUILD/x11vnc-0.9.16/src' CC x11vnc-v4l.o make[2]: Leaving directory '/tmp/B.hlvenwku/BUILD/x11vnc-0.9.16/src' make[2]: Entering directory '/tmp/B.hlvenwku/BUILD/x11vnc-0.9.16/src' CC x11vnc-scan.o scan.c: In function 'get_load': scan.c:2940:33: warning: ignoring return value of 'read' declared with attribute 'warn_unused_result' [-Wunused-result] 2940 | read(d, tmp, 60); | ^~~~~~~~~~~~~~~~ make[2]: Leaving directory '/tmp/B.hlvenwku/BUILD/x11vnc-0.9.16/src' make[2]: Entering directory '/tmp/B.hlvenwku/BUILD/x11vnc-0.9.16/src' CC x11vnc-x11vnc_defs.o make[2]: Leaving directory '/tmp/B.hlvenwku/BUILD/x11vnc-0.9.16/src' make[2]: Entering directory '/tmp/B.hlvenwku/BUILD/x11vnc-0.9.16/src' CC x11vnc-win_utils.o make[2]: Leaving directory '/tmp/B.hlvenwku/BUILD/x11vnc-0.9.16/src' make[2]: Entering directory '/tmp/B.hlvenwku/BUILD/x11vnc-0.9.16/src' CC x11vnc-screen.o screen.c: In function 'vnc_reflect_get_password': screen.c:1434:17: warning: ignoring return value of 'fgets' declared with attribute 'warn_unused_result' [-Wunused-result] 1434 | fgets(p, 100, stdin); | ^~~~~~~~~~~~~~~~~~~~ screen.c:1439:33: warning: ignoring return value of 'fgets' declared with attribute 'warn_unused_result' [-Wunused-result] 1439 | fgets(p, 100, f); | ^~~~~~~~~~~~~~~~ screen.c: In function 'initialize_raw_fb': screen.c:1773:25: warning: ignoring return value of 'write' declared with attribute 'warn_unused_result' [-Wunused-result] 1773 | write(fd, (char *)vals, 4 * w); | ^~~~~~~~~~~~~~~~~~~~~~~~~~~~~~ screen.c:1795:25: warning: ignoring return value of 'write' declared with attribute 'warn_unused_result' [-Wunused-result] 1795 | write(fd, (char *)val, 4 * w); | ^~~~~~~~~~~~~~~~~~~~~~~~~~~~~ make[2]: Leaving directory '/tmp/B.hlvenwku/BUILD/x11vnc-0.9.16/src' make[2]: Entering directory '/tmp/B.hlvenwku/BUILD/x11vnc-0.9.16/src' CC x11vnc-xdamage.o make[2]: Leaving directory '/tmp/B.hlvenwku/BUILD/x11vnc-0.9.16/src' make[2]: Entering directory '/tmp/B.hlvenwku/BUILD/x11vnc-0.9.16/src' CC x11vnc-xinerama.o make[2]: Leaving directory '/tmp/B.hlvenwku/BUILD/x11vnc-0.9.16/src' make[2]: Entering directory '/tmp/B.hlvenwku/BUILD/x11vnc-0.9.16/src' CC x11vnc-xi2_devices.o make[2]: Leaving directory '/tmp/B.hlvenwku/BUILD/x11vnc-0.9.16/src' make[2]: Entering directory '/tmp/B.hlvenwku/BUILD/x11vnc-0.9.16/src' CC x11vnc-user.o user.c: In function 'setup_cmd': user.c:1905:25: warning: ignoring return value of 'write' declared with attribute 'warn_unused_result' [-Wunused-result] 1905 | write(fd, find_display, strlen(find_display)); | ^~~~~~~~~~~~~~~~~~~~~~~~~~~~~~~~~~~~~~~~~~~~~ user.c:1914:49: warning: ignoring return value of 'system' declared with attribute 'warn_unused_result' [-Wunused-result] 1914 | system(com); | ^~~~~~~~~~~ user.c: In function 'vnc_redirect_timeout': user.c:1396:9: warning: ignoring return value of 'write' declared with attribute 'warn_unused_result' [-Wunused-result] 1396 | write(2, "timeout: no clients connected.\n", 31); | ^~~~~~~~~~~~~~~~~~~~~~~~~~~~~~~~~~~~~~~~~~~~~~~~ user.c: In function 'do_run_cmd': user.c:2511:25: warning: ignoring return value of 'write' declared with attribute 'warn_unused_result' [-Wunused-result] 2511 | write(tmp_fd, s, strlen(s)); | ^~~~~~~~~~~~~~~~~~~~~~~~~~~ user.c:2513:25: warning: ignoring return value of 'write' declared with attribute 'warn_unused_result' [-Wunused-result] 2513 | write(tmp_fd, find_display, strlen(find_display)); | ^~~~~~~~~~~~~~~~~~~~~~~~~~~~~~~~~~~~~~~~~~~~~~~~~ user.c:2576:37: warning: ignoring return value of 'write' declared with attribute 'warn_unused_result' [-Wunused-result] 2576 | if (db) {fprintf(stderr, "line: "); write(2, line, n); write(2, "\n", 1); fprintf(stderr, "res=%d n=%d\n", res, n);} | ^~~~~~~~~~~~~~~~~ user.c:2576:56: warning: ignoring return value of 'write' declared with attribute 'warn_unused_result' [-Wunused-result] 2576 | if (db) {fprintf(stderr, "line: "); write(2, line, n); write(2, "\n", 1); fprintf(stderr, "res=%d n=%d\n", res, n);} | ^~~~~~~~~~~~~~~~~ user.c:2681:9: warning: ignoring return value of 'write' declared with attribute 'warn_unused_result' [-Wunused-result] 2681 | if (db) write(2, line, 100); | ^~~~~~~~~~~~~~~~~~~ user.c:2857:1: warning: ignoring return value of 'write' declared with attribute 'warn_unused_result' [-Wunused-result] 2857 | write(2, xauth_raw_data, n); | ^~~~~~~~~~~~~~~~~~~~~~~~~~~ user.c: In function 'do_chvt': user.c:1405:9: warning: ignoring return value of 'system' declared with attribute 'warn_unused_result' [-Wunused-result] 1405 | system(chvt); | ^~~~~~~~~~~~ user.c: In function 'do_vnc_redirect': user.c:1876:17: warning: ignoring return value of 'write' declared with attribute 'warn_unused_result' [-Wunused-result] 1876 | write(vnc_redirect_sock, vnc_redirect_test, vnc_redirect_cnt); | ^~~~~~~~~~~~~~~~~~~~~~~~~~~~~~~~~~~~~~~~~~~~~~~~~~~~~~~~~~~~~ user.c: In function 'lurk_loop': user.c:502:51: warning: '%d' directive writing between 1 and 10 bytes into a region of size 9 [-Wformat-overflow=] 502 | sprintf(dpystr, ":%d", dn); | ^~ user.c:502:49: note: directive argument in the range [0, 2147483647] 502 | sprintf(dpystr, ":%d", dn); | ^~~~~ In file included from /usr/include/stdio.h:888, from /usr/include/rfb/rfb.h:41, from x11vnc.h:69, from user.c:35: /usr/include/bits/stdio2.h:38:10: note: '__builtin___sprintf_chk' output between 3 and 12 bytes into a destination of size 10 38 | return __builtin___sprintf_chk (__s, __USE_FORTIFY_LEVEL - 1, | ^~~~~~~~~~~~~~~~~~~~~~~~~~~~~~~~~~~~~~~~~~~~~~~~~~~~~~ 39 | __glibc_objsize (__s), __fmt, | ~~~~~~~~~~~~~~~~~~~~~~~~~~~~~ 40 | __va_arg_pack ()); | ~~~~~~~~~~~~~~~~~ make[2]: Leaving directory '/tmp/B.hlvenwku/BUILD/x11vnc-0.9.16/src' make[2]: Entering directory '/tmp/B.hlvenwku/BUILD/x11vnc-0.9.16/src' CC x11vnc-xkb_bell.o make[2]: Leaving directory '/tmp/B.hlvenwku/BUILD/x11vnc-0.9.16/src' make[2]: Entering directory '/tmp/B.hlvenwku/BUILD/x11vnc-0.9.16/src' CC x11vnc-xrandr.o make[2]: Leaving directory '/tmp/B.hlvenwku/BUILD/x11vnc-0.9.16/src' make[2]: Entering directory '/tmp/B.hlvenwku/BUILD/x11vnc-0.9.16/src' CC x11vnc-xevents.o make[2]: Leaving directory '/tmp/B.hlvenwku/BUILD/x11vnc-0.9.16/src' make[2]: Entering directory '/tmp/B.hlvenwku/BUILD/x11vnc-0.9.16/src' CC x11vnc-xwrappers.o xwrappers.c: In function 'xauth_raw': xwrappers.c:1428:25: warning: ignoring return value of 'write' declared with attribute 'warn_unused_result' [-Wunused-result] 1428 | write(tmp_fd, xauth_raw_data, xauth_raw_len); | ^~~~~~~~~~~~~~~~~~~~~~~~~~~~~~~~~~~~~~~~~~~~ make[2]: Leaving directory '/tmp/B.hlvenwku/BUILD/x11vnc-0.9.16/src' make[2]: Entering directory '/tmp/B.hlvenwku/BUILD/x11vnc-0.9.16/src' CC x11vnc-xrecord.o make[2]: Leaving directory '/tmp/B.hlvenwku/BUILD/x11vnc-0.9.16/src' make[2]: Entering directory '/tmp/B.hlvenwku/BUILD/x11vnc-0.9.16/src' CC x11vnc-sslhelper.o sslhelper.c: In function 'crl_callback': sslhelper.c:849:17: warning: 'X509_CRL_get_lastUpdate' is deprecated: Since OpenSSL 1.1.0 [-Wdeprecated-declarations] 849 | ASN1_UTCTIME_print(bio, X509_CRL_get_lastUpdate(crl)); | ^~~~~~~~~~~~~~~~~~ In file included from /usr/include/openssl/ssl.h:31, from sslhelper.c:730: /usr/include/openssl/x509.h:932:36: note: declared here 932 | OSSL_DEPRECATEDIN_1_1_0 ASN1_TIME *X509_CRL_get_lastUpdate(X509_CRL *crl); | ^~~~~~~~~~~~~~~~~~~~~~~ sslhelper.c:851:17: warning: 'X509_CRL_get_nextUpdate' is deprecated: Since OpenSSL 1.1.0 [-Wdeprecated-declarations] 851 | ASN1_UTCTIME_print(bio, X509_CRL_get_nextUpdate(crl)); | ^~~~~~~~~~~~~~~~~~ In file included from /usr/include/openssl/ssl.h:31, from sslhelper.c:730: /usr/include/openssl/x509.h:933:36: note: declared here 933 | OSSL_DEPRECATEDIN_1_1_0 ASN1_TIME *X509_CRL_get_nextUpdate(X509_CRL *crl); | ^~~~~~~~~~~~~~~~~~~~~~~ sslhelper.c:881:17: warning: 'X509_CRL_get_nextUpdate' is deprecated: Since OpenSSL 1.1.0 [-Wdeprecated-declarations] 881 | t=X509_CRL_get_nextUpdate(crl); | ^ In file included from /usr/include/openssl/ssl.h:31, from sslhelper.c:730: /usr/include/openssl/x509.h:933:36: note: declared here 933 | OSSL_DEPRECATEDIN_1_1_0 ASN1_TIME *X509_CRL_get_nextUpdate(X509_CRL *crl); | ^~~~~~~~~~~~~~~~~~~~~~~ sslhelper.c: In function 'openssl_init': sslhelper.c:1067:9: warning: 'RSA_generate_key' is deprecated: Since OpenSSL 0.9.8 [-Wdeprecated-declarations] 1067 | rsa_512 = RSA_generate_key(512, RSA_F4, NULL, NULL); | ^~~~~~~ In file included from /usr/include/openssl/x509.h:36, from /usr/include/openssl/ssl.h:31, from sslhelper.c:730: /usr/include/openssl/rsa.h:253:30: note: declared here 253 | OSSL_DEPRECATEDIN_0_9_8 RSA *RSA_generate_key(int bits, unsigned long e, void | ^~~~~~~~~~~~~~~~ sslhelper.c:1076:9: warning: 'RSA_generate_key' is deprecated: Since OpenSSL 0.9.8 [-Wdeprecated-declarations] 1076 | rsa_1024 = RSA_generate_key(1024, RSA_F4, NULL, NULL); | ^~~~~~~~ In file included from /usr/include/openssl/x509.h:36, from /usr/include/openssl/ssl.h:31, from sslhelper.c:730: /usr/include/openssl/rsa.h:253:30: note: declared here 253 | OSSL_DEPRECATEDIN_0_9_8 RSA *RSA_generate_key(int bits, unsigned long e, void | ^~~~~~~~~~~~~~~~ sslhelper.c:1161:17: warning: 'PEM_read_bio_DHparams' is deprecated: Since OpenSSL 3.0 [-Wdeprecated-declarations] 1161 | dh = PEM_read_bio_DHparams(bio, NULL, NULL, NULL); | ^~ In file included from /usr/include/openssl/ssl.h:36, from sslhelper.c:730: /usr/include/openssl/pem.h:469:1: note: declared here 469 | DECLARE_PEM_rw_attr(OSSL_DEPRECATEDIN_3_0, DHparams, DH) | ^~~~~~~~~~~~~~~~~~~ sslhelper.c:1170:21: warning: 'DH_size' is deprecated: Since OpenSSL 3.0 [-Wdeprecated-declarations] 1170 | 8*DH_size(dh), dnow()-ds); | ^ In file included from /usr/include/openssl/dsa.h:51, from /usr/include/openssl/x509.h:37, from /usr/include/openssl/ssl.h:31, from sslhelper.c:730: /usr/include/openssl/dh.h:203:27: note: declared here 203 | OSSL_DEPRECATEDIN_3_0 int DH_size(const DH *dh); | ^~~~~~~ sslhelper.c:1171:17: warning: 'DH_free' is deprecated: Since OpenSSL 3.0 [-Wdeprecated-declarations] 1171 | DH_free(dh); | ^~~~~~~ In file included from /usr/include/openssl/dsa.h:51, from /usr/include/openssl/x509.h:37, from /usr/include/openssl/ssl.h:31, from sslhelper.c:730: /usr/include/openssl/dh.h:200:28: note: declared here 200 | OSSL_DEPRECATEDIN_3_0 void DH_free(DH *dh); | ^~~~~~~ sslhelper.c:1179:17: warning: 'SSL_CTX_use_RSAPrivateKey_file' is deprecated: Since OpenSSL 3.0 [-Wdeprecated-declarations] 1179 | if (! SSL_CTX_use_RSAPrivateKey_file(ctx, openssl_pem, | ^~ In file included from sslhelper.c:730: /usr/include/openssl/ssl.h:1685:12: note: declared here 1685 | __owur int SSL_CTX_use_RSAPrivateKey_file(SSL_CTX *ctx, const char *file, | ^~~~~~~~~~~~~~~~~~~~~~~~~~~~~~ sslhelper.c: In function 'add_anon_dh': sslhelper.c:1564:9: warning: 'PEM_read_bio_DHparams' is deprecated: Since OpenSSL 3.0 [-Wdeprecated-declarations] 1564 | dh = PEM_read_bio_DHparams(bio, NULL, NULL, NULL); | ^~ In file included from /usr/include/openssl/ssl.h:36, from sslhelper.c:730: /usr/include/openssl/pem.h:469:1: note: declared here 469 | DECLARE_PEM_rw_attr(OSSL_DEPRECATEDIN_3_0, DHparams, DH) | ^~~~~~~~~~~~~~~~~~~ sslhelper.c:1573:9: warning: 'DH_size' is deprecated: Since OpenSSL 3.0 [-Wdeprecated-declarations] 1573 | rfbLog("loaded Diffie Hellman %d bits, %.3fs\n", 8*DH_size(dh), dnow()-ds); | ^~~~~~ In file included from /usr/include/openssl/dsa.h:51, from /usr/include/openssl/x509.h:37, from /usr/include/openssl/ssl.h:31, from sslhelper.c:730: /usr/include/openssl/dh.h:203:27: note: declared here 203 | OSSL_DEPRECATEDIN_3_0 int DH_size(const DH *dh); | ^~~~~~~ sslhelper.c:1574:9: warning: 'DH_free' is deprecated: Since OpenSSL 3.0 [-Wdeprecated-declarations] 1574 | DH_free(dh); | ^~~~~~~ In file included from /usr/include/openssl/dsa.h:51, from /usr/include/openssl/x509.h:37, from /usr/include/openssl/ssl.h:31, from sslhelper.c:730: /usr/include/openssl/dh.h:200:28: note: declared here 200 | OSSL_DEPRECATEDIN_3_0 void DH_free(DH *dh); | ^~~~~~~ sslhelper.c: In function 'pr_ssl_info': sslhelper.c:1966:11: warning: assignment discards 'const' qualifier from pointer target type [-Wdiscarded-qualifiers] 1966 | c = SSL_get_current_cipher(ssl); | ^ In file included from sslhelper.c:4385: enc.h: In function 'load_client_auth': enc.h:1233:9: warning: 'd2i_RSAPrivateKey' is deprecated: Since OpenSSL 3.0 [-Wdeprecated-declarations] 1233 | rsa = d2i_RSAPrivateKey(NULL, (const unsigned char **) ((void *) &contents), sb.st_size); | ^~~ In file included from /usr/include/openssl/objects.h:21, from /usr/include/openssl/evp.h:43, from /usr/include/openssl/x509.h:29, from /usr/include/openssl/ssl.h:31, from sslhelper.c:730: /usr/include/openssl/rsa.h:309:1: note: declared here 309 | DECLARE_ASN1_ENCODE_FUNCTIONS_name_attr(OSSL_DEPRECATEDIN_3_0, | ^~~~~~~~~~~~~~~~~~~~~~~~~~~~~~~~~~~~~~~ In file included from sslhelper.c:4385: enc.h:1239:9: warning: 'RSA_check_key' is deprecated: Since OpenSSL 3.0 [-Wdeprecated-declarations] 1239 | if (RSA_check_key(rsa) != 1) { | ^~ In file included from /usr/include/openssl/x509.h:36, from /usr/include/openssl/ssl.h:31, from sslhelper.c:730: /usr/include/openssl/rsa.h:278:27: note: declared here 278 | OSSL_DEPRECATEDIN_3_0 int RSA_check_key(const RSA *); | ^~~~~~~~~~~~~ In file included from sslhelper.c:4385: enc.h: In function 'securevnc_setup': enc.h:1385:9: warning: 'd2i_RSAPublicKey' is deprecated: Since OpenSSL 3.0 [-Wdeprecated-declarations] 1385 | rsa = d2i_RSAPublicKey(NULL, (const unsigned char **) &rsabuf, SECUREVNC_RSA_PUBKEY_SIZE); | ^~~ In file included from /usr/include/openssl/objects.h:21, from /usr/include/openssl/evp.h:43, from /usr/include/openssl/x509.h:29, from /usr/include/openssl/ssl.h:31, from sslhelper.c:730: /usr/include/openssl/rsa.h:307:1: note: declared here 307 | DECLARE_ASN1_ENCODE_FUNCTIONS_name_attr(OSSL_DEPRECATEDIN_3_0, | ^~~~~~~~~~~~~~~~~~~~~~~~~~~~~~~~~~~~~~~ In file included from sslhelper.c:4385: enc.h:1439:9: warning: 'RSA_size' is deprecated: Since OpenSSL 3.0 [-Wdeprecated-declarations] 1439 | encrypted_keybuf = (unsigned char*) calloc(RSA_size(rsa), 1); | ^~~~~~~~~~~~~~~~ In file included from /usr/include/openssl/x509.h:36, from /usr/include/openssl/ssl.h:31, from sslhelper.c:730: /usr/include/openssl/rsa.h:204:27: note: declared here 204 | OSSL_DEPRECATEDIN_3_0 int RSA_size(const RSA *rsa); | ^~~~~~~~ In file included from sslhelper.c:4385: enc.h:1448:17: warning: 'RAND_pseudo_bytes' is deprecated: Since OpenSSL 1.1.0 [-Wdeprecated-declarations] 1448 | rc = RAND_pseudo_bytes((unsigned char *)keydata, SECUREVNC_RAND_KEY_SOURCE); | ^~ In file included from sslhelper.c:732: /usr/include/openssl/rand.h:79:29: note: declared here 79 | OSSL_DEPRECATEDIN_1_1_0 int RAND_pseudo_bytes(unsigned char *buf, int num); | ^~~~~~~~~~~~~~~~~ In file included from sslhelper.c:4385: enc.h:1452:85: warning: format '%d' expects argument of type 'int', but argument 3 has type 'size_t' {aka 'long unsigned int'} [-Wformat=] 1452 | fprintf(stderr, "securevnc_setup: seeding with RANDSTR len=%d\n", strlen(s)); | ~^ ~~~~~~~~~ | | | | int size_t {aka long unsigned int} | %ld enc.h:1461:9: warning: 'RSA_public_encrypt' is deprecated: Since OpenSSL 3.0 [-Wdeprecated-declarations] 1461 | n = RSA_public_encrypt(SECUREVNC_KEY_SIZE, keystr, encrypted_keybuf, rsa, RSA_PKCS1_PADDING); | ^ In file included from /usr/include/openssl/x509.h:36, from /usr/include/openssl/ssl.h:31, from sslhelper.c:730: /usr/include/openssl/rsa.h:282:5: note: declared here 282 | int RSA_public_encrypt(int flen, const unsigned char *from, unsigned char *to, | ^~~~~~~~~~~~~~~~~~ In file included from sslhelper.c:4385: enc.h:1499:25: warning: 'RSA_generate_key' is deprecated: Since OpenSSL 0.9.8 [-Wdeprecated-declarations] 1499 | client_rsa = RSA_generate_key(2048, 0x10001, NULL, NULL); | ^~~~~~~~~~ In file included from /usr/include/openssl/x509.h:36, from /usr/include/openssl/ssl.h:31, from sslhelper.c:730: /usr/include/openssl/rsa.h:253:30: note: declared here 253 | OSSL_DEPRECATEDIN_0_9_8 RSA *RSA_generate_key(int bits, unsigned long e, void | ^~~~~~~~~~~~~~~~ In file included from sslhelper.c:4385: enc.h:1554:17: warning: 'RSA_size' is deprecated: Since OpenSSL 3.0 [-Wdeprecated-declarations] 1554 | signature = (unsigned char *) calloc(RSA_size(client_rsa), 1); | ^~~~~~~~~ In file included from /usr/include/openssl/x509.h:36, from /usr/include/openssl/ssl.h:31, from sslhelper.c:730: /usr/include/openssl/rsa.h:204:27: note: declared here 204 | OSSL_DEPRECATEDIN_3_0 int RSA_size(const RSA *rsa); | ^~~~~~~~ In file included from sslhelper.c:4385: enc.h:1555:17: warning: 'RSA_sign' is deprecated: Since OpenSSL 3.0 [-Wdeprecated-declarations] 1555 | RSA_sign(NID_sha1, digest, ndig, signature, &nsig, client_rsa); | ^~~~~~~~ In file included from /usr/include/openssl/x509.h:36, from /usr/include/openssl/ssl.h:31, from sslhelper.c:730: /usr/include/openssl/rsa.h:348:27: note: declared here 348 | OSSL_DEPRECATEDIN_3_0 int RSA_sign(int type, const unsigned char *m, | ^~~~~~~~ In file included from sslhelper.c:4385: enc.h:1561:17: warning: 'RSA_free' is deprecated: Since OpenSSL 3.0 [-Wdeprecated-declarations] 1561 | RSA_free(client_rsa); | ^~~~~~~~ In file included from /usr/include/openssl/x509.h:36, from /usr/include/openssl/ssl.h:31, from sslhelper.c:730: /usr/include/openssl/rsa.h:293:28: note: declared here 293 | OSSL_DEPRECATEDIN_3_0 void RSA_free(RSA *r); | ^~~~~~~~ sslhelper.c: In function 'create_tmp_pem': sslhelper.c:346:9: warning: ignoring return value of 'write' declared with attribute 'warn_unused_result' [-Wunused-result] 346 | write(cnf_fd, str, strlen(str)); | ^~~~~~~~~~~~~~~~~~~~~~~~~~~~~~~ sslhelper.c:505:25: warning: ignoring return value of 'system' declared with attribute 'warn_unused_result' [-Wunused-result] 505 | system(cmd); | ^~~~~~~~~~~ sslhelper.c: In function 'pem_passwd_callback': sslhelper.c:780:9: warning: ignoring return value of 'system' declared with attribute 'warn_unused_result' [-Wunused-result] 780 | system("stty -echo"); | ^~~~~~~~~~~~~~~~~~~~ sslhelper.c:783:17: warning: ignoring return value of 'system' declared with attribute 'warn_unused_result' [-Wunused-result] 783 | system("stty echo"); | ^~~~~~~~~~~~~~~~~~~ sslhelper.c:786:9: warning: ignoring return value of 'system' declared with attribute 'warn_unused_result' [-Wunused-result] 786 | system("stty echo"); | ^~~~~~~~~~~~~~~~~~~ sslhelper.c: In function 'add_anon_dh': sslhelper.c:1482:25: warning: ignoring return value of 'write' declared with attribute 'warn_unused_result' [-Wunused-result] 1482 | write(cnf_fd, new_dh_params, strlen(new_dh_params)); | ^~~~~~~~~~~~~~~~~~~~~~~~~~~~~~~~~~~~~~~~~~~~~~~~~~~ sslhelper.c:1536:57: warning: ignoring return value of 'write' declared with attribute 'warn_unused_result' [-Wunused-result] 1536 | write(d, new_dh_params, strlen(new_dh_params)); | ^~~~~~~~~~~~~~~~~~~~~~~~~~~~~~~~~~~~~~~~~~~~~~ sslhelper.c:1544:17: warning: ignoring return value of 'write' declared with attribute 'warn_unused_result' [-Wunused-result] 1544 | write(cnf_fd, fixed_dh_params, strlen(fixed_dh_params)); | ^~~~~~~~~~~~~~~~~~~~~~~~~~~~~~~~~~~~~~~~~~~~~~~~~~~~~~~ sslhelper.c: In function 'accept_openssl': sslhelper.c:3624:25: warning: ignoring return value of 'write' declared with attribute 'warn_unused_result' [-Wunused-result] 3624 | write(vncsock, tbuf, strlen(cookie)); | ^~~~~~~~~~~~~~~~~~~~~~~~~~~~~~~~~~~~ sslhelper.c:3630:25: warning: ignoring return value of 'write' declared with attribute 'warn_unused_result' [-Wunused-result] 3630 | write(vncsock, tbuf, strlen(cookie)); | ^~~~~~~~~~~~~~~~~~~~~~~~~~~~~~~~~~~~ sslhelper.c:3704:33: warning: ignoring return value of 'write' declared with attribute 'warn_unused_result' [-Wunused-result] 3704 | write(vncsock, cookie, strlen(cookie)); | ^~~~~~~~~~~~~~~~~~~~~~~~~~~~~~~~~~~~~~ sslhelper.c:3706:41: warning: ignoring return value of 'write' declared with attribute 'warn_unused_result' [-Wunused-result] 3706 | write(vncsock, buf, n); | ^~~~~~~~~~~~~~~~~~~~~~ sslhelper.c:3778:33: warning: ignoring return value of 'write' declared with attribute 'warn_unused_result' [-Wunused-result] 3778 | write(vncsock, tbuf, strlen(tbuf)); | ^~~~~~~~~~~~~~~~~~~~~~~~~~~~~~~~~~ sslhelper.c:3852:25: warning: ignoring return value of 'write' declared with attribute 'warn_unused_result' [-Wunused-result] 3852 | write(vncsock, tbuf, strlen(tbuf)); | ^~~~~~~~~~~~~~~~~~~~~~~~~~~~~~~~~~ sslhelper.c:3899:49: warning: ignoring return value of 'write' declared with attribute 'warn_unused_result' [-Wunused-result] 3899 | write(httpsock, buf, m); | ^~~~~~~~~~~~~~~~~~~~~~~ sslhelper.c:3900:49: warning: ignoring return value of 'write' declared with attribute 'warn_unused_result' [-Wunused-result] 3900 | write(httpsock, s, strlen(s)); | ^~~~~~~~~~~~~~~~~~~~~~~~~~~~~ sslhelper.c:3902:49: warning: ignoring return value of 'write' declared with attribute 'warn_unused_result' [-Wunused-result] 3902 | write(httpsock, q, n-m); | ^~~~~~~~~~~~~~~~~~~~~~~ sslhelper.c:3907:41: warning: ignoring return value of 'write' declared with attribute 'warn_unused_result' [-Wunused-result] 3907 | write(httpsock, buf, n); | ^~~~~~~~~~~~~~~~~~~~~~~ sslhelper.c:3922:17: warning: ignoring return value of 'write' declared with attribute 'warn_unused_result' [-Wunused-result] 3922 | write(vncsock, cookie, strlen(cookie)); | ^~~~~~~~~~~~~~~~~~~~~~~~~~~~~~~~~~~~~~ sslhelper.c:3986:25: warning: ignoring return value of 'read' declared with attribute 'warn_unused_result' [-Wunused-result] 3986 | read(certret_fd, certret_str, sbuf.st_size); | ^~~~~~~~~~~~~~~~~~~~~~~~~~~~~~~~~~~~~~~~~~~ sslhelper.c:4009:25: warning: ignoring return value of 'read' declared with attribute 'warn_unused_result' [-Wunused-result] 4009 | read(dhret_fd, dhret_str, sbuf.st_size); | ^~~~~~~~~~~~~~~~~~~~~~~~~~~~~~~~~~~~~~~ sslhelper.c: In function 'watch_for_http_traffic': sslhelper.c:3257:17: warning: ignoring return value of 'write' declared with attribute 'warn_unused_result' [-Wunused-result] 3257 | write(2, buf_a, *n_a); | ^~~~~~~~~~~~~~~~~~~~~ sslhelper.c: In function 'ssl_xfer': sslhelper.c:2319:17: warning: ignoring return value of 'read' declared with attribute 'warn_unused_result' [-Wunused-result] 2319 | read(csock, tmp, 12); | ^~~~~~~~~~~~~~~~~~~~ sslhelper.c: In function 'raw_xfer': sslhelper.c:4312:45: warning: ignoring return value of 'write' declared with attribute 'warn_unused_result' [-Wunused-result] 4312 | if (db > 1) write(2, buf, n); | ^~~~~~~~~~~~~~~~ sslhelper.c:4344:45: warning: ignoring return value of 'write' declared with attribute 'warn_unused_result' [-Wunused-result] 4344 | if (db > 1) write(2, buf, n); | ^~~~~~~~~~~~~~~~ In file included from sslhelper.c:4385: enc.h: In function 'securevnc_setup': enc.h:1344:9: warning: ignoring return value of 'read' declared with attribute 'warn_unused_result' [-Wunused-result] 1344 | read(server, (char *) &b1, 1); | ^~~~~~~~~~~~~~~~~~~~~~~~~~~~~ enc.h:1345:9: warning: ignoring return value of 'read' declared with attribute 'warn_unused_result' [-Wunused-result] 1345 | read(server, (char *) &b2, 1); | ^~~~~~~~~~~~~~~~~~~~~~~~~~~~~ enc.h:1346:9: warning: ignoring return value of 'read' declared with attribute 'warn_unused_result' [-Wunused-result] 1346 | read(server, (char *) &b3, 1); | ^~~~~~~~~~~~~~~~~~~~~~~~~~~~~ enc.h:1347:9: warning: ignoring return value of 'read' declared with attribute 'warn_unused_result' [-Wunused-result] 1347 | read(server, (char *) &b4, 1); | ^~~~~~~~~~~~~~~~~~~~~~~~~~~~~ enc.h:1436:9: warning: ignoring return value of 'write' declared with attribute 'warn_unused_result' [-Wunused-result] 1436 | write(2, to_viewer, 12); /* and first 12 bytes 'RFB ...' as message */ | ^~~~~~~~~~~~~~~~~~~~~~~ enc.h:1469:9: warning: ignoring return value of 'write' declared with attribute 'warn_unused_result' [-Wunused-result] 1469 | write(server, encrypted_keybuf, n); | ^~~~~~~~~~~~~~~~~~~~~~~~~~~~~~~~~~ enc.h:1479:17: warning: ignoring return value of 'write' declared with attribute 'warn_unused_result' [-Wunused-result] 1479 | write(server, (char *)&zero, 1); | ^~~~~~~~~~~~~~~~~~~~~~~~~~~~~~~ enc.h:1481:17: warning: ignoring return value of 'write' declared with attribute 'warn_unused_result' [-Wunused-result] 1481 | write(server, (char *)&one, 1); | ^~~~~~~~~~~~~~~~~~~~~~~~~~~~~~ enc.h:1483:9: warning: ignoring return value of 'write' declared with attribute 'warn_unused_result' [-Wunused-result] 1483 | write(server, (char *)&zero, 1); | ^~~~~~~~~~~~~~~~~~~~~~~~~~~~~~~ enc.h:1484:9: warning: ignoring return value of 'write' declared with attribute 'warn_unused_result' [-Wunused-result] 1484 | write(server, (char *)&zero, 1); | ^~~~~~~~~~~~~~~~~~~~~~~~~~~~~~~ enc.h:1486:17: warning: ignoring return value of 'write' declared with attribute 'warn_unused_result' [-Wunused-result] 1486 | write(server, (char *)&sig, 1); | ^~~~~~~~~~~~~~~~~~~~~~~~~~~~~~ enc.h:1488:17: warning: ignoring return value of 'write' declared with attribute 'warn_unused_result' [-Wunused-result] 1488 | write(server, (char *)&zero, 1); | ^~~~~~~~~~~~~~~~~~~~~~~~~~~~~~~ enc.h:1558:17: warning: ignoring return value of 'write' declared with attribute 'warn_unused_result' [-Wunused-result] 1558 | write(server, signature, nsig); | ^~~~~~~~~~~~~~~~~~~~~~~~~~~~~~ enc.h:1568:17: warning: ignoring return value of 'write' declared with attribute 'warn_unused_result' [-Wunused-result] 1568 | write(viewer, to_viewer, to_viewer_len); | ^~~~~~~~~~~~~~~~~~~~~~~~~~~~~~~~~~~~~~~ enc.h: In function 'securevnc_server_rsa_save_dialog': enc.h:1110:17: warning: ignoring return value of 'write' declared with attribute 'warn_unused_result' [-Wunused-result] 1110 | write(fileno(p), rsabuf, SECUREVNC_RSA_PUBKEY_SIZE); | ^~~~~~~~~~~~~~~~~~~~~~~~~~~~~~~~~~~~~~~~~~~~~~~~~~~ enc.h: In function 'doloop': enc.h:2102:25: warning: ignoring return value of 'system' declared with attribute 'warn_unused_result' [-Wunused-result] 2102 | system(cmd); | ^~~~~~~~~~~ In function 'doloop', inlined from '__enc_main' at enc.h:2113:4: enc.h:2087:24: warning: writing 1 byte into a region of size 0 [-Wstringop-overflow=] 2087 | cmd[0] = '\0'; | ~~~~~~~^~~~~~ enc.h: In function '__enc_main': enc.h:2086:31: note: destination object of size 0 allocated by 'malloc' 2086 | cmd = (char *)malloc(len); | ^~~~~~~~~~~ make[2]: Leaving directory '/tmp/B.hlvenwku/BUILD/x11vnc-0.9.16/src' make[2]: Entering directory '/tmp/B.hlvenwku/BUILD/x11vnc-0.9.16/src' CC x11vnc-userinput.o make[2]: Leaving directory '/tmp/B.hlvenwku/BUILD/x11vnc-0.9.16/src' make[2]: Entering directory '/tmp/B.hlvenwku/BUILD/x11vnc-0.9.16/src' CC x11vnc-x11vnc.o x11vnc.c: In function 'terminal_services': x11vnc.c:555:49: warning: ignoring return value of 'system' declared with attribute 'warn_unused_result' [-Wunused-result] 555 | system(dcmd); | ^~~~~~~~~~~~ x11vnc.c:562:49: warning: ignoring return value of 'system' declared with attribute 'warn_unused_result' [-Wunused-result] 562 | system(dcmd); | ^~~~~~~~~~~~ x11vnc.c: In function 'do_tsd': x11vnc.c:718:17: warning: ignoring return value of 'system' declared with attribute 'warn_unused_result' [-Wunused-result] 718 | system(cmd); | ^~~~~~~~~~~ x11vnc.c:729:17: warning: ignoring return value of 'system' declared with attribute 'warn_unused_result' [-Wunused-result] 729 | system(cmd); | ^~~~~~~~~~~ x11vnc.c: In function 'quick_pw': x11vnc.c:1381:17: warning: ignoring return value of 'system' declared with attribute 'warn_unused_result' [-Wunused-result] 1381 | system("stty -echo"); | ^~~~~~~~~~~~~~~~~~~~ x11vnc.c:1384:25: warning: ignoring return value of 'system' declared with attribute 'warn_unused_result' [-Wunused-result] 1384 | system("stty echo"); | ^~~~~~~~~~~~~~~~~~~ x11vnc.c:1387:17: warning: ignoring return value of 'system' declared with attribute 'warn_unused_result' [-Wunused-result] 1387 | system("stty echo"); | ^~~~~~~~~~~~~~~~~~~ x11vnc.c: In function 'store_homedir_passwd': x11vnc.c:1760:9: warning: ignoring return value of 'system' declared with attribute 'warn_unused_result' [-Wunused-result] 1760 | system("stty -echo"); | ^~~~~~~~~~~~~~~~~~~~ x11vnc.c:1763:17: warning: ignoring return value of 'system' declared with attribute 'warn_unused_result' [-Wunused-result] 1763 | system("stty echo"); | ^~~~~~~~~~~~~~~~~~~ x11vnc.c:1771:17: warning: ignoring return value of 'system' declared with attribute 'warn_unused_result' [-Wunused-result] 1771 | system("stty echo"); | ^~~~~~~~~~~~~~~~~~~ x11vnc.c:1775:9: warning: ignoring return value of 'system' declared with attribute 'warn_unused_result' [-Wunused-result] 1775 | system("stty echo"); | ^~~~~~~~~~~~~~~~~~~ make[2]: Leaving directory '/tmp/B.hlvenwku/BUILD/x11vnc-0.9.16/src' make[2]: Entering directory '/tmp/B.hlvenwku/BUILD/x11vnc-0.9.16/src' CC x11vnc-remote.o remote.c: In function 'send_remote_cmd': remote.c:158:33: warning: ignoring return value of 'fgets' declared with attribute 'warn_unused_result' [-Wunused-result] 158 | fgets(line, X11VNC_REMOTE_MAX, in); | ^~~~~~~~~~~~~~~~~~~~~~~~~~~~~~~~~~ remote.c: In function 'check_httpdir': remote.c:362:25: warning: ignoring return value of 'getcwd' declared with attribute 'warn_unused_result' [-Wunused-result] 362 | getcwd(cwd, 1024); | ^~~~~~~~~~~~~~~~~ make[2]: Leaving directory '/tmp/B.hlvenwku/BUILD/x11vnc-0.9.16/src' make[2]: Entering directory '/tmp/B.hlvenwku/BUILD/x11vnc-0.9.16/src' CCLD x11vnc /usr/bin/ld: x11vnc-appshare.o:/tmp/B.hlvenwku/BUILD/x11vnc-0.9.16/src/util.h:107: multiple definition of `pointerMutex'; x11vnc-8to24.o:/tmp/B.hlvenwku/BUILD/x11vnc-0.9.16/src/util.h:107: first defined here /usr/bin/ld: x11vnc-appshare.o:/tmp/B.hlvenwku/BUILD/x11vnc-0.9.16/src/util.h:106: multiple definition of `inputMutex'; x11vnc-8to24.o:/tmp/B.hlvenwku/BUILD/x11vnc-0.9.16/src/util.h:106: first defined here /usr/bin/ld: x11vnc-appshare.o:/tmp/B.hlvenwku/BUILD/x11vnc-0.9.16/src/util.h:105: multiple definition of `clientMutex'; x11vnc-8to24.o:/tmp/B.hlvenwku/BUILD/x11vnc-0.9.16/src/util.h:105: first defined here /usr/bin/ld: x11vnc-avahi.o:/tmp/B.hlvenwku/BUILD/x11vnc-0.9.16/src/util.h:107: multiple definition of `pointerMutex'; x11vnc-8to24.o:/tmp/B.hlvenwku/BUILD/x11vnc-0.9.16/src/util.h:107: first defined here /usr/bin/ld: x11vnc-avahi.o:/tmp/B.hlvenwku/BUILD/x11vnc-0.9.16/src/util.h:106: multiple definition of `inputMutex'; x11vnc-8to24.o:/tmp/B.hlvenwku/BUILD/x11vnc-0.9.16/src/util.h:106: first defined here /usr/bin/ld: x11vnc-avahi.o:/tmp/B.hlvenwku/BUILD/x11vnc-0.9.16/src/util.h:105: multiple definition of `clientMutex'; x11vnc-8to24.o:/tmp/B.hlvenwku/BUILD/x11vnc-0.9.16/src/util.h:105: first defined here /usr/bin/ld: x11vnc-cleanup.o:/tmp/B.hlvenwku/BUILD/x11vnc-0.9.16/src/util.h:107: multiple definition of `pointerMutex'; x11vnc-8to24.o:/tmp/B.hlvenwku/BUILD/x11vnc-0.9.16/src/util.h:107: first defined here /usr/bin/ld: x11vnc-cleanup.o:/tmp/B.hlvenwku/BUILD/x11vnc-0.9.16/src/util.h:106: multiple definition of `inputMutex'; x11vnc-8to24.o:/tmp/B.hlvenwku/BUILD/x11vnc-0.9.16/src/util.h:106: first defined here /usr/bin/ld: x11vnc-cleanup.o:/tmp/B.hlvenwku/BUILD/x11vnc-0.9.16/src/util.h:105: multiple definition of `clientMutex'; x11vnc-8to24.o:/tmp/B.hlvenwku/BUILD/x11vnc-0.9.16/src/util.h:105: first defined here /usr/bin/ld: x11vnc-connections.o:/tmp/B.hlvenwku/BUILD/x11vnc-0.9.16/src/util.h:105: multiple definition of `clientMutex'; x11vnc-8to24.o:/tmp/B.hlvenwku/BUILD/x11vnc-0.9.16/src/util.h:105: first defined here /usr/bin/ld: x11vnc-connections.o:/tmp/B.hlvenwku/BUILD/x11vnc-0.9.16/src/util.h:107: multiple definition of `pointerMutex'; x11vnc-8to24.o:/tmp/B.hlvenwku/BUILD/x11vnc-0.9.16/src/util.h:107: first defined here /usr/bin/ld: x11vnc-connections.o:/tmp/B.hlvenwku/BUILD/x11vnc-0.9.16/src/util.h:106: multiple definition of `inputMutex'; x11vnc-8to24.o:/tmp/B.hlvenwku/BUILD/x11vnc-0.9.16/src/util.h:106: first defined here /usr/bin/ld: x11vnc-cursor.o:/tmp/B.hlvenwku/BUILD/x11vnc-0.9.16/src/util.h:106: multiple definition of `inputMutex'; x11vnc-8to24.o:/tmp/B.hlvenwku/BUILD/x11vnc-0.9.16/src/util.h:106: first defined here /usr/bin/ld: x11vnc-cursor.o:/tmp/B.hlvenwku/BUILD/x11vnc-0.9.16/src/util.h:107: multiple definition of `pointerMutex'; x11vnc-8to24.o:/tmp/B.hlvenwku/BUILD/x11vnc-0.9.16/src/util.h:107: first defined here /usr/bin/ld: x11vnc-cursor.o:/tmp/B.hlvenwku/BUILD/x11vnc-0.9.16/src/util.h:105: multiple definition of `clientMutex'; x11vnc-8to24.o:/tmp/B.hlvenwku/BUILD/x11vnc-0.9.16/src/util.h:105: first defined here /usr/bin/ld: x11vnc-gui.o:/tmp/B.hlvenwku/BUILD/x11vnc-0.9.16/src/util.h:107: multiple definition of `pointerMutex'; x11vnc-8to24.o:/tmp/B.hlvenwku/BUILD/x11vnc-0.9.16/src/util.h:107: first defined here /usr/bin/ld: x11vnc-gui.o:/tmp/B.hlvenwku/BUILD/x11vnc-0.9.16/src/util.h:106: multiple definition of `inputMutex'; x11vnc-8to24.o:/tmp/B.hlvenwku/BUILD/x11vnc-0.9.16/src/util.h:106: first defined here /usr/bin/ld: x11vnc-gui.o:/tmp/B.hlvenwku/BUILD/x11vnc-0.9.16/src/util.h:105: multiple definition of `clientMutex'; x11vnc-8to24.o:/tmp/B.hlvenwku/BUILD/x11vnc-0.9.16/src/util.h:105: first defined here /usr/bin/ld: x11vnc-help.o:/tmp/B.hlvenwku/BUILD/x11vnc-0.9.16/src/util.h:107: multiple definition of `pointerMutex'; x11vnc-8to24.o:/tmp/B.hlvenwku/BUILD/x11vnc-0.9.16/src/util.h:107: first defined here /usr/bin/ld: x11vnc-help.o:/tmp/B.hlvenwku/BUILD/x11vnc-0.9.16/src/util.h:106: multiple definition of `inputMutex'; x11vnc-8to24.o:/tmp/B.hlvenwku/BUILD/x11vnc-0.9.16/src/util.h:106: first defined here /usr/bin/ld: x11vnc-help.o:/tmp/B.hlvenwku/BUILD/x11vnc-0.9.16/src/util.h:105: multiple definition of `clientMutex'; x11vnc-8to24.o:/tmp/B.hlvenwku/BUILD/x11vnc-0.9.16/src/util.h:105: first defined here /usr/bin/ld: x11vnc-inet.o:/tmp/B.hlvenwku/BUILD/x11vnc-0.9.16/src/util.h:107: multiple definition of `pointerMutex'; x11vnc-8to24.o:/tmp/B.hlvenwku/BUILD/x11vnc-0.9.16/src/util.h:107: first defined here /usr/bin/ld: x11vnc-inet.o:/tmp/B.hlvenwku/BUILD/x11vnc-0.9.16/src/util.h:106: multiple definition of `inputMutex'; x11vnc-8to24.o:/tmp/B.hlvenwku/BUILD/x11vnc-0.9.16/src/util.h:106: first defined here /usr/bin/ld: x11vnc-inet.o:/tmp/B.hlvenwku/BUILD/x11vnc-0.9.16/src/util.h:105: multiple definition of `clientMutex'; x11vnc-8to24.o:/tmp/B.hlvenwku/BUILD/x11vnc-0.9.16/src/util.h:105: first defined here /usr/bin/ld: x11vnc-keyboard.o:/tmp/B.hlvenwku/BUILD/x11vnc-0.9.16/src/util.h:106: multiple definition of `inputMutex'; x11vnc-8to24.o:/tmp/B.hlvenwku/BUILD/x11vnc-0.9.16/src/util.h:106: first defined here /usr/bin/ld: x11vnc-keyboard.o:/tmp/B.hlvenwku/BUILD/x11vnc-0.9.16/src/util.h:107: multiple definition of `pointerMutex'; x11vnc-8to24.o:/tmp/B.hlvenwku/BUILD/x11vnc-0.9.16/src/util.h:107: first defined here /usr/bin/ld: x11vnc-keyboard.o:/tmp/B.hlvenwku/BUILD/x11vnc-0.9.16/src/util.h:105: multiple definition of `clientMutex'; x11vnc-8to24.o:/tmp/B.hlvenwku/BUILD/x11vnc-0.9.16/src/util.h:105: first defined here /usr/bin/ld: x11vnc-linuxfb.o:/tmp/B.hlvenwku/BUILD/x11vnc-0.9.16/src/util.h:107: multiple definition of `pointerMutex'; x11vnc-8to24.o:/tmp/B.hlvenwku/BUILD/x11vnc-0.9.16/src/util.h:107: first defined here /usr/bin/ld: x11vnc-linuxfb.o:/tmp/B.hlvenwku/BUILD/x11vnc-0.9.16/src/util.h:106: multiple definition of `inputMutex'; x11vnc-8to24.o:/tmp/B.hlvenwku/BUILD/x11vnc-0.9.16/src/util.h:106: first defined here /usr/bin/ld: x11vnc-linuxfb.o:/tmp/B.hlvenwku/BUILD/x11vnc-0.9.16/src/util.h:105: multiple definition of `clientMutex'; x11vnc-8to24.o:/tmp/B.hlvenwku/BUILD/x11vnc-0.9.16/src/util.h:105: first defined here /usr/bin/ld: x11vnc-macosx.o:/tmp/B.hlvenwku/BUILD/x11vnc-0.9.16/src/util.h:107: multiple definition of `pointerMutex'; x11vnc-8to24.o:/tmp/B.hlvenwku/BUILD/x11vnc-0.9.16/src/util.h:107: first defined here /usr/bin/ld: x11vnc-macosx.o:/tmp/B.hlvenwku/BUILD/x11vnc-0.9.16/src/util.h:106: multiple definition of `inputMutex'; x11vnc-8to24.o:/tmp/B.hlvenwku/BUILD/x11vnc-0.9.16/src/util.h:106: first defined here /usr/bin/ld: x11vnc-macosx.o:/tmp/B.hlvenwku/BUILD/x11vnc-0.9.16/src/util.h:105: multiple definition of `clientMutex'; x11vnc-8to24.o:/tmp/B.hlvenwku/BUILD/x11vnc-0.9.16/src/util.h:105: first defined here /usr/bin/ld: x11vnc-options.o:/tmp/B.hlvenwku/BUILD/x11vnc-0.9.16/src/util.h:107: multiple definition of `pointerMutex'; x11vnc-8to24.o:/tmp/B.hlvenwku/BUILD/x11vnc-0.9.16/src/util.h:107: first defined here /usr/bin/ld: x11vnc-options.o:/tmp/B.hlvenwku/BUILD/x11vnc-0.9.16/src/util.h:106: multiple definition of `inputMutex'; x11vnc-8to24.o:/tmp/B.hlvenwku/BUILD/x11vnc-0.9.16/src/util.h:106: first defined here /usr/bin/ld: x11vnc-options.o:/tmp/B.hlvenwku/BUILD/x11vnc-0.9.16/src/util.h:105: multiple definition of `clientMutex'; x11vnc-8to24.o:/tmp/B.hlvenwku/BUILD/x11vnc-0.9.16/src/util.h:105: first defined here /usr/bin/ld: x11vnc-pm.o:/tmp/B.hlvenwku/BUILD/x11vnc-0.9.16/src/util.h:107: multiple definition of `pointerMutex'; x11vnc-8to24.o:/tmp/B.hlvenwku/BUILD/x11vnc-0.9.16/src/util.h:107: first defined here /usr/bin/ld: x11vnc-pm.o:/tmp/B.hlvenwku/BUILD/x11vnc-0.9.16/src/util.h:106: multiple definition of `inputMutex'; x11vnc-8to24.o:/tmp/B.hlvenwku/BUILD/x11vnc-0.9.16/src/util.h:106: first defined here /usr/bin/ld: x11vnc-pm.o:/tmp/B.hlvenwku/BUILD/x11vnc-0.9.16/src/util.h:105: multiple definition of `clientMutex'; x11vnc-8to24.o:/tmp/B.hlvenwku/BUILD/x11vnc-0.9.16/src/util.h:105: first defined here /usr/bin/ld: x11vnc-pointer.o:/tmp/B.hlvenwku/BUILD/x11vnc-0.9.16/src/util.h:106: multiple definition of `inputMutex'; x11vnc-8to24.o:/tmp/B.hlvenwku/BUILD/x11vnc-0.9.16/src/util.h:106: first defined here /usr/bin/ld: x11vnc-pointer.o:/tmp/B.hlvenwku/BUILD/x11vnc-0.9.16/src/util.h:107: multiple definition of `pointerMutex'; x11vnc-8to24.o:/tmp/B.hlvenwku/BUILD/x11vnc-0.9.16/src/util.h:107: first defined here /usr/bin/ld: x11vnc-pointer.o:/tmp/B.hlvenwku/BUILD/x11vnc-0.9.16/src/util.h:105: multiple definition of `clientMutex'; x11vnc-8to24.o:/tmp/B.hlvenwku/BUILD/x11vnc-0.9.16/src/util.h:105: first defined here /usr/bin/ld: x11vnc-rates.o:/tmp/B.hlvenwku/BUILD/x11vnc-0.9.16/src/util.h:107: multiple definition of `pointerMutex'; x11vnc-8to24.o:/tmp/B.hlvenwku/BUILD/x11vnc-0.9.16/src/util.h:107: first defined here /usr/bin/ld: x11vnc-rates.o:/tmp/B.hlvenwku/BUILD/x11vnc-0.9.16/src/util.h:106: multiple definition of `inputMutex'; x11vnc-8to24.o:/tmp/B.hlvenwku/BUILD/x11vnc-0.9.16/src/util.h:106: first defined here /usr/bin/ld: x11vnc-rates.o:/tmp/B.hlvenwku/BUILD/x11vnc-0.9.16/src/util.h:105: multiple definition of `clientMutex'; x11vnc-8to24.o:/tmp/B.hlvenwku/BUILD/x11vnc-0.9.16/src/util.h:105: first defined here /usr/bin/ld: x11vnc-remote.o:/tmp/B.hlvenwku/BUILD/x11vnc-0.9.16/src/util.h:107: multiple definition of `pointerMutex'; x11vnc-8to24.o:/tmp/B.hlvenwku/BUILD/x11vnc-0.9.16/src/util.h:107: first defined here /usr/bin/ld: x11vnc-remote.o:/tmp/B.hlvenwku/BUILD/x11vnc-0.9.16/src/util.h:106: multiple definition of `inputMutex'; x11vnc-8to24.o:/tmp/B.hlvenwku/BUILD/x11vnc-0.9.16/src/util.h:106: first defined here /usr/bin/ld: x11vnc-remote.o:/tmp/B.hlvenwku/BUILD/x11vnc-0.9.16/src/util.h:105: multiple definition of `clientMutex'; x11vnc-8to24.o:/tmp/B.hlvenwku/BUILD/x11vnc-0.9.16/src/util.h:105: first defined here /usr/bin/ld: x11vnc-scan.o:/tmp/B.hlvenwku/BUILD/x11vnc-0.9.16/src/util.h:107: multiple definition of `pointerMutex'; x11vnc-8to24.o:/tmp/B.hlvenwku/BUILD/x11vnc-0.9.16/src/util.h:107: first defined here /usr/bin/ld: x11vnc-scan.o:/tmp/B.hlvenwku/BUILD/x11vnc-0.9.16/src/util.h:106: multiple definition of `inputMutex'; x11vnc-8to24.o:/tmp/B.hlvenwku/BUILD/x11vnc-0.9.16/src/util.h:106: first defined here /usr/bin/ld: x11vnc-scan.o:/tmp/B.hlvenwku/BUILD/x11vnc-0.9.16/src/util.h:105: multiple definition of `clientMutex'; x11vnc-8to24.o:/tmp/B.hlvenwku/BUILD/x11vnc-0.9.16/src/util.h:105: first defined here /usr/bin/ld: x11vnc-screen.o:/tmp/B.hlvenwku/BUILD/x11vnc-0.9.16/src/util.h:106: multiple definition of `inputMutex'; x11vnc-8to24.o:/tmp/B.hlvenwku/BUILD/x11vnc-0.9.16/src/util.h:106: first defined here /usr/bin/ld: x11vnc-screen.o:/tmp/B.hlvenwku/BUILD/x11vnc-0.9.16/src/util.h:107: multiple definition of `pointerMutex'; x11vnc-8to24.o:/tmp/B.hlvenwku/BUILD/x11vnc-0.9.16/src/util.h:107: first defined here /usr/bin/ld: x11vnc-screen.o:/tmp/B.hlvenwku/BUILD/x11vnc-0.9.16/src/util.h:105: multiple definition of `clientMutex'; x11vnc-8to24.o:/tmp/B.hlvenwku/BUILD/x11vnc-0.9.16/src/util.h:105: first defined here /usr/bin/ld: x11vnc-selection.o:/tmp/B.hlvenwku/BUILD/x11vnc-0.9.16/src/util.h:107: multiple definition of `pointerMutex'; x11vnc-8to24.o:/tmp/B.hlvenwku/BUILD/x11vnc-0.9.16/src/util.h:107: first defined here /usr/bin/ld: x11vnc-selection.o:/tmp/B.hlvenwku/BUILD/x11vnc-0.9.16/src/util.h:106: multiple definition of `inputMutex'; x11vnc-8to24.o:/tmp/B.hlvenwku/BUILD/x11vnc-0.9.16/src/util.h:106: first defined here /usr/bin/ld: x11vnc-selection.o:/tmp/B.hlvenwku/BUILD/x11vnc-0.9.16/src/util.h:105: multiple definition of `clientMutex'; x11vnc-8to24.o:/tmp/B.hlvenwku/BUILD/x11vnc-0.9.16/src/util.h:105: first defined here /usr/bin/ld: x11vnc-solid.o:/tmp/B.hlvenwku/BUILD/x11vnc-0.9.16/src/util.h:107: multiple definition of `pointerMutex'; x11vnc-8to24.o:/tmp/B.hlvenwku/BUILD/x11vnc-0.9.16/src/util.h:107: first defined here /usr/bin/ld: x11vnc-solid.o:/tmp/B.hlvenwku/BUILD/x11vnc-0.9.16/src/util.h:106: multiple definition of `inputMutex'; x11vnc-8to24.o:/tmp/B.hlvenwku/BUILD/x11vnc-0.9.16/src/util.h:106: first defined here /usr/bin/ld: x11vnc-solid.o:/tmp/B.hlvenwku/BUILD/x11vnc-0.9.16/src/util.h:105: multiple definition of `clientMutex'; x11vnc-8to24.o:/tmp/B.hlvenwku/BUILD/x11vnc-0.9.16/src/util.h:105: first defined here /usr/bin/ld: x11vnc-sslcmds.o:/tmp/B.hlvenwku/BUILD/x11vnc-0.9.16/src/util.h:107: multiple definition of `pointerMutex'; x11vnc-8to24.o:/tmp/B.hlvenwku/BUILD/x11vnc-0.9.16/src/util.h:107: first defined here /usr/bin/ld: x11vnc-sslcmds.o:/tmp/B.hlvenwku/BUILD/x11vnc-0.9.16/src/util.h:106: multiple definition of `inputMutex'; x11vnc-8to24.o:/tmp/B.hlvenwku/BUILD/x11vnc-0.9.16/src/util.h:106: first defined here /usr/bin/ld: x11vnc-sslcmds.o:/tmp/B.hlvenwku/BUILD/x11vnc-0.9.16/src/util.h:105: multiple definition of `clientMutex'; x11vnc-8to24.o:/tmp/B.hlvenwku/BUILD/x11vnc-0.9.16/src/util.h:105: first defined here /usr/bin/ld: x11vnc-sslhelper.o:/tmp/B.hlvenwku/BUILD/x11vnc-0.9.16/src/util.h:107: multiple definition of `pointerMutex'; x11vnc-8to24.o:/tmp/B.hlvenwku/BUILD/x11vnc-0.9.16/src/util.h:107: first defined here /usr/bin/ld: x11vnc-sslhelper.o:/tmp/B.hlvenwku/BUILD/x11vnc-0.9.16/src/util.h:106: multiple definition of `inputMutex'; x11vnc-8to24.o:/tmp/B.hlvenwku/BUILD/x11vnc-0.9.16/src/util.h:106: first defined here /usr/bin/ld: x11vnc-sslhelper.o:/tmp/B.hlvenwku/BUILD/x11vnc-0.9.16/src/util.h:105: multiple definition of `clientMutex'; x11vnc-8to24.o:/tmp/B.hlvenwku/BUILD/x11vnc-0.9.16/src/util.h:105: first defined here /usr/bin/ld: x11vnc-uinput.o:/tmp/B.hlvenwku/BUILD/x11vnc-0.9.16/src/util.h:107: multiple definition of `pointerMutex'; x11vnc-8to24.o:/tmp/B.hlvenwku/BUILD/x11vnc-0.9.16/src/util.h:107: first defined here /usr/bin/ld: x11vnc-uinput.o:/tmp/B.hlvenwku/BUILD/x11vnc-0.9.16/src/util.h:106: multiple definition of `inputMutex'; x11vnc-8to24.o:/tmp/B.hlvenwku/BUILD/x11vnc-0.9.16/src/util.h:106: first defined here /usr/bin/ld: x11vnc-uinput.o:/tmp/B.hlvenwku/BUILD/x11vnc-0.9.16/src/util.h:105: multiple definition of `clientMutex'; x11vnc-8to24.o:/tmp/B.hlvenwku/BUILD/x11vnc-0.9.16/src/util.h:105: first defined here /usr/bin/ld: x11vnc-unixpw.o:/tmp/B.hlvenwku/BUILD/x11vnc-0.9.16/src/util.h:107: multiple definition of `pointerMutex'; x11vnc-8to24.o:/tmp/B.hlvenwku/BUILD/x11vnc-0.9.16/src/util.h:107: first defined here /usr/bin/ld: x11vnc-unixpw.o:/tmp/B.hlvenwku/BUILD/x11vnc-0.9.16/src/util.h:106: multiple definition of `inputMutex'; x11vnc-8to24.o:/tmp/B.hlvenwku/BUILD/x11vnc-0.9.16/src/util.h:106: first defined here /usr/bin/ld: x11vnc-unixpw.o:/tmp/B.hlvenwku/BUILD/x11vnc-0.9.16/src/util.h:105: multiple definition of `clientMutex'; x11vnc-8to24.o:/tmp/B.hlvenwku/BUILD/x11vnc-0.9.16/src/util.h:105: first defined here /usr/bin/ld: x11vnc-user.o:/tmp/B.hlvenwku/BUILD/x11vnc-0.9.16/src/util.h:107: multiple definition of `pointerMutex'; x11vnc-8to24.o:/tmp/B.hlvenwku/BUILD/x11vnc-0.9.16/src/util.h:107: first defined here /usr/bin/ld: x11vnc-user.o:/tmp/B.hlvenwku/BUILD/x11vnc-0.9.16/src/util.h:106: multiple definition of `inputMutex'; x11vnc-8to24.o:/tmp/B.hlvenwku/BUILD/x11vnc-0.9.16/src/util.h:106: first defined here /usr/bin/ld: x11vnc-user.o:/tmp/B.hlvenwku/BUILD/x11vnc-0.9.16/src/util.h:105: multiple definition of `clientMutex'; x11vnc-8to24.o:/tmp/B.hlvenwku/BUILD/x11vnc-0.9.16/src/util.h:105: first defined here /usr/bin/ld: x11vnc-userinput.o:/tmp/B.hlvenwku/BUILD/x11vnc-0.9.16/src/util.h:107: multiple definition of `pointerMutex'; x11vnc-8to24.o:/tmp/B.hlvenwku/BUILD/x11vnc-0.9.16/src/util.h:107: first defined here /usr/bin/ld: x11vnc-userinput.o:/tmp/B.hlvenwku/BUILD/x11vnc-0.9.16/src/util.h:106: multiple definition of `inputMutex'; x11vnc-8to24.o:/tmp/B.hlvenwku/BUILD/x11vnc-0.9.16/src/util.h:106: first defined here /usr/bin/ld: x11vnc-userinput.o:/tmp/B.hlvenwku/BUILD/x11vnc-0.9.16/src/util.h:105: multiple definition of `clientMutex'; x11vnc-8to24.o:/tmp/B.hlvenwku/BUILD/x11vnc-0.9.16/src/util.h:105: first defined here /usr/bin/ld: x11vnc-util.o:/tmp/B.hlvenwku/BUILD/x11vnc-0.9.16/src/util.h:107: multiple definition of `pointerMutex'; x11vnc-8to24.o:/tmp/B.hlvenwku/BUILD/x11vnc-0.9.16/src/util.h:107: first defined here /usr/bin/ld: x11vnc-util.o:/tmp/B.hlvenwku/BUILD/x11vnc-0.9.16/src/util.h:106: multiple definition of `inputMutex'; x11vnc-8to24.o:/tmp/B.hlvenwku/BUILD/x11vnc-0.9.16/src/util.h:106: first defined here /usr/bin/ld: x11vnc-util.o:/tmp/B.hlvenwku/BUILD/x11vnc-0.9.16/src/util.h:105: multiple definition of `clientMutex'; x11vnc-8to24.o:/tmp/B.hlvenwku/BUILD/x11vnc-0.9.16/src/util.h:105: first defined here /usr/bin/ld: x11vnc-v4l.o:/tmp/B.hlvenwku/BUILD/x11vnc-0.9.16/src/util.h:107: multiple definition of `pointerMutex'; x11vnc-8to24.o:/tmp/B.hlvenwku/BUILD/x11vnc-0.9.16/src/util.h:107: first defined here /usr/bin/ld: x11vnc-v4l.o:/tmp/B.hlvenwku/BUILD/x11vnc-0.9.16/src/util.h:106: multiple definition of `inputMutex'; x11vnc-8to24.o:/tmp/B.hlvenwku/BUILD/x11vnc-0.9.16/src/util.h:106: first defined here /usr/bin/ld: x11vnc-v4l.o:/tmp/B.hlvenwku/BUILD/x11vnc-0.9.16/src/util.h:105: multiple definition of `clientMutex'; x11vnc-8to24.o:/tmp/B.hlvenwku/BUILD/x11vnc-0.9.16/src/util.h:105: first defined here /usr/bin/ld: x11vnc-win_utils.o:/tmp/B.hlvenwku/BUILD/x11vnc-0.9.16/src/util.h:107: multiple definition of `pointerMutex'; x11vnc-8to24.o:/tmp/B.hlvenwku/BUILD/x11vnc-0.9.16/src/util.h:107: first defined here /usr/bin/ld: x11vnc-win_utils.o:/tmp/B.hlvenwku/BUILD/x11vnc-0.9.16/src/util.h:106: multiple definition of `inputMutex'; x11vnc-8to24.o:/tmp/B.hlvenwku/BUILD/x11vnc-0.9.16/src/util.h:106: first defined here /usr/bin/ld: x11vnc-win_utils.o:/tmp/B.hlvenwku/BUILD/x11vnc-0.9.16/src/util.h:105: multiple definition of `clientMutex'; x11vnc-8to24.o:/tmp/B.hlvenwku/BUILD/x11vnc-0.9.16/src/util.h:105: first defined here /usr/bin/ld: x11vnc-x11vnc.o:/tmp/B.hlvenwku/BUILD/x11vnc-0.9.16/src/util.h:105: multiple definition of `clientMutex'; x11vnc-8to24.o:/tmp/B.hlvenwku/BUILD/x11vnc-0.9.16/src/util.h:105: first defined here /usr/bin/ld: x11vnc-x11vnc.o:/tmp/B.hlvenwku/BUILD/x11vnc-0.9.16/src/util.h:106: multiple definition of `inputMutex'; x11vnc-8to24.o:/tmp/B.hlvenwku/BUILD/x11vnc-0.9.16/src/util.h:106: first defined here /usr/bin/ld: x11vnc-x11vnc.o:/tmp/B.hlvenwku/BUILD/x11vnc-0.9.16/src/util.h:107: multiple definition of `pointerMutex'; x11vnc-8to24.o:/tmp/B.hlvenwku/BUILD/x11vnc-0.9.16/src/util.h:107: first defined here /usr/bin/ld: x11vnc-x11vnc_defs.o:/tmp/B.hlvenwku/BUILD/x11vnc-0.9.16/src/util.h:107: multiple definition of `pointerMutex'; x11vnc-8to24.o:/tmp/B.hlvenwku/BUILD/x11vnc-0.9.16/src/util.h:107: first defined here /usr/bin/ld: x11vnc-x11vnc_defs.o:/tmp/B.hlvenwku/BUILD/x11vnc-0.9.16/src/util.h:106: multiple definition of `inputMutex'; x11vnc-8to24.o:/tmp/B.hlvenwku/BUILD/x11vnc-0.9.16/src/util.h:106: first defined here /usr/bin/ld: x11vnc-x11vnc_defs.o:/tmp/B.hlvenwku/BUILD/x11vnc-0.9.16/src/util.h:105: multiple definition of `clientMutex'; x11vnc-8to24.o:/tmp/B.hlvenwku/BUILD/x11vnc-0.9.16/src/util.h:105: first defined here /usr/bin/ld: x11vnc-xdamage.o:/tmp/B.hlvenwku/BUILD/x11vnc-0.9.16/src/util.h:107: multiple definition of `pointerMutex'; x11vnc-8to24.o:/tmp/B.hlvenwku/BUILD/x11vnc-0.9.16/src/util.h:107: first defined here /usr/bin/ld: x11vnc-xdamage.o:/tmp/B.hlvenwku/BUILD/x11vnc-0.9.16/src/util.h:106: multiple definition of `inputMutex'; x11vnc-8to24.o:/tmp/B.hlvenwku/BUILD/x11vnc-0.9.16/src/util.h:106: first defined here /usr/bin/ld: x11vnc-xdamage.o:/tmp/B.hlvenwku/BUILD/x11vnc-0.9.16/src/util.h:105: multiple definition of `clientMutex'; x11vnc-8to24.o:/tmp/B.hlvenwku/BUILD/x11vnc-0.9.16/src/util.h:105: first defined here /usr/bin/ld: x11vnc-xevents.o:/tmp/B.hlvenwku/BUILD/x11vnc-0.9.16/src/util.h:106: multiple definition of `inputMutex'; x11vnc-8to24.o:/tmp/B.hlvenwku/BUILD/x11vnc-0.9.16/src/util.h:106: first defined here /usr/bin/ld: x11vnc-xevents.o:/tmp/B.hlvenwku/BUILD/x11vnc-0.9.16/src/util.h:107: multiple definition of `pointerMutex'; x11vnc-8to24.o:/tmp/B.hlvenwku/BUILD/x11vnc-0.9.16/src/util.h:107: first defined here /usr/bin/ld: x11vnc-xevents.o:/tmp/B.hlvenwku/BUILD/x11vnc-0.9.16/src/util.h:105: multiple definition of `clientMutex'; x11vnc-8to24.o:/tmp/B.hlvenwku/BUILD/x11vnc-0.9.16/src/util.h:105: first defined here /usr/bin/ld: x11vnc-xi2_devices.o:/tmp/B.hlvenwku/BUILD/x11vnc-0.9.16/src/util.h:107: multiple definition of `pointerMutex'; x11vnc-8to24.o:/tmp/B.hlvenwku/BUILD/x11vnc-0.9.16/src/util.h:107: first defined here /usr/bin/ld: x11vnc-xi2_devices.o:/tmp/B.hlvenwku/BUILD/x11vnc-0.9.16/src/util.h:106: multiple definition of `inputMutex'; x11vnc-8to24.o:/tmp/B.hlvenwku/BUILD/x11vnc-0.9.16/src/util.h:106: first defined here /usr/bin/ld: x11vnc-xi2_devices.o:/tmp/B.hlvenwku/BUILD/x11vnc-0.9.16/src/util.h:105: multiple definition of `clientMutex'; x11vnc-8to24.o:/tmp/B.hlvenwku/BUILD/x11vnc-0.9.16/src/util.h:105: first defined here /usr/bin/ld: x11vnc-xinerama.o:/tmp/B.hlvenwku/BUILD/x11vnc-0.9.16/src/util.h:107: multiple definition of `pointerMutex'; x11vnc-8to24.o:/tmp/B.hlvenwku/BUILD/x11vnc-0.9.16/src/util.h:107: first defined here /usr/bin/ld: x11vnc-xinerama.o:/tmp/B.hlvenwku/BUILD/x11vnc-0.9.16/src/util.h:106: multiple definition of `inputMutex'; x11vnc-8to24.o:/tmp/B.hlvenwku/BUILD/x11vnc-0.9.16/src/util.h:106: first defined here /usr/bin/ld: x11vnc-xinerama.o:/tmp/B.hlvenwku/BUILD/x11vnc-0.9.16/src/util.h:105: multiple definition of `clientMutex'; x11vnc-8to24.o:/tmp/B.hlvenwku/BUILD/x11vnc-0.9.16/src/util.h:105: first defined here /usr/bin/ld: x11vnc-xkb_bell.o:/tmp/B.hlvenwku/BUILD/x11vnc-0.9.16/src/util.h:107: multiple definition of `pointerMutex'; x11vnc-8to24.o:/tmp/B.hlvenwku/BUILD/x11vnc-0.9.16/src/util.h:107: first defined here /usr/bin/ld: x11vnc-xkb_bell.o:/tmp/B.hlvenwku/BUILD/x11vnc-0.9.16/src/util.h:106: multiple definition of `inputMutex'; x11vnc-8to24.o:/tmp/B.hlvenwku/BUILD/x11vnc-0.9.16/src/util.h:106: first defined here /usr/bin/ld: x11vnc-xkb_bell.o:/tmp/B.hlvenwku/BUILD/x11vnc-0.9.16/src/util.h:105: multiple definition of `clientMutex'; x11vnc-8to24.o:/tmp/B.hlvenwku/BUILD/x11vnc-0.9.16/src/util.h:105: first defined here /usr/bin/ld: x11vnc-xrandr.o:/tmp/B.hlvenwku/BUILD/x11vnc-0.9.16/src/util.h:107: multiple definition of `pointerMutex'; x11vnc-8to24.o:/tmp/B.hlvenwku/BUILD/x11vnc-0.9.16/src/util.h:107: first defined here /usr/bin/ld: x11vnc-xrandr.o:/tmp/B.hlvenwku/BUILD/x11vnc-0.9.16/src/util.h:106: multiple definition of `inputMutex'; x11vnc-8to24.o:/tmp/B.hlvenwku/BUILD/x11vnc-0.9.16/src/util.h:106: first defined here /usr/bin/ld: x11vnc-xrandr.o:/tmp/B.hlvenwku/BUILD/x11vnc-0.9.16/src/util.h:105: multiple definition of `clientMutex'; x11vnc-8to24.o:/tmp/B.hlvenwku/BUILD/x11vnc-0.9.16/src/util.h:105: first defined here /usr/bin/ld: x11vnc-xrecord.o:/tmp/B.hlvenwku/BUILD/x11vnc-0.9.16/src/util.h:107: multiple definition of `pointerMutex'; x11vnc-8to24.o:/tmp/B.hlvenwku/BUILD/x11vnc-0.9.16/src/util.h:107: first defined here /usr/bin/ld: x11vnc-xrecord.o:/tmp/B.hlvenwku/BUILD/x11vnc-0.9.16/src/util.h:106: multiple definition of `inputMutex'; x11vnc-8to24.o:/tmp/B.hlvenwku/BUILD/x11vnc-0.9.16/src/util.h:106: first defined here /usr/bin/ld: x11vnc-xrecord.o:/tmp/B.hlvenwku/BUILD/x11vnc-0.9.16/src/util.h:105: multiple definition of `clientMutex'; x11vnc-8to24.o:/tmp/B.hlvenwku/BUILD/x11vnc-0.9.16/src/util.h:105: first defined here /usr/bin/ld: x11vnc-xwrappers.o:/tmp/B.hlvenwku/BUILD/x11vnc-0.9.16/src/util.h:107: multiple definition of `pointerMutex'; x11vnc-8to24.o:/tmp/B.hlvenwku/BUILD/x11vnc-0.9.16/src/util.h:107: first defined here /usr/bin/ld: x11vnc-xwrappers.o:/tmp/B.hlvenwku/BUILD/x11vnc-0.9.16/src/util.h:106: multiple definition of `inputMutex'; x11vnc-8to24.o:/tmp/B.hlvenwku/BUILD/x11vnc-0.9.16/src/util.h:106: first defined here /usr/bin/ld: x11vnc-xwrappers.o:/tmp/B.hlvenwku/BUILD/x11vnc-0.9.16/src/util.h:105: multiple definition of `clientMutex'; x11vnc-8to24.o:/tmp/B.hlvenwku/BUILD/x11vnc-0.9.16/src/util.h:105: first defined here /usr/bin/ld: warning: libcrypto.so.1.1, needed by /usr/lib64/libsasl2.so.3, may conflict with libcrypto.so.3 collect2: error: ld returned 1 exit status make[2]: *** [Makefile:551: x11vnc] Error 1 make[2]: Leaving directory '/tmp/B.hlvenwku/BUILD/x11vnc-0.9.16/src' make[1]: *** [Makefile:503: all-recursive] Error 1 make: *** [Makefile:380: all] Error 2 error: Bad exit status from /tmp/B.hlvenwku/BUILD/tmp/rpm-tmp.y40W8C (%build) RPM build errors: Could not canonicalize hostname: ymir Bad exit status from /tmp/B.hlvenwku/BUILD/tmp/rpm-tmp.y40W8C (%build) ended at: Mon Sep 27 03:43:14 2021, done in 0:00:20.982354 error: No files produced. + chmod -R u+rwX /tmp/B.hlvenwku/BUILD + rm -rf /tmp/B.hlvenwku/tmp /tmp/B.hlvenwku/BUILD + rm -rf /tmp/B.hlvenwku Begin-PLD-Builder-Info Build-Time: user:52.46s sys:6.41s real:22.92s (faults io:3 non-io:1497570) End-PLD-Builder-Info
[Back to list of logs] [View rpm -qa of builder]