FailedOk

th/SRPMS[OK]
th/x32[OK]
th/i686[OK]
th/x86_64[OK]

ac/SRPMS[OK]
ac/i386[OK]
ac/i586[OK]
ac/i686[OK]
ac/alpha[OK]
ac/amd64[OK]
ac/athlon[OK]
ac/ppc[OK]
ac/sparc[OK]
ac/sparc64[OK]

Advanced Search
main()
Powered by PLD Linux
(c) 2002-2021 PLD Team
$Revision: 1.37 $
Powered by Paranoid Android.
Your IP: 3.80.3.192

xml-security-c 8e1edfa3-8037-4625-9976-2b0063350a81

Status:Failed
Source URL:https://buildlogs.pld-linux.org/pld/th/x86_64/FAIL/xml-security-c,8e1edfa3-8037-4625-9976-2b0063350a81.bz2
text/plain URL:View!
full text:View!
rpm -qa of builder:View!
Date:2021/09/27 03:44:02
Runtime:0:00:38.898494

Toc:

  • error 1
  • enc/OpenSSL/OpenSSLCryptoKeyRSA.cpp:416:33: error: invalid conversion from 'const rsa_st*' to 'RSA*' {aka 'rsa_st*'} [-fpermissive]
  • error 2
  • make[2]: *** [Makefile:3312: enc/OpenSSL/libxml_security_c_la-OpenSSLCryptoKeyRSA.lo] Error 1
  • error 3
  • make[1]: *** [Makefile:521: all-recursive] Error 1
  • error 4
  • error: Bad exit status from /tmp/B.ag6y_8zp/BUILD/tmp/rpm-tmp.TIzFhj (%build)
  • error 5
  • RPM build errors:
  • error 6
  • error: No files produced.

Content:

make[2]: Entering directory '/tmp/B.ag6y_8zp/BUILD/xml-security-c-2.0.1/xsec'
/bin/sh ../libtool  --tag=CXX   --mode=compile x86_64-pld-linux-g++ -DHAVE_CONFIG_H   -I.. -I.. -DXSEC_BUILDING_LIBRARY     -I/usr/include/nss -I/usr/include/nspr -Wall -O2 -fwrapv -pipe -Wformat -Werror=format-security -gdwarf-4 -fno-debug-types-section -fvar-tracking-assignments -g2 -Wp,-D_FORTIFY_SOURCE=2 -fstack-protector-strong --param=ssp-buffer-size=4 -Werror=trampolines -fPIC -march=x86-64 -mtune=generic -gdwarf-4 -fno-debug-types-section -fvar-tracking-assignments -g2  -DNDEBUG  -MT xkms/impl/libxml_security_c_la-XKMSRegisterRequestImpl.lo -MD -MP -MF xkms/impl/.deps/libxml_security_c_la-XKMSRegisterRequestImpl.Tpo -c -o xkms/impl/libxml_security_c_la-XKMSRegisterRequestImpl.lo `test -f 'xkms/impl/XKMSRegisterRequestImpl.cpp' || echo './'`xkms/impl/XKMSRegisterRequestImpl.cpp
libtool: compile:  x86_64-pld-linux-g++ -DHAVE_CONFIG_H -I.. -I.. -DXSEC_BUILDING_LIBRARY -I/usr/include/nss -I/usr/include/nspr -Wall -O2 -fwrapv -pipe -Wformat -Werror=format-security -gdwarf-4 -fno-debug-types-section -fvar-tracking-assignments -g2 -Wp,-D_FORTIFY_SOURCE=2 -fstack-protector-strong --param=ssp-buffer-size=4 -Werror=trampolines -fPIC -march=x86-64 -mtune=generic -gdwarf-4 -fno-debug-types-section -fvar-tracking-assignments -g2 -DNDEBUG -MT xkms/impl/libxml_security_c_la-XKMSRegisterRequestImpl.lo -MD -MP -MF xkms/impl/.deps/libxml_security_c_la-XKMSRegisterRequestImpl.Tpo -c xkms/impl/XKMSRegisterRequestImpl.cpp  -fPIC -DPIC -o xkms/impl/.libs/libxml_security_c_la-XKMSRegisterRequestImpl.o
libtool: compile:  x86_64-pld-linux-g++ -DHAVE_CONFIG_H -I.. -I.. -DXSEC_BUILDING_LIBRARY -I/usr/include/nss -I/usr/include/nspr -Wall -O2 -fwrapv -pipe -Wformat -Werror=format-security -gdwarf-4 -fno-debug-types-section -fvar-tracking-assignments -g2 -Wp,-D_FORTIFY_SOURCE=2 -fstack-protector-strong --param=ssp-buffer-size=4 -Werror=trampolines -fPIC -march=x86-64 -mtune=generic -gdwarf-4 -fno-debug-types-section -fvar-tracking-assignments -g2 -DNDEBUG -MT xkms/impl/libxml_security_c_la-XKMSRegisterRequestImpl.lo -MD -MP -MF xkms/impl/.deps/libxml_security_c_la-XKMSRegisterRequestImpl.Tpo -c xkms/impl/XKMSRegisterRequestImpl.cpp -o xkms/impl/libxml_security_c_la-XKMSRegisterRequestImpl.o >/dev/null 2>&1
mv -f xkms/impl/.deps/libxml_security_c_la-XKMSRegisterRequestImpl.Tpo xkms/impl/.deps/libxml_security_c_la-XKMSRegisterRequestImpl.Plo
make[2]: Leaving directory '/tmp/B.ag6y_8zp/BUILD/xml-security-c-2.0.1/xsec'
make[2]: Entering directory '/tmp/B.ag6y_8zp/BUILD/xml-security-c-2.0.1/xsec'
/bin/sh ../libtool  --tag=CXX   --mode=compile x86_64-pld-linux-g++ -DHAVE_CONFIG_H   -I.. -I.. -DXSEC_BUILDING_LIBRARY     -I/usr/include/nss -I/usr/include/nspr -Wall -O2 -fwrapv -pipe -Wformat -Werror=format-security -gdwarf-4 -fno-debug-types-section -fvar-tracking-assignments -g2 -Wp,-D_FORTIFY_SOURCE=2 -fstack-protector-strong --param=ssp-buffer-size=4 -Werror=trampolines -fPIC -march=x86-64 -mtune=generic -gdwarf-4 -fno-debug-types-section -fvar-tracking-assignments -g2  -DNDEBUG  -MT xkms/impl/libxml_security_c_la-XKMSReissueKeyBindingImpl.lo -MD -MP -MF xkms/impl/.deps/libxml_security_c_la-XKMSReissueKeyBindingImpl.Tpo -c -o xkms/impl/libxml_security_c_la-XKMSReissueKeyBindingImpl.lo `test -f 'xkms/impl/XKMSReissueKeyBindingImpl.cpp' || echo './'`xkms/impl/XKMSReissueKeyBindingImpl.cpp
libtool: compile:  x86_64-pld-linux-g++ -DHAVE_CONFIG_H -I.. -I.. -DXSEC_BUILDING_LIBRARY -I/usr/include/nss -I/usr/include/nspr -Wall -O2 -fwrapv -pipe -Wformat -Werror=format-security -gdwarf-4 -fno-debug-types-section -fvar-tracking-assignments -g2 -Wp,-D_FORTIFY_SOURCE=2 -fstack-protector-strong --param=ssp-buffer-size=4 -Werror=trampolines -fPIC -march=x86-64 -mtune=generic -gdwarf-4 -fno-debug-types-section -fvar-tracking-assignments -g2 -DNDEBUG -MT xkms/impl/libxml_security_c_la-XKMSReissueKeyBindingImpl.lo -MD -MP -MF xkms/impl/.deps/libxml_security_c_la-XKMSReissueKeyBindingImpl.Tpo -c xkms/impl/XKMSReissueKeyBindingImpl.cpp  -fPIC -DPIC -o xkms/impl/.libs/libxml_security_c_la-XKMSReissueKeyBindingImpl.o
libtool: compile:  x86_64-pld-linux-g++ -DHAVE_CONFIG_H -I.. -I.. -DXSEC_BUILDING_LIBRARY -I/usr/include/nss -I/usr/include/nspr -Wall -O2 -fwrapv -pipe -Wformat -Werror=format-security -gdwarf-4 -fno-debug-types-section -fvar-tracking-assignments -g2 -Wp,-D_FORTIFY_SOURCE=2 -fstack-protector-strong --param=ssp-buffer-size=4 -Werror=trampolines -fPIC -march=x86-64 -mtune=generic -gdwarf-4 -fno-debug-types-section -fvar-tracking-assignments -g2 -DNDEBUG -MT xkms/impl/libxml_security_c_la-XKMSReissueKeyBindingImpl.lo -MD -MP -MF xkms/impl/.deps/libxml_security_c_la-XKMSReissueKeyBindingImpl.Tpo -c xkms/impl/XKMSReissueKeyBindingImpl.cpp -o xkms/impl/libxml_security_c_la-XKMSReissueKeyBindingImpl.o >/dev/null 2>&1
mv -f xkms/impl/.deps/libxml_security_c_la-XKMSReissueKeyBindingImpl.Tpo xkms/impl/.deps/libxml_security_c_la-XKMSReissueKeyBindingImpl.Plo
make[2]: Leaving directory '/tmp/B.ag6y_8zp/BUILD/xml-security-c-2.0.1/xsec'
make[2]: Entering directory '/tmp/B.ag6y_8zp/BUILD/xml-security-c-2.0.1/xsec'
/bin/sh ../libtool  --tag=CXX   --mode=compile x86_64-pld-linux-g++ -DHAVE_CONFIG_H   -I.. -I.. -DXSEC_BUILDING_LIBRARY     -I/usr/include/nss -I/usr/include/nspr -Wall -O2 -fwrapv -pipe -Wformat -Werror=format-security -gdwarf-4 -fno-debug-types-section -fvar-tracking-assignments -g2 -Wp,-D_FORTIFY_SOURCE=2 -fstack-protector-strong --param=ssp-buffer-size=4 -Werror=trampolines -fPIC -march=x86-64 -mtune=generic -gdwarf-4 -fno-debug-types-section -fvar-tracking-assignments -g2  -DNDEBUG  -MT xkms/impl/libxml_security_c_la-XKMSResponseMechanismImpl.lo -MD -MP -MF xkms/impl/.deps/libxml_security_c_la-XKMSResponseMechanismImpl.Tpo -c -o xkms/impl/libxml_security_c_la-XKMSResponseMechanismImpl.lo `test -f 'xkms/impl/XKMSResponseMechanismImpl.cpp' || echo './'`xkms/impl/XKMSResponseMechanismImpl.cpp
libtool: compile:  x86_64-pld-linux-g++ -DHAVE_CONFIG_H -I.. -I.. -DXSEC_BUILDING_LIBRARY -I/usr/include/nss -I/usr/include/nspr -Wall -O2 -fwrapv -pipe -Wformat -Werror=format-security -gdwarf-4 -fno-debug-types-section -fvar-tracking-assignments -g2 -Wp,-D_FORTIFY_SOURCE=2 -fstack-protector-strong --param=ssp-buffer-size=4 -Werror=trampolines -fPIC -march=x86-64 -mtune=generic -gdwarf-4 -fno-debug-types-section -fvar-tracking-assignments -g2 -DNDEBUG -MT xkms/impl/libxml_security_c_la-XKMSResponseMechanismImpl.lo -MD -MP -MF xkms/impl/.deps/libxml_security_c_la-XKMSResponseMechanismImpl.Tpo -c xkms/impl/XKMSResponseMechanismImpl.cpp  -fPIC -DPIC -o xkms/impl/.libs/libxml_security_c_la-XKMSResponseMechanismImpl.o
libtool: compile:  x86_64-pld-linux-g++ -DHAVE_CONFIG_H -I.. -I.. -DXSEC_BUILDING_LIBRARY -I/usr/include/nss -I/usr/include/nspr -Wall -O2 -fwrapv -pipe -Wformat -Werror=format-security -gdwarf-4 -fno-debug-types-section -fvar-tracking-assignments -g2 -Wp,-D_FORTIFY_SOURCE=2 -fstack-protector-strong --param=ssp-buffer-size=4 -Werror=trampolines -fPIC -march=x86-64 -mtune=generic -gdwarf-4 -fno-debug-types-section -fvar-tracking-assignments -g2 -DNDEBUG -MT xkms/impl/libxml_security_c_la-XKMSResponseMechanismImpl.lo -MD -MP -MF xkms/impl/.deps/libxml_security_c_la-XKMSResponseMechanismImpl.Tpo -c xkms/impl/XKMSResponseMechanismImpl.cpp -o xkms/impl/libxml_security_c_la-XKMSResponseMechanismImpl.o >/dev/null 2>&1
mv -f xkms/impl/.deps/libxml_security_c_la-XKMSResponseMechanismImpl.Tpo xkms/impl/.deps/libxml_security_c_la-XKMSResponseMechanismImpl.Plo
make[2]: Leaving directory '/tmp/B.ag6y_8zp/BUILD/xml-security-c-2.0.1/xsec'
make[2]: Entering directory '/tmp/B.ag6y_8zp/BUILD/xml-security-c-2.0.1/xsec'
/bin/sh ../libtool  --tag=CXX   --mode=compile x86_64-pld-linux-g++ -DHAVE_CONFIG_H   -I.. -I.. -DXSEC_BUILDING_LIBRARY     -I/usr/include/nss -I/usr/include/nspr -Wall -O2 -fwrapv -pipe -Wformat -Werror=format-security -gdwarf-4 -fno-debug-types-section -fvar-tracking-assignments -g2 -Wp,-D_FORTIFY_SOURCE=2 -fstack-protector-strong --param=ssp-buffer-size=4 -Werror=trampolines -fPIC -march=x86-64 -mtune=generic -gdwarf-4 -fno-debug-types-section -fvar-tracking-assignments -g2  -DNDEBUG  -MT enc/OpenSSL/libxml_security_c_la-OpenSSLCryptoKeyRSA.lo -MD -MP -MF enc/OpenSSL/.deps/libxml_security_c_la-OpenSSLCryptoKeyRSA.Tpo -c -o enc/OpenSSL/libxml_security_c_la-OpenSSLCryptoKeyRSA.lo `test -f 'enc/OpenSSL/OpenSSLCryptoKeyRSA.cpp' || echo './'`enc/OpenSSL/OpenSSLCryptoKeyRSA.cpp
libtool: compile:  x86_64-pld-linux-g++ -DHAVE_CONFIG_H -I.. -I.. -DXSEC_BUILDING_LIBRARY -I/usr/include/nss -I/usr/include/nspr -Wall -O2 -fwrapv -pipe -Wformat -Werror=format-security -gdwarf-4 -fno-debug-types-section -fvar-tracking-assignments -g2 -Wp,-D_FORTIFY_SOURCE=2 -fstack-protector-strong --param=ssp-buffer-size=4 -Werror=trampolines -fPIC -march=x86-64 -mtune=generic -gdwarf-4 -fno-debug-types-section -fvar-tracking-assignments -g2 -DNDEBUG -MT enc/OpenSSL/libxml_security_c_la-OpenSSLCryptoKeyRSA.lo -MD -MP -MF enc/OpenSSL/.deps/libxml_security_c_la-OpenSSLCryptoKeyRSA.Tpo -c enc/OpenSSL/OpenSSLCryptoKeyRSA.cpp  -fPIC -DPIC -o enc/OpenSSL/.libs/libxml_security_c_la-OpenSSLCryptoKeyRSA.o
enc/OpenSSL/OpenSSLCryptoKeyRSA.cpp: In function 'int {anonymous}::MGF1(unsigned char*, long int, const unsigned char*, long int, const EVP_MD*)':
enc/OpenSSL/OpenSSLCryptoKeyRSA.cpp:108:26: warning: 'int PKCS1_MGF1(unsigned char*, long int, const unsigned char*, long int, const EVP_MD*)' is deprecated: Since OpenSSL 3.0 [-Wdeprecated-declarations]
  108 |         return PKCS1_MGF1(mask, len, seed, seedlen, digest);
      |                ~~~~~~~~~~^~~~~~~~~~~~~~~~~~~~~~~~~~~~~~~~~~
In file included from ../xsec/enc/OpenSSL/OpenSSLSupport.hpp:25,
                 from ../xsec/enc/OpenSSL/OpenSSLCryptoBase64.hpp:36,
                 from enc/OpenSSL/OpenSSLCryptoKeyRSA.cpp:35:
/usr/include/openssl/rsa.h:389:27: note: declared here
  389 | OSSL_DEPRECATEDIN_3_0 int PKCS1_MGF1(unsigned char *mask, long len,
      |                           ^~~~~~~~~~
enc/OpenSSL/OpenSSLCryptoKeyRSA.cpp: In destructor 'virtual OpenSSLCryptoKeyRSA::~OpenSSLCryptoKeyRSA()':
enc/OpenSSL/OpenSSLCryptoKeyRSA.cpp:304:17: warning: 'void RSA_free(RSA*)' is deprecated: Since OpenSSL 3.0 [-Wdeprecated-declarations]
  304 |         RSA_free(mp_rsaKey);
      |         ~~~~~~~~^~~~~~~~~~~
In file included from ../xsec/enc/OpenSSL/OpenSSLSupport.hpp:25,
                 from ../xsec/enc/OpenSSL/OpenSSLCryptoBase64.hpp:36,
                 from enc/OpenSSL/OpenSSLCryptoKeyRSA.cpp:35:
/usr/include/openssl/rsa.h:293:28: note: declared here
  293 | OSSL_DEPRECATEDIN_3_0 void RSA_free(RSA *r);
      |                            ^~~~~~~~
enc/OpenSSL/OpenSSLCryptoKeyRSA.cpp: In member function 'virtual XSECCryptoKey::KeyType OpenSSLCryptoKeyRSA::getKeyType() const':
enc/OpenSSL/OpenSSLCryptoKeyRSA.cpp:327:17: warning: 'void RSA_get0_key(const RSA*, const BIGNUM**, const BIGNUM**, const BIGNUM**)' is deprecated: Since OpenSSL 3.0 [-Wdeprecated-declarations]
  327 |     RSA_get0_key(mp_rsaKey, &n, NULL, &d);
      |     ~~~~~~~~~~~~^~~~~~~~~~~~~~~~~~~~~~~~~
In file included from ../xsec/enc/OpenSSL/OpenSSLSupport.hpp:25,
                 from ../xsec/enc/OpenSSL/OpenSSLCryptoBase64.hpp:36,
                 from enc/OpenSSL/OpenSSLCryptoKeyRSA.cpp:35:
/usr/include/openssl/rsa.h:217:28: note: declared here
  217 | OSSL_DEPRECATEDIN_3_0 void RSA_get0_key(const RSA *r,
      |                            ^~~~~~~~~~~~
enc/OpenSSL/OpenSSLCryptoKeyRSA.cpp: In member function 'void OpenSSLCryptoKeyRSA::setNBase(BIGNUM*)':
enc/OpenSSL/OpenSSLCryptoKeyRSA.cpp:348:28: warning: 'RSA* RSA_new()' is deprecated: Since OpenSSL 3.0 [-Wdeprecated-declarations]
  348 |         mp_rsaKey = RSA_new();
      |                     ~~~~~~~^~
In file included from ../xsec/enc/OpenSSL/OpenSSLSupport.hpp:25,
                 from ../xsec/enc/OpenSSL/OpenSSLCryptoBase64.hpp:36,
                 from enc/OpenSSL/OpenSSLCryptoKeyRSA.cpp:35:
/usr/include/openssl/rsa.h:201:28: note: declared here
  201 | OSSL_DEPRECATEDIN_3_0 RSA *RSA_new(void);
      |                            ^~~~~~~
enc/OpenSSL/OpenSSLCryptoKeyRSA.cpp: In member function 'void OpenSSLCryptoKeyRSA::setEBase(BIGNUM*)':
enc/OpenSSL/OpenSSLCryptoKeyRSA.cpp:373:28: warning: 'RSA* RSA_new()' is deprecated: Since OpenSSL 3.0 [-Wdeprecated-declarations]
  373 |         mp_rsaKey = RSA_new();
      |                     ~~~~~~~^~
In file included from ../xsec/enc/OpenSSL/OpenSSLSupport.hpp:25,
                 from ../xsec/enc/OpenSSL/OpenSSLCryptoBase64.hpp:36,
                 from enc/OpenSSL/OpenSSLCryptoKeyRSA.cpp:35:
/usr/include/openssl/rsa.h:201:28: note: declared here
  201 | OSSL_DEPRECATEDIN_3_0 RSA *RSA_new(void);
      |                            ^~~~~~~
enc/OpenSSL/OpenSSLCryptoKeyRSA.cpp: In member function 'void OpenSSLCryptoKeyRSA::commitEN()':
enc/OpenSSL/OpenSSLCryptoKeyRSA.cpp:394:17: warning: 'int RSA_set0_key(RSA*, BIGNUM*, BIGNUM*, BIGNUM*)' is deprecated: Since OpenSSL 3.0 [-Wdeprecated-declarations]
  394 |     RSA_set0_key(mp_rsaKey, mp_accumN, mp_accumE, NULL);
      |     ~~~~~~~~~~~~^~~~~~~~~~~~~~~~~~~~~~~~~~~~~~~~~~~~~~~
In file included from ../xsec/enc/OpenSSL/OpenSSLSupport.hpp:25,
                 from ../xsec/enc/OpenSSL/OpenSSLCryptoBase64.hpp:36,
                 from enc/OpenSSL/OpenSSLCryptoKeyRSA.cpp:35:
/usr/include/openssl/rsa.h:207:27: note: declared here
  207 | OSSL_DEPRECATEDIN_3_0 int RSA_set0_key(RSA *r, BIGNUM *n, BIGNUM *e, BIGNUM *d);
      |                           ^~~~~~~~~~~~
enc/OpenSSL/OpenSSLCryptoKeyRSA.cpp: In constructor 'OpenSSLCryptoKeyRSA::OpenSSLCryptoKeyRSA(EVP_PKEY*)':
enc/OpenSSL/OpenSSLCryptoKeyRSA.cpp:411:24: warning: 'RSA* RSA_new()' is deprecated: Since OpenSSL 3.0 [-Wdeprecated-declarations]
  411 |     mp_rsaKey = RSA_new();
      |                 ~~~~~~~^~
In file included from ../xsec/enc/OpenSSL/OpenSSLSupport.hpp:25,
                 from ../xsec/enc/OpenSSL/OpenSSLCryptoBase64.hpp:36,
                 from enc/OpenSSL/OpenSSLCryptoKeyRSA.cpp:35:
/usr/include/openssl/rsa.h:201:28: note: declared here
  201 | OSSL_DEPRECATEDIN_3_0 RSA *RSA_new(void);
      |                            ^~~~~~~
enc/OpenSSL/OpenSSLCryptoKeyRSA.cpp:416:33: warning: 'const rsa_st* EVP_PKEY_get0_RSA(const EVP_PKEY*)' is deprecated: Since OpenSSL 3.0 [-Wdeprecated-declarations]
  416 |     RSA *rsa = EVP_PKEY_get0_RSA(k);
      |                ~~~~~~~~~~~~~~~~~^~~
In file included from ../xsec/enc/OpenSSL/OpenSSLCryptoKeyRSA.hpp:37,
                 from enc/OpenSSL/OpenSSLCryptoKeyRSA.cpp:34:
/usr/include/openssl/evp.h:1346:22: note: declared here
 1346 | const struct rsa_st *EVP_PKEY_get0_RSA(const EVP_PKEY *pkey);
      |                      ^~~~~~~~~~~~~~~~~
enc/OpenSSL/OpenSSLCryptoKeyRSA.cpp:416:33: error: invalid conversion from 'const rsa_st*' to 'RSA*' {aka 'rsa_st*'} [-fpermissive]
  416 |     RSA *rsa = EVP_PKEY_get0_RSA(k);
      |                ~~~~~~~~~~~~~~~~~^~~
      |                                 |
      |                                 const rsa_st*
enc/OpenSSL/OpenSSLCryptoKeyRSA.cpp:419:17: warning: 'void RSA_get0_key(const RSA*, const BIGNUM**, const BIGNUM**, const BIGNUM**)' is deprecated: Since OpenSSL 3.0 [-Wdeprecated-declarations]
  419 |     RSA_get0_key(rsa, &n, &e, &d);
      |     ~~~~~~~~~~~~^~~~~~~~~~~~~~~~~
In file included from ../xsec/enc/OpenSSL/OpenSSLSupport.hpp:25,
                 from ../xsec/enc/OpenSSL/OpenSSLCryptoBase64.hpp:36,
                 from enc/OpenSSL/OpenSSLCryptoKeyRSA.cpp:35:
/usr/include/openssl/rsa.h:217:28: note: declared here
  217 | OSSL_DEPRECATEDIN_3_0 void RSA_get0_key(const RSA *r,
      |                            ^~~~~~~~~~~~
enc/OpenSSL/OpenSSLCryptoKeyRSA.cpp:421:21: warning: 'int RSA_set0_key(RSA*, BIGNUM*, BIGNUM*, BIGNUM*)' is deprecated: Since OpenSSL 3.0 [-Wdeprecated-declarations]
  421 |         RSA_set0_key(mp_rsaKey, DUP_NON_NULL(n), DUP_NON_NULL(e), DUP_NON_NULL(d));
      |         ~~~~~~~~~~~~^~~~~~~~~~~~~~~~~~~~~~~~~~~~~~~~~~~~~~~~~~~~~~~~~~~~~~~~~~~~~~
In file included from ../xsec/enc/OpenSSL/OpenSSLSupport.hpp:25,
                 from ../xsec/enc/OpenSSL/OpenSSLCryptoBase64.hpp:36,
                 from enc/OpenSSL/OpenSSLCryptoKeyRSA.cpp:35:
/usr/include/openssl/rsa.h:207:27: note: declared here
  207 | OSSL_DEPRECATEDIN_3_0 int RSA_set0_key(RSA *r, BIGNUM *n, BIGNUM *e, BIGNUM *d);
      |                           ^~~~~~~~~~~~
enc/OpenSSL/OpenSSLCryptoKeyRSA.cpp:424:21: warning: 'void RSA_get0_factors(const RSA*, const BIGNUM**, const BIGNUM**)' is deprecated: Since OpenSSL 3.0 [-Wdeprecated-declarations]
  424 |     RSA_get0_factors(rsa, &p, &q);
      |     ~~~~~~~~~~~~~~~~^~~~~~~~~~~~~
In file included from ../xsec/enc/OpenSSL/OpenSSLSupport.hpp:25,
                 from ../xsec/enc/OpenSSL/OpenSSLCryptoBase64.hpp:36,
                 from enc/OpenSSL/OpenSSLCryptoKeyRSA.cpp:35:
/usr/include/openssl/rsa.h:220:28: note: declared here
  220 | OSSL_DEPRECATEDIN_3_0 void RSA_get0_factors(const RSA *r,
      |                            ^~~~~~~~~~~~~~~~
enc/OpenSSL/OpenSSLCryptoKeyRSA.cpp:426:25: warning: 'int RSA_set0_factors(RSA*, BIGNUM*, BIGNUM*)' is deprecated: Since OpenSSL 3.0 [-Wdeprecated-declarations]
  426 |         RSA_set0_factors(mp_rsaKey, DUP_NON_NULL(p), DUP_NON_NULL(q));
      |         ~~~~~~~~~~~~~~~~^~~~~~~~~~~~~~~~~~~~~~~~~~~~~~~~~~~~~~~~~~~~~
In file included from ../xsec/enc/OpenSSL/OpenSSLSupport.hpp:25,
                 from ../xsec/enc/OpenSSL/OpenSSLCryptoBase64.hpp:36,
                 from enc/OpenSSL/OpenSSLCryptoKeyRSA.cpp:35:
/usr/include/openssl/rsa.h:208:27: note: declared here
  208 | OSSL_DEPRECATEDIN_3_0 int RSA_set0_factors(RSA *r, BIGNUM *p, BIGNUM *q);
      |                           ^~~~~~~~~~~~~~~~
enc/OpenSSL/OpenSSLCryptoKeyRSA.cpp:429:24: warning: 'void RSA_get0_crt_params(const RSA*, const BIGNUM**, const BIGNUM**, const BIGNUM**)' is deprecated: Since OpenSSL 3.0 [-Wdeprecated-declarations]
  429 |     RSA_get0_crt_params(rsa, &dmp1, &dmq1, &iqmp);
      |     ~~~~~~~~~~~~~~~~~~~^~~~~~~~~~~~~~~~~~~~~~~~~~
In file included from ../xsec/enc/OpenSSL/OpenSSLSupport.hpp:25,
                 from ../xsec/enc/OpenSSL/OpenSSLCryptoBase64.hpp:36,
                 from enc/OpenSSL/OpenSSLCryptoKeyRSA.cpp:35:
/usr/include/openssl/rsa.h:225:28: note: declared here
  225 | OSSL_DEPRECATEDIN_3_0 void RSA_get0_crt_params(const RSA *r,
      |                            ^~~~~~~~~~~~~~~~~~~
enc/OpenSSL/OpenSSLCryptoKeyRSA.cpp:431:28: warning: 'int RSA_set0_crt_params(RSA*, BIGNUM*, BIGNUM*, BIGNUM*)' is deprecated: Since OpenSSL 3.0 [-Wdeprecated-declarations]
  431 |         RSA_set0_crt_params(mp_rsaKey, DUP_NON_NULL(dmp1), DUP_NON_NULL(dmq1), DUP_NON_NULL(iqmp));
      |         ~~~~~~~~~~~~~~~~~~~^~~~~~~~~~~~~~~~~~~~~~~~~~~~~~~~~~~~~~~~~~~~~~~~~~~~~~~~~~~~~~~~~~~~~~~
In file included from ../xsec/enc/OpenSSL/OpenSSLSupport.hpp:25,
                 from ../xsec/enc/OpenSSL/OpenSSLCryptoBase64.hpp:36,
                 from enc/OpenSSL/OpenSSLCryptoKeyRSA.cpp:35:
/usr/include/openssl/rsa.h:209:27: note: declared here
  209 | OSSL_DEPRECATEDIN_3_0 int RSA_set0_crt_params(RSA *r,
      |                           ^~~~~~~~~~~~~~~~~~~
enc/OpenSSL/OpenSSLCryptoKeyRSA.cpp: In member function 'virtual bool OpenSSLCryptoKeyRSA::verifySHA1PKCS1Base64Signature(const unsigned char*, unsigned int, const char*, unsigned int, XSECCryptoHash::HashType) const':
enc/OpenSSL/OpenSSLCryptoKeyRSA.cpp:491:27: warning: 'int RSA_size(const RSA*)' is deprecated: Since OpenSSL 3.0 [-Wdeprecated-declarations]
  491 |     int keySize = RSA_size(mp_rsaKey);
      |                   ~~~~~~~~^~~~~~~~~~~
In file included from ../xsec/enc/OpenSSL/OpenSSLSupport.hpp:25,
                 from ../xsec/enc/OpenSSL/OpenSSLCryptoBase64.hpp:36,
                 from enc/OpenSSL/OpenSSLCryptoKeyRSA.cpp:35:
/usr/include/openssl/rsa.h:204:27: note: declared here
  204 | OSSL_DEPRECATEDIN_3_0 int RSA_size(const RSA *rsa);
      |                           ^~~~~~~~
enc/OpenSSL/OpenSSLCryptoKeyRSA.cpp:502:44: warning: 'int RSA_size(const RSA*)' is deprecated: Since OpenSSL 3.0 [-Wdeprecated-declarations]
  502 |     decryptBuf = new unsigned char[RSA_size(mp_rsaKey)];
      |                                    ~~~~~~~~^~~~~~~~~~~
In file included from ../xsec/enc/OpenSSL/OpenSSLSupport.hpp:25,
                 from ../xsec/enc/OpenSSL/OpenSSLCryptoBase64.hpp:36,
                 from enc/OpenSSL/OpenSSLCryptoKeyRSA.cpp:35:
/usr/include/openssl/rsa.h:204:27: note: declared here
  204 | OSSL_DEPRECATEDIN_3_0 int RSA_size(const RSA *rsa);
      |                           ^~~~~~~~
enc/OpenSSL/OpenSSLCryptoKeyRSA.cpp:512:41: warning: 'int RSA_public_decrypt(int, const unsigned char*, unsigned char*, RSA*, int)' is deprecated: Since OpenSSL 3.0 [-Wdeprecated-declarations]
  512 |     int decryptSize = RSA_public_decrypt(sigValLen,
      |                       ~~~~~~~~~~~~~~~~~~^~~~~~~~~~~
  513 |                                              sigVal,
      |                                              ~~~~~~~
  514 |                                              decryptBuf,
      |                                              ~~~~~~~~~~~
  515 |                                              mp_rsaKey,
      |                                              ~~~~~~~~~~
  516 |                                              RSA_PKCS1_PADDING);
      |                                              ~~~~~~~~~~~~~~~~~~
In file included from ../xsec/enc/OpenSSL/OpenSSLSupport.hpp:25,
                 from ../xsec/enc/OpenSSL/OpenSSLCryptoBase64.hpp:36,
                 from enc/OpenSSL/OpenSSLCryptoKeyRSA.cpp:35:
/usr/include/openssl/rsa.h:288:5: note: declared here
  288 | int RSA_public_decrypt(int flen, const unsigned char *from, unsigned char *to,
      |     ^~~~~~~~~~~~~~~~~~
enc/OpenSSL/OpenSSLCryptoKeyRSA.cpp: In member function 'virtual unsigned int OpenSSLCryptoKeyRSA::signSHA1PKCS1Base64Signature(unsigned char*, unsigned int, char*, unsigned int, XSECCryptoHash::HashType) const':
enc/OpenSSL/OpenSSLCryptoKeyRSA.cpp:594:44: warning: 'int RSA_size(const RSA*)' is deprecated: Since OpenSSL 3.0 [-Wdeprecated-declarations]
  594 |     encryptBuf = new unsigned char[RSA_size(mp_rsaKey)];
      |                                    ~~~~~~~~^~~~~~~~~~~
In file included from ../xsec/enc/OpenSSL/OpenSSLSupport.hpp:25,
                 from ../xsec/enc/OpenSSL/OpenSSLCryptoBase64.hpp:36,
                 from enc/OpenSSL/OpenSSLCryptoKeyRSA.cpp:35:
/usr/include/openssl/rsa.h:204:27: note: declared here
  204 | OSSL_DEPRECATEDIN_3_0 int RSA_size(const RSA *rsa);
      |                           ^~~~~~~~
enc/OpenSSL/OpenSSLCryptoKeyRSA.cpp:601:37: warning: 'int RSA_private_encrypt(int, const unsigned char*, unsigned char*, RSA*, int)' is deprecated: Since OpenSSL 3.0 [-Wdeprecated-declarations]
  601 |     encryptLen = RSA_private_encrypt(preEncryptLen,
      |                  ~~~~~~~~~~~~~~~~~~~^~~~~~~~~~~~~~~
  602 |                                      preEncryptBuf,
      |                                      ~~~~~~~~~~~~~~
  603 |                                      encryptBuf,
      |                                      ~~~~~~~~~~~
  604 |                                      mp_rsaKey,
      |                                      ~~~~~~~~~~
  605 |                                      RSA_PKCS1_PADDING);
      |                                      ~~~~~~~~~~~~~~~~~~
In file included from ../xsec/enc/OpenSSL/OpenSSLSupport.hpp:25,
                 from ../xsec/enc/OpenSSL/OpenSSLCryptoBase64.hpp:36,
                 from enc/OpenSSL/OpenSSLCryptoKeyRSA.cpp:35:
/usr/include/openssl/rsa.h:285:5: note: declared here
  285 | int RSA_private_encrypt(int flen, const unsigned char *from, unsigned char *to,
      |     ^~~~~~~~~~~~~~~~~~~
enc/OpenSSL/OpenSSLCryptoKeyRSA.cpp: In member function 'virtual unsigned int OpenSSLCryptoKeyRSA::privateDecrypt(const unsigned char*, unsigned char*, unsigned int, unsigned int, XSECCryptoKeyRSA::PaddingType, const XMLCh*, const XMLCh*, unsigned char*, unsigned int) const':
enc/OpenSSL/OpenSSLCryptoKeyRSA.cpp:682:42: warning: 'int RSA_private_decrypt(int, const unsigned char*, unsigned char*, RSA*, int)' is deprecated: Since OpenSSL 3.0 [-Wdeprecated-declarations]
  682 |         decryptSize = RSA_private_decrypt(inLength,
      |                       ~~~~~~~~~~~~~~~~~~~^~~~~~~~~~
  683 | #if defined(XSEC_OPENSSL_CONST_BUFFERS)
      | ~~~~~~~~~~~~~~~~~~~~~~~~~~~~~~~~~~~~~~~   
  684 |                             inBuf,
      |                             ~~~~~~        
  685 | #else
      | ~~~~~                                     
  686 |                             (unsigned char *) inBuf,
      |                             ~~~~~~~~~~~~~~~~~~~~~~~~
  687 | #endif
      | ~~~~~~                                    
  688 |                             plainBuf,
      |                             ~~~~~~~~~     
  689 |                             mp_rsaKey,
      |                             ~~~~~~~~~~    
  690 |                             RSA_PKCS1_PADDING);
      |                             ~~~~~~~~~~~~~~~~~~
In file included from ../xsec/enc/OpenSSL/OpenSSLSupport.hpp:25,
                 from ../xsec/enc/OpenSSL/OpenSSLCryptoBase64.hpp:36,
                 from enc/OpenSSL/OpenSSLCryptoKeyRSA.cpp:35:
/usr/include/openssl/rsa.h:291:5: note: declared here
  291 | int RSA_private_decrypt(int flen, const unsigned char *from, unsigned char *to,
      |     ^~~~~~~~~~~~~~~~~~~
enc/OpenSSL/OpenSSLCryptoKeyRSA.cpp:715:31: warning: 'int RSA_size(const RSA*)' is deprecated: Since OpenSSL 3.0 [-Wdeprecated-declarations]
  715 |             int num = RSA_size(mp_rsaKey);
      |                       ~~~~~~~~^~~~~~~~~~~
In file included from ../xsec/enc/OpenSSL/OpenSSLSupport.hpp:25,
                 from ../xsec/enc/OpenSSL/OpenSSLCryptoBase64.hpp:36,
                 from enc/OpenSSL/OpenSSLCryptoKeyRSA.cpp:35:
/usr/include/openssl/rsa.h:204:27: note: declared here
  204 | OSSL_DEPRECATEDIN_3_0 int RSA_size(const RSA *rsa);
      |                           ^~~~~~~~
enc/OpenSSL/OpenSSLCryptoKeyRSA.cpp:719:46: warning: 'int RSA_private_decrypt(int, const unsigned char*, unsigned char*, RSA*, int)' is deprecated: Since OpenSSL 3.0 [-Wdeprecated-declarations]
  719 |             decryptSize = RSA_private_decrypt(inLength,
      |                           ~~~~~~~~~~~~~~~~~~~^~~~~~~~~~
  720 | #if defined(XSEC_OPENSSL_CONST_BUFFERS)
      | ~~~~~~~~~~~~~~~~~~~~~~~~~~~~~~~~~~~~~~~       
  721 |                                 inBuf,
      |                                 ~~~~~~        
  722 | #else
      | ~~~~~                                         
  723 |                                 (unsigned char *) inBuf,
      |                                 ~~~~~~~~~~~~~~~~~~~~~~~~
  724 | #endif
      | ~~~~~~                                        
  725 |                                 tBuf,
      |                                 ~~~~~         
  726 |                                 mp_rsaKey,
      |                                 ~~~~~~~~~~    
  727 |                                 RSA_NO_PADDING);
      |                                 ~~~~~~~~~~~~~~~
In file included from ../xsec/enc/OpenSSL/OpenSSLSupport.hpp:25,
                 from ../xsec/enc/OpenSSL/OpenSSLCryptoBase64.hpp:36,
                 from enc/OpenSSL/OpenSSLCryptoKeyRSA.cpp:35:
/usr/include/openssl/rsa.h:291:5: note: declared here
  291 | int RSA_private_decrypt(int flen, const unsigned char *from, unsigned char *to,
      |     ^~~~~~~~~~~~~~~~~~~
enc/OpenSSL/OpenSSLCryptoKeyRSA.cpp: In member function 'virtual unsigned int OpenSSLCryptoKeyRSA::publicEncrypt(const unsigned char*, unsigned char*, unsigned int, unsigned int, XSECCryptoKeyRSA::PaddingType, const XMLCh*, const XMLCh*, unsigned char*, unsigned int) const':
enc/OpenSSL/OpenSSLCryptoKeyRSA.cpp:803:41: warning: 'int RSA_public_encrypt(int, const unsigned char*, unsigned char*, RSA*, int)' is deprecated: Since OpenSSL 3.0 [-Wdeprecated-declarations]
  803 |         encryptSize = RSA_public_encrypt(inLength,
      |                       ~~~~~~~~~~~~~~~~~~^~~~~~~~~~
  804 | #if defined(XSEC_OPENSSL_CONST_BUFFERS)
      | ~~~~~~~~~~~~~~~~~~~~~~~~~~~~~~~~~~~~~~~  
  805 |                             inBuf,
      |                             ~~~~~~       
  806 | #else
      | ~~~~~                                    
  807 |                             (unsigned char *) inBuf,
      |                             ~~~~~~~~~~~~~~~~~~~~~~~~
  808 | #endif
      | ~~~~~~                                   
  809 |                             cipherBuf,
      |                             ~~~~~~~~~~   
  810 |                             mp_rsaKey,
      |                             ~~~~~~~~~~   
  811 |                             RSA_PKCS1_PADDING);
      |                             ~~~~~~~~~~~~~~~~~~
In file included from ../xsec/enc/OpenSSL/OpenSSLSupport.hpp:25,
                 from ../xsec/enc/OpenSSL/OpenSSLCryptoBase64.hpp:36,
                 from enc/OpenSSL/OpenSSLCryptoKeyRSA.cpp:35:
/usr/include/openssl/rsa.h:282:5: note: declared here
  282 | int RSA_public_encrypt(int flen, const unsigned char *from, unsigned char *to,
      |     ^~~~~~~~~~~~~~~~~~
enc/OpenSSL/OpenSSLCryptoKeyRSA.cpp:823:40: warning: 'int RSA_size(const RSA*)' is deprecated: Since OpenSSL 3.0 [-Wdeprecated-declarations]
  823 |             unsigned int num = RSA_size(mp_rsaKey);
      |                                ~~~~~~~~^~~~~~~~~~~
In file included from ../xsec/enc/OpenSSL/OpenSSLSupport.hpp:25,
                 from ../xsec/enc/OpenSSL/OpenSSLCryptoBase64.hpp:36,
                 from enc/OpenSSL/OpenSSLCryptoKeyRSA.cpp:35:
/usr/include/openssl/rsa.h:204:27: note: declared here
  204 | OSSL_DEPRECATEDIN_3_0 int RSA_size(const RSA *rsa);
      |                           ^~~~~~~~
enc/OpenSSL/OpenSSLCryptoKeyRSA.cpp:864:45: warning: 'int RSA_public_encrypt(int, const unsigned char*, unsigned char*, RSA*, int)' is deprecated: Since OpenSSL 3.0 [-Wdeprecated-declarations]
  864 |             encryptSize = RSA_public_encrypt(num,
      |                           ~~~~~~~~~~~~~~~~~~^~~~~
  865 |                                 tBuf,
      |                                 ~~~~~        
  866 |                                 cipherBuf,
      |                                 ~~~~~~~~~~   
  867 |                                 mp_rsaKey,
      |                                 ~~~~~~~~~~   
  868 |                                 RSA_NO_PADDING);
      |                                 ~~~~~~~~~~~~~~~
In file included from ../xsec/enc/OpenSSL/OpenSSLSupport.hpp:25,
                 from ../xsec/enc/OpenSSL/OpenSSLCryptoBase64.hpp:36,
                 from enc/OpenSSL/OpenSSLCryptoKeyRSA.cpp:35:
/usr/include/openssl/rsa.h:282:5: note: declared here
  282 | int RSA_public_encrypt(int flen, const unsigned char *from, unsigned char *to,
      |     ^~~~~~~~~~~~~~~~~~
enc/OpenSSL/OpenSSLCryptoKeyRSA.cpp: In member function 'virtual unsigned int OpenSSLCryptoKeyRSA::getLength() const':
enc/OpenSSL/OpenSSLCryptoKeyRSA.cpp:891:24: warning: 'int RSA_size(const RSA*)' is deprecated: Since OpenSSL 3.0 [-Wdeprecated-declarations]
  891 |         return RSA_size(mp_rsaKey);
      |                ~~~~~~~~^~~~~~~~~~~
In file included from ../xsec/enc/OpenSSL/OpenSSLSupport.hpp:25,
                 from ../xsec/enc/OpenSSL/OpenSSLCryptoBase64.hpp:36,
                 from enc/OpenSSL/OpenSSLCryptoKeyRSA.cpp:35:
/usr/include/openssl/rsa.h:204:27: note: declared here
  204 | OSSL_DEPRECATEDIN_3_0 int RSA_size(const RSA *rsa);
      |                           ^~~~~~~~
enc/OpenSSL/OpenSSLCryptoKeyRSA.cpp: In member function 'virtual XSECCryptoKey* OpenSSLCryptoKeyRSA::clone() const':
enc/OpenSSL/OpenSSLCryptoKeyRSA.cpp:906:29: warning: 'RSA* RSA_new()' is deprecated: Since OpenSSL 3.0 [-Wdeprecated-declarations]
  906 |     ret->mp_rsaKey = RSA_new();
      |                      ~~~~~~~^~
In file included from ../xsec/enc/OpenSSL/OpenSSLSupport.hpp:25,
                 from ../xsec/enc/OpenSSL/OpenSSLCryptoBase64.hpp:36,
                 from enc/OpenSSL/OpenSSLCryptoKeyRSA.cpp:35:
/usr/include/openssl/rsa.h:201:28: note: declared here
  201 | OSSL_DEPRECATEDIN_3_0 RSA *RSA_new(void);
      |                            ^~~~~~~
enc/OpenSSL/OpenSSLCryptoKeyRSA.cpp:910:17: warning: 'void RSA_get0_key(const RSA*, const BIGNUM**, const BIGNUM**, const BIGNUM**)' is deprecated: Since OpenSSL 3.0 [-Wdeprecated-declarations]
  910 |     RSA_get0_key(mp_rsaKey, &n, &e, &d);
      |     ~~~~~~~~~~~~^~~~~~~~~~~~~~~~~~~~~~~
In file included from ../xsec/enc/OpenSSL/OpenSSLSupport.hpp:25,
                 from ../xsec/enc/OpenSSL/OpenSSLCryptoBase64.hpp:36,
                 from enc/OpenSSL/OpenSSLCryptoKeyRSA.cpp:35:
/usr/include/openssl/rsa.h:217:28: note: declared here
  217 | OSSL_DEPRECATEDIN_3_0 void RSA_get0_key(const RSA *r,
      |                            ^~~~~~~~~~~~
enc/OpenSSL/OpenSSLCryptoKeyRSA.cpp:912:21: warning: 'int RSA_set0_key(RSA*, BIGNUM*, BIGNUM*, BIGNUM*)' is deprecated: Since OpenSSL 3.0 [-Wdeprecated-declarations]
  912 |         RSA_set0_key(ret->mp_rsaKey, DUP_NON_NULL(n), DUP_NON_NULL(e), DUP_NON_NULL(d));
      |         ~~~~~~~~~~~~^~~~~~~~~~~~~~~~~~~~~~~~~~~~~~~~~~~~~~~~~~~~~~~~~~~~~~~~~~~~~~~~~~~
In file included from ../xsec/enc/OpenSSL/OpenSSLSupport.hpp:25,
                 from ../xsec/enc/OpenSSL/OpenSSLCryptoBase64.hpp:36,
                 from enc/OpenSSL/OpenSSLCryptoKeyRSA.cpp:35:
/usr/include/openssl/rsa.h:207:27: note: declared here
  207 | OSSL_DEPRECATEDIN_3_0 int RSA_set0_key(RSA *r, BIGNUM *n, BIGNUM *e, BIGNUM *d);
      |                           ^~~~~~~~~~~~
enc/OpenSSL/OpenSSLCryptoKeyRSA.cpp:915:21: warning: 'void RSA_get0_factors(const RSA*, const BIGNUM**, const BIGNUM**)' is deprecated: Since OpenSSL 3.0 [-Wdeprecated-declarations]
  915 |     RSA_get0_factors(mp_rsaKey, &p, &q);
      |     ~~~~~~~~~~~~~~~~^~~~~~~~~~~~~~~~~~~
In file included from ../xsec/enc/OpenSSL/OpenSSLSupport.hpp:25,
                 from ../xsec/enc/OpenSSL/OpenSSLCryptoBase64.hpp:36,
                 from enc/OpenSSL/OpenSSLCryptoKeyRSA.cpp:35:
/usr/include/openssl/rsa.h:220:28: note: declared here
  220 | OSSL_DEPRECATEDIN_3_0 void RSA_get0_factors(const RSA *r,
      |                            ^~~~~~~~~~~~~~~~
enc/OpenSSL/OpenSSLCryptoKeyRSA.cpp:917:25: warning: 'int RSA_set0_factors(RSA*, BIGNUM*, BIGNUM*)' is deprecated: Since OpenSSL 3.0 [-Wdeprecated-declarations]
  917 |         RSA_set0_factors(ret->mp_rsaKey, DUP_NON_NULL(p), DUP_NON_NULL(q));
      |         ~~~~~~~~~~~~~~~~^~~~~~~~~~~~~~~~~~~~~~~~~~~~~~~~~~~~~~~~~~~~~~~~~~
In file included from ../xsec/enc/OpenSSL/OpenSSLSupport.hpp:25,
                 from ../xsec/enc/OpenSSL/OpenSSLCryptoBase64.hpp:36,
                 from enc/OpenSSL/OpenSSLCryptoKeyRSA.cpp:35:
/usr/include/openssl/rsa.h:208:27: note: declared here
  208 | OSSL_DEPRECATEDIN_3_0 int RSA_set0_factors(RSA *r, BIGNUM *p, BIGNUM *q);
      |                           ^~~~~~~~~~~~~~~~
enc/OpenSSL/OpenSSLCryptoKeyRSA.cpp:920:24: warning: 'void RSA_get0_crt_params(const RSA*, const BIGNUM**, const BIGNUM**, const BIGNUM**)' is deprecated: Since OpenSSL 3.0 [-Wdeprecated-declarations]
  920 |     RSA_get0_crt_params(mp_rsaKey, &dmp1, &dmq1, &iqmp);
      |     ~~~~~~~~~~~~~~~~~~~^~~~~~~~~~~~~~~~~~~~~~~~~~~~~~~~
In file included from ../xsec/enc/OpenSSL/OpenSSLSupport.hpp:25,
                 from ../xsec/enc/OpenSSL/OpenSSLCryptoBase64.hpp:36,
                 from enc/OpenSSL/OpenSSLCryptoKeyRSA.cpp:35:
/usr/include/openssl/rsa.h:225:28: note: declared here
  225 | OSSL_DEPRECATEDIN_3_0 void RSA_get0_crt_params(const RSA *r,
      |                            ^~~~~~~~~~~~~~~~~~~
enc/OpenSSL/OpenSSLCryptoKeyRSA.cpp:922:28: warning: 'int RSA_set0_crt_params(RSA*, BIGNUM*, BIGNUM*, BIGNUM*)' is deprecated: Since OpenSSL 3.0 [-Wdeprecated-declarations]
  922 |         RSA_set0_crt_params(ret->mp_rsaKey, DUP_NON_NULL(dmp1), DUP_NON_NULL(dmq1), DUP_NON_NULL(iqmp));
      |         ~~~~~~~~~~~~~~~~~~~^~~~~~~~~~~~~~~~~~~~~~~~~~~~~~~~~~~~~~~~~~~~~~~~~~~~~~~~~~~~~~~~~~~~~~~~~~~~
In file included from ../xsec/enc/OpenSSL/OpenSSLSupport.hpp:25,
                 from ../xsec/enc/OpenSSL/OpenSSLCryptoBase64.hpp:36,
                 from enc/OpenSSL/OpenSSLCryptoKeyRSA.cpp:35:
/usr/include/openssl/rsa.h:209:27: note: declared here
  209 | OSSL_DEPRECATEDIN_3_0 int RSA_set0_crt_params(RSA *r,
      |                           ^~~~~~~~~~~~~~~~~~~
make[2]: *** [Makefile:3312: enc/OpenSSL/libxml_security_c_la-OpenSSLCryptoKeyRSA.lo] Error 1
make[2]: Leaving directory '/tmp/B.ag6y_8zp/BUILD/xml-security-c-2.0.1/xsec'
make[2]: *** Waiting for unfinished jobs....
make[2]: Entering directory '/tmp/B.ag6y_8zp/BUILD/xml-security-c-2.0.1/xsec'
/bin/sh ../libtool  --tag=CXX   --mode=compile x86_64-pld-linux-g++ -DHAVE_CONFIG_H   -I.. -I.. -DXSEC_BUILDING_LIBRARY     -I/usr/include/nss -I/usr/include/nspr -Wall -O2 -fwrapv -pipe -Wformat -Werror=format-security -gdwarf-4 -fno-debug-types-section -fvar-tracking-assignments -g2 -Wp,-D_FORTIFY_SOURCE=2 -fstack-protector-strong --param=ssp-buffer-size=4 -Werror=trampolines -fPIC -march=x86-64 -mtune=generic -gdwarf-4 -fno-debug-types-section -fvar-tracking-assignments -g2  -DNDEBUG  -MT xkms/impl/libxml_security_c_la-XKMSNotBoundAuthentication.lo -MD -MP -MF xkms/impl/.deps/libxml_security_c_la-XKMSNotBoundAuthentication.Tpo -c -o xkms/impl/libxml_security_c_la-XKMSNotBoundAuthentication.lo `test -f 'xkms/impl/XKMSNotBoundAuthentication.cpp' || echo './'`xkms/impl/XKMSNotBoundAuthentication.cpp
libtool: compile:  x86_64-pld-linux-g++ -DHAVE_CONFIG_H -I.. -I.. -DXSEC_BUILDING_LIBRARY -I/usr/include/nss -I/usr/include/nspr -Wall -O2 -fwrapv -pipe -Wformat -Werror=format-security -gdwarf-4 -fno-debug-types-section -fvar-tracking-assignments -g2 -Wp,-D_FORTIFY_SOURCE=2 -fstack-protector-strong --param=ssp-buffer-size=4 -Werror=trampolines -fPIC -march=x86-64 -mtune=generic -gdwarf-4 -fno-debug-types-section -fvar-tracking-assignments -g2 -DNDEBUG -MT xkms/impl/libxml_security_c_la-XKMSNotBoundAuthentication.lo -MD -MP -MF xkms/impl/.deps/libxml_security_c_la-XKMSNotBoundAuthentication.Tpo -c xkms/impl/XKMSNotBoundAuthentication.cpp  -fPIC -DPIC -o xkms/impl/.libs/libxml_security_c_la-XKMSNotBoundAuthentication.o
libtool: compile:  x86_64-pld-linux-g++ -DHAVE_CONFIG_H -I.. -I.. -DXSEC_BUILDING_LIBRARY -I/usr/include/nss -I/usr/include/nspr -Wall -O2 -fwrapv -pipe -Wformat -Werror=format-security -gdwarf-4 -fno-debug-types-section -fvar-tracking-assignments -g2 -Wp,-D_FORTIFY_SOURCE=2 -fstack-protector-strong --param=ssp-buffer-size=4 -Werror=trampolines -fPIC -march=x86-64 -mtune=generic -gdwarf-4 -fno-debug-types-section -fvar-tracking-assignments -g2 -DNDEBUG -MT xkms/impl/libxml_security_c_la-XKMSNotBoundAuthentication.lo -MD -MP -MF xkms/impl/.deps/libxml_security_c_la-XKMSNotBoundAuthentication.Tpo -c xkms/impl/XKMSNotBoundAuthentication.cpp -o xkms/impl/libxml_security_c_la-XKMSNotBoundAuthentication.o >/dev/null 2>&1
mv -f xkms/impl/.deps/libxml_security_c_la-XKMSNotBoundAuthentication.Tpo xkms/impl/.deps/libxml_security_c_la-XKMSNotBoundAuthentication.Plo
make[2]: Leaving directory '/tmp/B.ag6y_8zp/BUILD/xml-security-c-2.0.1/xsec'
make[2]: Entering directory '/tmp/B.ag6y_8zp/BUILD/xml-security-c-2.0.1/xsec'
/bin/sh ../libtool  --tag=CXX   --mode=compile x86_64-pld-linux-g++ -DHAVE_CONFIG_H   -I.. -I.. -DXSEC_BUILDING_LIBRARY     -I/usr/include/nss -I/usr/include/nspr -Wall -O2 -fwrapv -pipe -Wformat -Werror=format-security -gdwarf-4 -fno-debug-types-section -fvar-tracking-assignments -g2 -Wp,-D_FORTIFY_SOURCE=2 -fstack-protector-strong --param=ssp-buffer-size=4 -Werror=trampolines -fPIC -march=x86-64 -mtune=generic -gdwarf-4 -fno-debug-types-section -fvar-tracking-assignments -g2  -DNDEBUG  -MT enc/OpenSSL/libxml_security_c_la-OpenSSLCryptoHashHMAC.lo -MD -MP -MF enc/OpenSSL/.deps/libxml_security_c_la-OpenSSLCryptoHashHMAC.Tpo -c -o enc/OpenSSL/libxml_security_c_la-OpenSSLCryptoHashHMAC.lo `test -f 'enc/OpenSSL/OpenSSLCryptoHashHMAC.cpp' || echo './'`enc/OpenSSL/OpenSSLCryptoHashHMAC.cpp
libtool: compile:  x86_64-pld-linux-g++ -DHAVE_CONFIG_H -I.. -I.. -DXSEC_BUILDING_LIBRARY -I/usr/include/nss -I/usr/include/nspr -Wall -O2 -fwrapv -pipe -Wformat -Werror=format-security -gdwarf-4 -fno-debug-types-section -fvar-tracking-assignments -g2 -Wp,-D_FORTIFY_SOURCE=2 -fstack-protector-strong --param=ssp-buffer-size=4 -Werror=trampolines -fPIC -march=x86-64 -mtune=generic -gdwarf-4 -fno-debug-types-section -fvar-tracking-assignments -g2 -DNDEBUG -MT enc/OpenSSL/libxml_security_c_la-OpenSSLCryptoHashHMAC.lo -MD -MP -MF enc/OpenSSL/.deps/libxml_security_c_la-OpenSSLCryptoHashHMAC.Tpo -c enc/OpenSSL/OpenSSLCryptoHashHMAC.cpp  -fPIC -DPIC -o enc/OpenSSL/.libs/libxml_security_c_la-OpenSSLCryptoHashHMAC.o
enc/OpenSSL/OpenSSLCryptoHashHMAC.cpp: In constructor 'OpenSSLCryptoHashHMAC::OpenSSLCryptoHashHMAC(XSECCryptoHash::HashType)':
enc/OpenSSL/OpenSSLCryptoHashHMAC.cpp:48:25: warning: 'HMAC_CTX* HMAC_CTX_new()' is deprecated: Since OpenSSL 3.0 [-Wdeprecated-declarations]
   48 |     mp_hctx(HMAC_CTX_new())
      |             ~~~~~~~~~~~~^~
In file included from ../xsec/enc/OpenSSL/OpenSSLCryptoHashHMAC.hpp:42,
                 from enc/OpenSSL/OpenSSLCryptoHashHMAC.cpp:38:
/usr/include/openssl/hmac.h:33:33: note: declared here
   33 | OSSL_DEPRECATEDIN_3_0 HMAC_CTX *HMAC_CTX_new(void);
      |                                 ^~~~~~~~~~~~
enc/OpenSSL/OpenSSLCryptoHashHMAC.cpp: In member function 'virtual void OpenSSLCryptoHashHMAC::setKey(const XSECCryptoKey*)':
enc/OpenSSL/OpenSSLCryptoHashHMAC.cpp:145:14: warning: 'int HMAC_Init(HMAC_CTX*, const void*, int, const EVP_MD*)' is deprecated: Since OpenSSL 1.1.0 [-Wdeprecated-declarations]
  145 |     HMAC_Init(mp_hctx,
      |     ~~~~~~~~~^~~~~~~~~
  146 |         m_keyBuf.rawBuffer(),
      |         ~~~~~~~~~~~~~~~~~~~~~
  147 |         m_keyLen,
      |         ~~~~~~~~~
  148 |         mp_md);
      |         ~~~~~~
In file included from ../xsec/enc/OpenSSL/OpenSSLCryptoHashHMAC.hpp:42,
                 from enc/OpenSSL/OpenSSLCryptoHashHMAC.cpp:38:
/usr/include/openssl/hmac.h:38:36: note: declared here
   38 | OSSL_DEPRECATEDIN_1_1_0 __owur int HMAC_Init(HMAC_CTX *ctx,
      |                                    ^~~~~~~~~
enc/OpenSSL/OpenSSLCryptoHashHMAC.cpp: In destructor 'virtual OpenSSLCryptoHashHMAC::~OpenSSLCryptoHashHMAC()':
enc/OpenSSL/OpenSSLCryptoHashHMAC.cpp:160:18: warning: 'void HMAC_CTX_free(HMAC_CTX*)' is deprecated: Since OpenSSL 3.0 [-Wdeprecated-declarations]
  160 |     HMAC_CTX_free(mp_hctx);
      |     ~~~~~~~~~~~~~^~~~~~~~~
In file included from ../xsec/enc/OpenSSL/OpenSSLCryptoHashHMAC.hpp:42,
                 from enc/OpenSSL/OpenSSLCryptoHashHMAC.cpp:38:
/usr/include/openssl/hmac.h:35:28: note: declared here
   35 | OSSL_DEPRECATEDIN_3_0 void HMAC_CTX_free(HMAC_CTX *ctx);
      |                            ^~~~~~~~~~~~~
enc/OpenSSL/OpenSSLCryptoHashHMAC.cpp: In member function 'virtual void OpenSSLCryptoHashHMAC::reset()':
enc/OpenSSL/OpenSSLCryptoHashHMAC.cpp:176:18: warning: 'int HMAC_Init(HMAC_CTX*, const void*, int, const EVP_MD*)' is deprecated: Since OpenSSL 1.1.0 [-Wdeprecated-declarations]
  176 |         HMAC_Init(mp_hctx,
      |         ~~~~~~~~~^~~~~~~~~
  177 |             m_keyBuf.rawBuffer(),
      |             ~~~~~~~~~~~~~~~~~~~~~
  178 |             m_keyLen,
      |             ~~~~~~~~~
  179 |             mp_md);
      |             ~~~~~~
In file included from ../xsec/enc/OpenSSL/OpenSSLCryptoHashHMAC.hpp:42,
                 from enc/OpenSSL/OpenSSLCryptoHashHMAC.cpp:38:
/usr/include/openssl/hmac.h:38:36: note: declared here
   38 | OSSL_DEPRECATEDIN_1_1_0 __owur int HMAC_Init(HMAC_CTX *ctx,
      |                                    ^~~~~~~~~
enc/OpenSSL/OpenSSLCryptoHashHMAC.cpp: In member function 'virtual void OpenSSLCryptoHashHMAC::hash(unsigned char*, unsigned int)':
enc/OpenSSL/OpenSSLCryptoHashHMAC.cpp:193:16: warning: 'int HMAC_Update(HMAC_CTX*, const unsigned char*, size_t)' is deprecated: Since OpenSSL 3.0 [-Wdeprecated-declarations]
  193 |     HMAC_Update(mp_hctx, data, (int) length);
      |     ~~~~~~~~~~~^~~~~~~~~~~~~~~~~~~~~~~~~~~~~
In file included from ../xsec/enc/OpenSSL/OpenSSLCryptoHashHMAC.hpp:42,
                 from enc/OpenSSL/OpenSSLCryptoHashHMAC.cpp:38:
/usr/include/openssl/hmac.h:45:27: note: declared here
   45 | OSSL_DEPRECATEDIN_3_0 int HMAC_Update(HMAC_CTX *ctx, const unsigned char *data,
      |                           ^~~~~~~~~~~
enc/OpenSSL/OpenSSLCryptoHashHMAC.cpp: In member function 'virtual unsigned int OpenSSLCryptoHashHMAC::finish(unsigned char*, unsigned int)':
enc/OpenSSL/OpenSSLCryptoHashHMAC.cpp:204:15: warning: 'int HMAC_Final(HMAC_CTX*, unsigned char*, unsigned int*)' is deprecated: Since OpenSSL 3.0 [-Wdeprecated-declarations]
  204 |     HMAC_Final(mp_hctx, m_mdValue, &m_mdLen);
      |     ~~~~~~~~~~^~~~~~~~~~~~~~~~~~~~~~~~~~~~~~
In file included from ../xsec/enc/OpenSSL/OpenSSLCryptoHashHMAC.hpp:42,
                 from enc/OpenSSL/OpenSSLCryptoHashHMAC.cpp:38:
/usr/include/openssl/hmac.h:47:27: note: declared here
   47 | OSSL_DEPRECATEDIN_3_0 int HMAC_Final(HMAC_CTX *ctx, unsigned char *md,
      |                           ^~~~~~~~~~
libtool: compile:  x86_64-pld-linux-g++ -DHAVE_CONFIG_H -I.. -I.. -DXSEC_BUILDING_LIBRARY -I/usr/include/nss -I/usr/include/nspr -Wall -O2 -fwrapv -pipe -Wformat -Werror=format-security -gdwarf-4 -fno-debug-types-section -fvar-tracking-assignments -g2 -Wp,-D_FORTIFY_SOURCE=2 -fstack-protector-strong --param=ssp-buffer-size=4 -Werror=trampolines -fPIC -march=x86-64 -mtune=generic -gdwarf-4 -fno-debug-types-section -fvar-tracking-assignments -g2 -DNDEBUG -MT enc/OpenSSL/libxml_security_c_la-OpenSSLCryptoHashHMAC.lo -MD -MP -MF enc/OpenSSL/.deps/libxml_security_c_la-OpenSSLCryptoHashHMAC.Tpo -c enc/OpenSSL/OpenSSLCryptoHashHMAC.cpp -o enc/OpenSSL/libxml_security_c_la-OpenSSLCryptoHashHMAC.o >/dev/null 2>&1
mv -f enc/OpenSSL/.deps/libxml_security_c_la-OpenSSLCryptoHashHMAC.Tpo enc/OpenSSL/.deps/libxml_security_c_la-OpenSSLCryptoHashHMAC.Plo
make[2]: Leaving directory '/tmp/B.ag6y_8zp/BUILD/xml-security-c-2.0.1/xsec'
make[2]: Entering directory '/tmp/B.ag6y_8zp/BUILD/xml-security-c-2.0.1/xsec'
/bin/sh ../libtool  --tag=CXX   --mode=compile x86_64-pld-linux-g++ -DHAVE_CONFIG_H   -I.. -I.. -DXSEC_BUILDING_LIBRARY     -I/usr/include/nss -I/usr/include/nspr -Wall -O2 -fwrapv -pipe -Wformat -Werror=format-security -gdwarf-4 -fno-debug-types-section -fvar-tracking-assignments -g2 -Wp,-D_FORTIFY_SOURCE=2 -fstack-protector-strong --param=ssp-buffer-size=4 -Werror=trampolines -fPIC -march=x86-64 -mtune=generic -gdwarf-4 -fno-debug-types-section -fvar-tracking-assignments -g2  -DNDEBUG  -MT xkms/impl/libxml_security_c_la-XKMSQueryKeyBindingImpl.lo -MD -MP -MF xkms/impl/.deps/libxml_security_c_la-XKMSQueryKeyBindingImpl.Tpo -c -o xkms/impl/libxml_security_c_la-XKMSQueryKeyBindingImpl.lo `test -f 'xkms/impl/XKMSQueryKeyBindingImpl.cpp' || echo './'`xkms/impl/XKMSQueryKeyBindingImpl.cpp
libtool: compile:  x86_64-pld-linux-g++ -DHAVE_CONFIG_H -I.. -I.. -DXSEC_BUILDING_LIBRARY -I/usr/include/nss -I/usr/include/nspr -Wall -O2 -fwrapv -pipe -Wformat -Werror=format-security -gdwarf-4 -fno-debug-types-section -fvar-tracking-assignments -g2 -Wp,-D_FORTIFY_SOURCE=2 -fstack-protector-strong --param=ssp-buffer-size=4 -Werror=trampolines -fPIC -march=x86-64 -mtune=generic -gdwarf-4 -fno-debug-types-section -fvar-tracking-assignments -g2 -DNDEBUG -MT xkms/impl/libxml_security_c_la-XKMSQueryKeyBindingImpl.lo -MD -MP -MF xkms/impl/.deps/libxml_security_c_la-XKMSQueryKeyBindingImpl.Tpo -c xkms/impl/XKMSQueryKeyBindingImpl.cpp  -fPIC -DPIC -o xkms/impl/.libs/libxml_security_c_la-XKMSQueryKeyBindingImpl.o
libtool: compile:  x86_64-pld-linux-g++ -DHAVE_CONFIG_H -I.. -I.. -DXSEC_BUILDING_LIBRARY -I/usr/include/nss -I/usr/include/nspr -Wall -O2 -fwrapv -pipe -Wformat -Werror=format-security -gdwarf-4 -fno-debug-types-section -fvar-tracking-assignments -g2 -Wp,-D_FORTIFY_SOURCE=2 -fstack-protector-strong --param=ssp-buffer-size=4 -Werror=trampolines -fPIC -march=x86-64 -mtune=generic -gdwarf-4 -fno-debug-types-section -fvar-tracking-assignments -g2 -DNDEBUG -MT xkms/impl/libxml_security_c_la-XKMSQueryKeyBindingImpl.lo -MD -MP -MF xkms/impl/.deps/libxml_security_c_la-XKMSQueryKeyBindingImpl.Tpo -c xkms/impl/XKMSQueryKeyBindingImpl.cpp -o xkms/impl/libxml_security_c_la-XKMSQueryKeyBindingImpl.o >/dev/null 2>&1
mv -f xkms/impl/.deps/libxml_security_c_la-XKMSQueryKeyBindingImpl.Tpo xkms/impl/.deps/libxml_security_c_la-XKMSQueryKeyBindingImpl.Plo
make[2]: Leaving directory '/tmp/B.ag6y_8zp/BUILD/xml-security-c-2.0.1/xsec'
make[2]: Entering directory '/tmp/B.ag6y_8zp/BUILD/xml-security-c-2.0.1/xsec'
/bin/sh ../libtool  --tag=CXX   --mode=compile x86_64-pld-linux-g++ -DHAVE_CONFIG_H   -I.. -I.. -DXSEC_BUILDING_LIBRARY     -I/usr/include/nss -I/usr/include/nspr -Wall -O2 -fwrapv -pipe -Wformat -Werror=format-security -gdwarf-4 -fno-debug-types-section -fvar-tracking-assignments -g2 -Wp,-D_FORTIFY_SOURCE=2 -fstack-protector-strong --param=ssp-buffer-size=4 -Werror=trampolines -fPIC -march=x86-64 -mtune=generic -gdwarf-4 -fno-debug-types-section -fvar-tracking-assignments -g2  -DNDEBUG  -MT xkms/impl/libxml_security_c_la-XKMSLocateResultImpl.lo -MD -MP -MF xkms/impl/.deps/libxml_security_c_la-XKMSLocateResultImpl.Tpo -c -o xkms/impl/libxml_security_c_la-XKMSLocateResultImpl.lo `test -f 'xkms/impl/XKMSLocateResultImpl.cpp' || echo './'`xkms/impl/XKMSLocateResultImpl.cpp
libtool: compile:  x86_64-pld-linux-g++ -DHAVE_CONFIG_H -I.. -I.. -DXSEC_BUILDING_LIBRARY -I/usr/include/nss -I/usr/include/nspr -Wall -O2 -fwrapv -pipe -Wformat -Werror=format-security -gdwarf-4 -fno-debug-types-section -fvar-tracking-assignments -g2 -Wp,-D_FORTIFY_SOURCE=2 -fstack-protector-strong --param=ssp-buffer-size=4 -Werror=trampolines -fPIC -march=x86-64 -mtune=generic -gdwarf-4 -fno-debug-types-section -fvar-tracking-assignments -g2 -DNDEBUG -MT xkms/impl/libxml_security_c_la-XKMSLocateResultImpl.lo -MD -MP -MF xkms/impl/.deps/libxml_security_c_la-XKMSLocateResultImpl.Tpo -c xkms/impl/XKMSLocateResultImpl.cpp  -fPIC -DPIC -o xkms/impl/.libs/libxml_security_c_la-XKMSLocateResultImpl.o
libtool: compile:  x86_64-pld-linux-g++ -DHAVE_CONFIG_H -I.. -I.. -DXSEC_BUILDING_LIBRARY -I/usr/include/nss -I/usr/include/nspr -Wall -O2 -fwrapv -pipe -Wformat -Werror=format-security -gdwarf-4 -fno-debug-types-section -fvar-tracking-assignments -g2 -Wp,-D_FORTIFY_SOURCE=2 -fstack-protector-strong --param=ssp-buffer-size=4 -Werror=trampolines -fPIC -march=x86-64 -mtune=generic -gdwarf-4 -fno-debug-types-section -fvar-tracking-assignments -g2 -DNDEBUG -MT xkms/impl/libxml_security_c_la-XKMSLocateResultImpl.lo -MD -MP -MF xkms/impl/.deps/libxml_security_c_la-XKMSLocateResultImpl.Tpo -c xkms/impl/XKMSLocateResultImpl.cpp -o xkms/impl/libxml_security_c_la-XKMSLocateResultImpl.o >/dev/null 2>&1
mv -f xkms/impl/.deps/libxml_security_c_la-XKMSLocateResultImpl.Tpo xkms/impl/.deps/libxml_security_c_la-XKMSLocateResultImpl.Plo
make[2]: Leaving directory '/tmp/B.ag6y_8zp/BUILD/xml-security-c-2.0.1/xsec'
make[2]: Entering directory '/tmp/B.ag6y_8zp/BUILD/xml-security-c-2.0.1/xsec'
/bin/sh ../libtool  --tag=CXX   --mode=compile x86_64-pld-linux-g++ -DHAVE_CONFIG_H   -I.. -I.. -DXSEC_BUILDING_LIBRARY     -I/usr/include/nss -I/usr/include/nspr -Wall -O2 -fwrapv -pipe -Wformat -Werror=format-security -gdwarf-4 -fno-debug-types-section -fvar-tracking-assignments -g2 -Wp,-D_FORTIFY_SOURCE=2 -fstack-protector-strong --param=ssp-buffer-size=4 -Werror=trampolines -fPIC -march=x86-64 -mtune=generic -gdwarf-4 -fno-debug-types-section -fvar-tracking-assignments -g2  -DNDEBUG  -MT enc/OpenSSL/libxml_security_c_la-OpenSSLCryptoHash.lo -MD -MP -MF enc/OpenSSL/.deps/libxml_security_c_la-OpenSSLCryptoHash.Tpo -c -o enc/OpenSSL/libxml_security_c_la-OpenSSLCryptoHash.lo `test -f 'enc/OpenSSL/OpenSSLCryptoHash.cpp' || echo './'`enc/OpenSSL/OpenSSLCryptoHash.cpp
libtool: compile:  x86_64-pld-linux-g++ -DHAVE_CONFIG_H -I.. -I.. -DXSEC_BUILDING_LIBRARY -I/usr/include/nss -I/usr/include/nspr -Wall -O2 -fwrapv -pipe -Wformat -Werror=format-security -gdwarf-4 -fno-debug-types-section -fvar-tracking-assignments -g2 -Wp,-D_FORTIFY_SOURCE=2 -fstack-protector-strong --param=ssp-buffer-size=4 -Werror=trampolines -fPIC -march=x86-64 -mtune=generic -gdwarf-4 -fno-debug-types-section -fvar-tracking-assignments -g2 -DNDEBUG -MT enc/OpenSSL/libxml_security_c_la-OpenSSLCryptoHash.lo -MD -MP -MF enc/OpenSSL/.deps/libxml_security_c_la-OpenSSLCryptoHash.Tpo -c enc/OpenSSL/OpenSSLCryptoHash.cpp  -fPIC -DPIC -o enc/OpenSSL/.libs/libxml_security_c_la-OpenSSLCryptoHash.o
libtool: compile:  x86_64-pld-linux-g++ -DHAVE_CONFIG_H -I.. -I.. -DXSEC_BUILDING_LIBRARY -I/usr/include/nss -I/usr/include/nspr -Wall -O2 -fwrapv -pipe -Wformat -Werror=format-security -gdwarf-4 -fno-debug-types-section -fvar-tracking-assignments -g2 -Wp,-D_FORTIFY_SOURCE=2 -fstack-protector-strong --param=ssp-buffer-size=4 -Werror=trampolines -fPIC -march=x86-64 -mtune=generic -gdwarf-4 -fno-debug-types-section -fvar-tracking-assignments -g2 -DNDEBUG -MT enc/OpenSSL/libxml_security_c_la-OpenSSLCryptoHash.lo -MD -MP -MF enc/OpenSSL/.deps/libxml_security_c_la-OpenSSLCryptoHash.Tpo -c enc/OpenSSL/OpenSSLCryptoHash.cpp -o enc/OpenSSL/libxml_security_c_la-OpenSSLCryptoHash.o >/dev/null 2>&1
mv -f enc/OpenSSL/.deps/libxml_security_c_la-OpenSSLCryptoHash.Tpo enc/OpenSSL/.deps/libxml_security_c_la-OpenSSLCryptoHash.Plo
make[2]: Leaving directory '/tmp/B.ag6y_8zp/BUILD/xml-security-c-2.0.1/xsec'
make[2]: Entering directory '/tmp/B.ag6y_8zp/BUILD/xml-security-c-2.0.1/xsec'
/bin/sh ../libtool  --tag=CXX   --mode=compile x86_64-pld-linux-g++ -DHAVE_CONFIG_H   -I.. -I.. -DXSEC_BUILDING_LIBRARY     -I/usr/include/nss -I/usr/include/nspr -Wall -O2 -fwrapv -pipe -Wformat -Werror=format-security -gdwarf-4 -fno-debug-types-section -fvar-tracking-assignments -g2 -Wp,-D_FORTIFY_SOURCE=2 -fstack-protector-strong --param=ssp-buffer-size=4 -Werror=trampolines -fPIC -march=x86-64 -mtune=generic -gdwarf-4 -fno-debug-types-section -fvar-tracking-assignments -g2  -DNDEBUG  -MT xkms/impl/libxml_security_c_la-XKMSUseKeyWithImpl.lo -MD -MP -MF xkms/impl/.deps/libxml_security_c_la-XKMSUseKeyWithImpl.Tpo -c -o xkms/impl/libxml_security_c_la-XKMSUseKeyWithImpl.lo `test -f 'xkms/impl/XKMSUseKeyWithImpl.cpp' || echo './'`xkms/impl/XKMSUseKeyWithImpl.cpp
libtool: compile:  x86_64-pld-linux-g++ -DHAVE_CONFIG_H -I.. -I.. -DXSEC_BUILDING_LIBRARY -I/usr/include/nss -I/usr/include/nspr -Wall -O2 -fwrapv -pipe -Wformat -Werror=format-security -gdwarf-4 -fno-debug-types-section -fvar-tracking-assignments -g2 -Wp,-D_FORTIFY_SOURCE=2 -fstack-protector-strong --param=ssp-buffer-size=4 -Werror=trampolines -fPIC -march=x86-64 -mtune=generic -gdwarf-4 -fno-debug-types-section -fvar-tracking-assignments -g2 -DNDEBUG -MT xkms/impl/libxml_security_c_la-XKMSUseKeyWithImpl.lo -MD -MP -MF xkms/impl/.deps/libxml_security_c_la-XKMSUseKeyWithImpl.Tpo -c xkms/impl/XKMSUseKeyWithImpl.cpp  -fPIC -DPIC -o xkms/impl/.libs/libxml_security_c_la-XKMSUseKeyWithImpl.o
libtool: compile:  x86_64-pld-linux-g++ -DHAVE_CONFIG_H -I.. -I.. -DXSEC_BUILDING_LIBRARY -I/usr/include/nss -I/usr/include/nspr -Wall -O2 -fwrapv -pipe -Wformat -Werror=format-security -gdwarf-4 -fno-debug-types-section -fvar-tracking-assignments -g2 -Wp,-D_FORTIFY_SOURCE=2 -fstack-protector-strong --param=ssp-buffer-size=4 -Werror=trampolines -fPIC -march=x86-64 -mtune=generic -gdwarf-4 -fno-debug-types-section -fvar-tracking-assignments -g2 -DNDEBUG -MT xkms/impl/libxml_security_c_la-XKMSUseKeyWithImpl.lo -MD -MP -MF xkms/impl/.deps/libxml_security_c_la-XKMSUseKeyWithImpl.Tpo -c xkms/impl/XKMSUseKeyWithImpl.cpp -o xkms/impl/libxml_security_c_la-XKMSUseKeyWithImpl.o >/dev/null 2>&1
mv -f xkms/impl/.deps/libxml_security_c_la-XKMSUseKeyWithImpl.Tpo xkms/impl/.deps/libxml_security_c_la-XKMSUseKeyWithImpl.Plo
make[2]: Leaving directory '/tmp/B.ag6y_8zp/BUILD/xml-security-c-2.0.1/xsec'
make[2]: Entering directory '/tmp/B.ag6y_8zp/BUILD/xml-security-c-2.0.1/xsec'
/bin/sh ../libtool  --tag=CXX   --mode=compile x86_64-pld-linux-g++ -DHAVE_CONFIG_H   -I.. -I.. -DXSEC_BUILDING_LIBRARY     -I/usr/include/nss -I/usr/include/nspr -Wall -O2 -fwrapv -pipe -Wformat -Werror=format-security -gdwarf-4 -fno-debug-types-section -fvar-tracking-assignments -g2 -Wp,-D_FORTIFY_SOURCE=2 -fstack-protector-strong --param=ssp-buffer-size=4 -Werror=trampolines -fPIC -march=x86-64 -mtune=generic -gdwarf-4 -fno-debug-types-section -fvar-tracking-assignments -g2  -DNDEBUG  -MT xkms/impl/libxml_security_c_la-XKMSMessageFactoryImpl.lo -MD -MP -MF xkms/impl/.deps/libxml_security_c_la-XKMSMessageFactoryImpl.Tpo -c -o xkms/impl/libxml_security_c_la-XKMSMessageFactoryImpl.lo `test -f 'xkms/impl/XKMSMessageFactoryImpl.cpp' || echo './'`xkms/impl/XKMSMessageFactoryImpl.cpp
libtool: compile:  x86_64-pld-linux-g++ -DHAVE_CONFIG_H -I.. -I.. -DXSEC_BUILDING_LIBRARY -I/usr/include/nss -I/usr/include/nspr -Wall -O2 -fwrapv -pipe -Wformat -Werror=format-security -gdwarf-4 -fno-debug-types-section -fvar-tracking-assignments -g2 -Wp,-D_FORTIFY_SOURCE=2 -fstack-protector-strong --param=ssp-buffer-size=4 -Werror=trampolines -fPIC -march=x86-64 -mtune=generic -gdwarf-4 -fno-debug-types-section -fvar-tracking-assignments -g2 -DNDEBUG -MT xkms/impl/libxml_security_c_la-XKMSMessageFactoryImpl.lo -MD -MP -MF xkms/impl/.deps/libxml_security_c_la-XKMSMessageFactoryImpl.Tpo -c xkms/impl/XKMSMessageFactoryImpl.cpp  -fPIC -DPIC -o xkms/impl/.libs/libxml_security_c_la-XKMSMessageFactoryImpl.o
libtool: compile:  x86_64-pld-linux-g++ -DHAVE_CONFIG_H -I.. -I.. -DXSEC_BUILDING_LIBRARY -I/usr/include/nss -I/usr/include/nspr -Wall -O2 -fwrapv -pipe -Wformat -Werror=format-security -gdwarf-4 -fno-debug-types-section -fvar-tracking-assignments -g2 -Wp,-D_FORTIFY_SOURCE=2 -fstack-protector-strong --param=ssp-buffer-size=4 -Werror=trampolines -fPIC -march=x86-64 -mtune=generic -gdwarf-4 -fno-debug-types-section -fvar-tracking-assignments -g2 -DNDEBUG -MT xkms/impl/libxml_security_c_la-XKMSMessageFactoryImpl.lo -MD -MP -MF xkms/impl/.deps/libxml_security_c_la-XKMSMessageFactoryImpl.Tpo -c xkms/impl/XKMSMessageFactoryImpl.cpp -o xkms/impl/libxml_security_c_la-XKMSMessageFactoryImpl.o >/dev/null 2>&1
mv -f xkms/impl/.deps/libxml_security_c_la-XKMSMessageFactoryImpl.Tpo xkms/impl/.deps/libxml_security_c_la-XKMSMessageFactoryImpl.Plo
make[2]: Leaving directory '/tmp/B.ag6y_8zp/BUILD/xml-security-c-2.0.1/xsec'
make[1]: *** [Makefile:521: all-recursive] Error 1
make: *** [Makefile:422: all] Error 2
error: Bad exit status from /tmp/B.ag6y_8zp/BUILD/tmp/rpm-tmp.TIzFhj (%build)


RPM build errors:
    Could not canonicalize hostname: ymir
    Bad exit status from /tmp/B.ag6y_8zp/BUILD/tmp/rpm-tmp.TIzFhj (%build)
ended at: Mon Sep 27 03:44:02 2021, done in 0:00:38.898494
error: No files produced.
+ chmod -R u+rwX /tmp/B.ag6y_8zp/BUILD
+ rm -rf /tmp/B.ag6y_8zp/tmp /tmp/B.ag6y_8zp/BUILD
+ rm -rf /tmp/B.ag6y_8zp
Begin-PLD-Builder-Info
Build-Time: user:175.08s sys:23.24s real:40.77s (faults io:6 non-io:5019632)

End-PLD-Builder-Info
[Back to list of logs] [View rpm -qa of builder]