FailedOk

th/SRPMS[OK]
th/x32[OK]
th/i686[OK]
th/x86_64[OK]

ac/SRPMS[OK]
ac/i386[OK]
ac/i586[OK]
ac/i686[OK]
ac/alpha[OK]
ac/amd64[OK]
ac/athlon[OK]
ac/ppc[OK]
ac/sparc[OK]
ac/sparc64[OK]

Advanced Search
main()
Powered by PLD Linux
(c) 2002-2022 PLD Team
$Revision: 1.37 $
Powered by ELF.
Your IP: 3.238.176.43

xorg-driver-video-nvidia 4841b02e-7ae1-4e48-96ea-129bfc1d083a

Status:Failed
Source URL:https://buildlogs.pld-linux.org/pld/th/x86_64/FAIL/xorg-driver-video-nvidia,4841b02e-7ae1-4e48-96ea-129bfc1d083a.bz2
text/plain URL:View!
rpm -qa of builder:View!
Date:2022/04/28 16:52:15
Runtime:0:00:55.869749

Toc:

  • prep
  • Executing(%prep): /bin/sh -e /tmp/B.kh2ccaeq/BUILD/tmp/rpm-tmp.kYqnl4
  • build
  • Executing(%build): /bin/sh -e /tmp/B.kh2ccaeq/BUILD/tmp/rpm-tmp.IAV3v8
  • error 1
  • echo >&2 " ERROR: Kernel configuration is invalid."; \
  • error 2
  • cc1: error: incompatible gcc/plugin versions
  • error 3
  • cc1: error: failed to initialize plugin ./scripts/gcc-plugins/stackleak_plugin.so
  • error 4
  • cc1: error: incompatible gcc/plugin versions
  • error 5
  • cc1: error: failed to initialize plugin ./scripts/gcc-plugins/structleak_plugin.so
  • error 6
  • cc1: error: incompatible gcc/plugin versions
  • error 7
  • cc1: error: failed to initialize plugin ./scripts/gcc-plugins/randomize_layout_plugin.so
  • error 8
  • make[2]: *** [scripts/Makefile.build:288: /tmp/B.kh2ccaeq/BUILD/NVIDIA-Linux-x86_64-510.68.02/kernel/nvidia/nv.o] Error 1
  • error 9
  • cc1: error: incompatible gcc/plugin versions
  • error 10
  • cc1: error: failed to initialize plugin ./scripts/gcc-plugins/stackleak_plugin.so
  • error 11
  • cc1: error: incompatible gcc/plugin versions
  • error 12
  • cc1: error: failed to initialize plugin ./scripts/gcc-plugins/structleak_plugin.so
  • error 13
  • cc1: error: incompatible gcc/plugin versions
  • error 14
  • cc1: error: failed to initialize plugin ./scripts/gcc-plugins/randomize_layout_plugin.so
  • error 15
  • make[2]: *** [scripts/Makefile.build:288: /tmp/B.kh2ccaeq/BUILD/NVIDIA-Linux-x86_64-510.68.02/kernel/nvidia/nv-pci.o] Error 1
  • error 16
  • cc1: error: incompatible gcc/plugin versions
  • error 17
  • cc1: error: failed to initialize plugin ./scripts/gcc-plugins/stackleak_plugin.so
  • error 18
  • cc1: error: incompatible gcc/plugin versions
  • error 19
  • cc1: error: failed to initialize plugin ./scripts/gcc-plugins/structleak_plugin.so
  • error 20
  • cc1: error: incompatible gcc/plugin versions
  • error 21
  • cc1: error: failed to initialize plugin ./scripts/gcc-plugins/randomize_layout_plugin.so
  • error 22
  • make[2]: *** [scripts/Makefile.build:288: /tmp/B.kh2ccaeq/BUILD/NVIDIA-Linux-x86_64-510.68.02/kernel/nvidia/nv-acpi.o] Error 1
  • error 23
  • make[1]: *** [Makefile:1831: /tmp/B.kh2ccaeq/BUILD/NVIDIA-Linux-x86_64-510.68.02/kernel] Error 2
  • error 24
  • error: Bad exit status from /tmp/B.kh2ccaeq/BUILD/tmp/rpm-tmp.IAV3v8 (%build)
  • error 25
  • RPM build errors:
  • error 26
  • error: No files produced.

Content:

request from: atler
checking if we should skip the build
started at: Thu Apr 28 16:50:31 2022
killing old processes on a builder
sending signal 9 to pid -1
cleaning up /tmp
fetching https://srcbuilder.pld-linux.org/th//srpms/4841b02e-7ae1-4e48-96ea-129bfc1d083a/xorg-driver-video-nvidia-kernel-510.68.02-1%405.17.1_1.src.rpm
fetched 329301712 bytes, 36328.7 K/s
installing srpm: xorg-driver-video-nvidia-kernel-510.68.02-1@5.17.1_1.src.rpm
+ install -d /tmp/B.kh2ccaeq/BUILD /tmp/B.kh2ccaeq/RPMS
+ LC_ALL=en_US.UTF-8
+ rpm -qp --changelog xorg-driver-video-nvidia-kernel-510.68.02-1@5.17.1_1.src.rpm
* Thu Apr 28 2022 PLD Linux Team <feedback@pld-linux.org>
- For complete changelog see: http://git.pld-linux.org/?p=packages/xorg-driver-video-nvidia.git;a=log;h=auto/th/xorg-driver-video-nvidia-510.68.02-1
* Wed Apr 27 2022 Jan Palus <atler@pld-linux.org> c97549a
- up to 510.68.02 * Fri Mar 25 2022 Jan Palus <atler@pld-linux.org> ce81810
- up to 510.60.02 * Tue Feb 15 2022 Jan Palus <atler@pld-linux.org> 5447042
- updated provided vulkan api version * Tue Feb 15 2022 Jan Palus <atler@pld-linux.org> f88bf51
- up to 510.54 * Tue Feb 01 2022 Jan Palus <atler@pld-linux.org> 086d6cd
- up to 510.47.03 * Sat Jan 15 2022 Jan Rękorajski <baggins@pld-linux.org> 6943331
- up to 495.46 * Wed Dec 08 2021 Jan Palus <atler@pld-linux.org> 6fabe0e
- use system libglvnd by default; rel 2 * Fri Oct 29 2021 Jan Palus <atler@pld-linux.org> 1a01d36
- bump minimum kernel version to 3.10 * Fri Oct 29 2021 Jan Palus <atler@pld-linux.org> d82c3ce
- appears to work fine with video abi 25.2 * Fri Oct 29 2021 Jan Palus <atler@pld-linux.org> 43eb07b
- correct gbm backend name and location * Thu Oct 28 2021 Jan Palus <atler@pld-linux.org> 07a024f
- up to 495.44 * Tue Sep 21 2021 Jan Palus <atler@pld-linux.org> 8768ed5
- up to 470.74 * Tue Aug 10 2021 Jan Palus <atler@pld-linux.org> c18f947
- up to 470.63.01 * Wed Jul 21 2021 Jan Palus <atler@pld-linux.org> 0ba0214
- up to 470.57.02 * Fri May 21 2021 Jan Palus <atler@pld-linux.org> bd76f99
- up to 465.31 * Sat May 15 2021 Jakub Bogusz <qboosh@pld-linux.org> 9095088
- todo cleanup * Sat May 15 2021 Jakub Bogusz <qboosh@pld-linux.org> a2f2660
- rel 3 * Sat May 15 2021 Jakub Bogusz <qboosh@pld-linux.org> 5bf93a3
- updated hardware list * Sat May 15 2021 Jakub Bogusz <qboosh@pld-linux.org> 3c28cab
- told to support OpenGL 4.6 * Sat May 15 2021 Jakub Bogusz <qboosh@pld-linux.org> 152c2c5
- dropped obsolete _noautoreqdep + rpm -Uhv --nodeps --define '_topdir /tmp/B.kh2ccaeq' --define '_specdir %{_topdir}' --define '_sourcedir %{_specdir}' --define '_rpmdir %{_topdir}/RPMS' --define '_builddir %{_topdir}/BUILD' --without userspace --define 'build_kernels head,5.15,5.10,5.4,4.19,4.14,4.9' xorg-driver-video-nvidia-kernel-510.68.02-1@5.17.1_1.src.rpm Updating / installing... xorg-driver-video-nvidia-kernel-1:510.######################################## + rm -f xorg-driver-video-nvidia-kernel-510.68.02-1@5.17.1_1.src.rpm + install -m 700 -d /tmp/B.kh2ccaeq/BUILD/tmp + TMPDIR=/tmp/B.kh2ccaeq/BUILD/tmp + exec nice -n 0 rpmbuild -bp --short-circuit --nodeps --define '_topdir /tmp/B.kh2ccaeq' --define '_specdir %{_topdir}' --define '_sourcedir %{_specdir}' --define '_rpmdir %{_topdir}/RPMS' --define '_builddir %{_topdir}/BUILD' --without userspace --target x86_64-pld-linux --define 'build_kernels head,5.15,5.10,5.4,4.19,4.14,4.9' --define 'prep exit 0' /tmp/B.kh2ccaeq/xorg-driver-video-nvidia.spec warning: Could not canonicalize hostname: ymir Building target platforms: x86_64-pld-linux Building for target x86_64-pld-linux checking BuildConflict-ing packages rpm: warning: Could not canonicalize hostname: ymir rpm: Building target platforms: x86_64-pld-linux rpm: Building for target x86_64-pld-linux no BuildConflicts found checking BR rpm: warning: Could not canonicalize hostname: ymir rpm: Building target platforms: x86_64-pld-linux rpm: Building for target x86_64-pld-linux no BR needed building RPM using: set -ex; : build-id: 4841b02e-7ae1-4e48-96ea-129bfc1d083a; TMPDIR=/tmp/B.kh2ccaeq/BUILD/tmp exec nice -n 0 rpmbuild -bb --define '__jobs 9' --define '_smp_mflags -j9' --define '_make_opts -Otarget' --define '_pld_builder 1' --define '_topdir /tmp/B.kh2ccaeq' --define '_specdir %{_topdir}' --define '_sourcedir %{_specdir}' --define '_rpmdir %{_topdir}/RPMS' --define '_builddir %{_topdir}/BUILD' --without userspace --target x86_64-pld-linux --define 'build_kernels head,5.15,5.10,5.4,4.19,4.14,4.9' /tmp/B.kh2ccaeq/xorg-driver-video-nvidia.spec + : build-id: 4841b02e-7ae1-4e48-96ea-129bfc1d083a + TMPDIR=/tmp/B.kh2ccaeq/BUILD/tmp + exec nice -n 0 rpmbuild -bb --define '__jobs 9' --define '_smp_mflags -j9' --define '_make_opts -Otarget' --define '_pld_builder 1' --define '_topdir /tmp/B.kh2ccaeq' --define '_specdir %{_topdir}' --define '_sourcedir %{_specdir}' --define '_rpmdir %{_topdir}/RPMS' --define '_builddir %{_topdir}/BUILD' --without userspace --target x86_64-pld-linux --define 'build_kernels head,5.15,5.10,5.4,4.19,4.14,4.9' /tmp/B.kh2ccaeq/xorg-driver-video-nvidia.spec warning: Could not canonicalize hostname: ymir Building target platforms: x86_64-pld-linux Building for target x86_64-pld-linux Executing(%prep): /bin/sh -e /tmp/B.kh2ccaeq/BUILD/tmp/rpm-tmp.kYqnl4 + umask 022 + cd /tmp/B.kh2ccaeq/BUILD + cd /tmp/B.kh2ccaeq/BUILD + rm -rf NVIDIA-Linux-x86_64-510.68.02 + /bin/sh /tmp/B.kh2ccaeq/NVIDIA-Linux-x86_64-510.68.02.run --extract-only Creating directory NVIDIA-Linux-x86_64-510.68.02 Verifying archive integrity... OK Uncompressing NVIDIA Accelerated Graphics Driver for Linux-x86_64 510.68.02.......................................................................................................................................................................................................................................................................................................................................................................................................................................................................................................................................................................................................... + cd /tmp/B.kh2ccaeq/BUILD + cd NVIDIA-Linux-x86_64-510.68.02 + /bin/chmod -Rf a+rX,u+w,g-w,o-w . + echo 'Patch #0 (X11-driver-nvidia-desktop.patch):' Patch #0 (X11-driver-nvidia-desktop.patch): + </tmp/B.kh2ccaeq/X11-driver-nvidia-desktop.patch + /usr/bin/patch -s -p1 '--fuzz=0' + >>kernel/Makefile.kbuild + echo 'EXTRA_CFLAGS += -Wno-pointer-arith -Wno-sign-compare -Wno-unused' + RPM_EC=0 + jobs -p + exit 0 Executing(%build): /bin/sh -e /tmp/B.kh2ccaeq/BUILD/tmp/rpm-tmp.IAV3v8 TMP=/home/users/builder/tmp HOME=/home/users/builder PATH=/home/users/builder/GNUstep/Tools:/bin:/usr/bin:/usr/local/bin:/home/users/builder/bin TMPDIR=/tmp/B.kh2ccaeq/BUILD/tmp + umask 022 + cd /tmp/B.kh2ccaeq/BUILD + cd NVIDIA-Linux-x86_64-510.68.02 + cd kernel + /usr/bin/make -Otarget -j9 'SYSSRC=/usr/src/linux' clean rm -f -r conftest + /usr/bin/make -Otarget -j9 'SYSSRC=/usr/src/linux' 'IGNORE_CC_MISMATCH=1' 'NV_VERBOSE=1' 'CC=x86_64-pld-linux-gcc' module make[1]: Entering directory '/usr/src/linux-5.17.1' test -e include/generated/autoconf.h -a -e include/config/auto.conf || ( \ echo >&2; \ echo >&2 " ERROR: Kernel configuration is invalid."; \ echo >&2 " include/generated/autoconf.h or include/config/auto.conf are missing.";\ echo >&2 " Run 'make oldconfig && make prepare' on kernel src to fix it."; \ echo >&2 ; \ /bin/false) make[1]: Leaving directory '/usr/src/linux-5.17.1' make[1]: Entering directory '/usr/src/linux-5.17.1' warning: the compiler differs from the one used to build the kernel The kernel was built by: x86_64-pld-linux-gcc (PLD-Linux) 11.2.0 20220208 (release) You are using: x86_64-pld-linux-gcc (PLD-Linux) 11.3.0 20220421 (release) make[1]: Leaving directory '/usr/src/linux-5.17.1' /usr/bin/make -f ./scripts/Makefile.build obj=/tmp/B.kh2ccaeq/BUILD/NVIDIA-Linux-x86_64-510.68.02/kernel \ single-build= \ need-builtin=1 need-modorder=1 ln -sf /tmp/B.kh2ccaeq/BUILD/NVIDIA-Linux-x86_64-510.68.02/kernel/nvidia/nv-kernel.o_binary /tmp/B.kh2ccaeq/BUILD/NVIDIA-Linux-x86_64-510.68.02/kernel/nvidia/nv-kernel.o ln -sf /tmp/B.kh2ccaeq/BUILD/NVIDIA-Linux-x86_64-510.68.02/kernel/nvidia-modeset/nv-modeset-kernel.o_binary /tmp/B.kh2ccaeq/BUILD/NVIDIA-Linux-x86_64-510.68.02/kernel/nvidia-modeset/nv-modeset-kernel.o CONFTEST: list_is_first CONFTEST: console_lock CONFTEST: hash__remap_4k_pfn CONFTEST: acquire_console_sem CONFTEST: ioremap_cache CONFTEST: ioremap_wc CONFTEST: set_pages_uc CONFTEST: set_memory_uc CONFTEST: set_pages_array_uc CONFTEST: set_memory_array_uc CONFTEST: acpi_walk_namespace CONFTEST: sg_alloc_table CONFTEST: pci_get_domain_bus_and_slot CONFTEST: xen_ioemu_inject_msi CONFTEST: get_num_physpages CONFTEST: pm_vt_switch_required CONFTEST: pde_data CONFTEST: efi_enabled CONFTEST: PDE_DATA CONFTEST: proc_remove CONFTEST: write_cr4 CONFTEST: phys_to_dma CONFTEST: dma_attr_macros CONFTEST: get_dma_ops CONFTEST: dma_map_page_attrs CONFTEST: pnv_pci_get_npu_dev CONFTEST: of_get_property CONFTEST: of_node_to_nid CONFTEST: of_find_node_by_phandle CONFTEST: node_end_pfn CONFTEST: of_get_ibm_chip_id CONFTEST: pci_stop_and_remove_bus_device CONFTEST: pci_bus_address CONFTEST: pci_remove_bus_device CONFTEST: timer_setup CONFTEST: cpuhp_setup_state CONFTEST: register_cpu_notifier CONFTEST: dma_map_resource CONFTEST: kthread_create_on_node CONFTEST: kernel_read_has_pointer_pos_arg CONFTEST: tegra_get_platform CONFTEST: backlight_device_register CONFTEST: pci_enable_msix_range CONFTEST: tegra_bpmp_send_receive CONFTEST: of_find_matching_node CONFTEST: get_backlight_device_by_name CONFTEST: jiffies_to_timespec CONFTEST: dev_is_pci CONFTEST: ktime_get_raw_ts64 CONFTEST: kernel_write CONFTEST: dma_direct_map_resource CONFTEST: flush_cache_all CONFTEST: vmf_insert_pfn CONFTEST: ktime_get_real_ts64 CONFTEST: full_name_hash CONFTEST: hlist_for_each_entry CONFTEST: cc_mkdec CONFTEST: pgprot_decrypted CONFTEST: seq_read_iter CONFTEST: iterate_fd CONFTEST: drm_gem_object_get CONFTEST: pci_enable_atomic_ops_to_root CONFTEST: sg_page_iter_page CONFTEST: vga_tryget CONFTEST: unsafe_follow_pfn CONFTEST: drm_gem_object_put_unlocked CONFTEST: add_memory_driver_managed CONFTEST: set_close_on_exec CONFTEST: device_property_read_u64 CONFTEST: of_dma_configure CONFTEST: devm_of_platform_populate CONFTEST: of_get_named_gpio CONFTEST: devm_gpio_request_one CONFTEST: of_property_count_elems_of_size CONFTEST: i2c_new_client_device CONFTEST: i2c_unregister_device CONFTEST: of_property_read_variable_u8_array CONFTEST: gpio_direction_input CONFTEST: icc_get CONFTEST: icc_set_bw CONFTEST: icc_put CONFTEST: gpio_direction_output CONFTEST: gpio_get_value CONFTEST: kbasename CONFTEST: gpio_set_value CONFTEST: bitmap_clear CONFTEST: vzalloc CONFTEST: gpio_to_irq CONFTEST: wait_on_bit_lock_argument_count CONFTEST: pnv_npu2_init_context CONFTEST: acpi_bus_get_device CONFTEST: dma_set_coherent_mask CONFTEST: address_space_init_once CONFTEST: cpumask_of_node CONFTEST: ioasid_get CONFTEST: usleep_range CONFTEST: radix_tree_empty CONFTEST: drm_dev_unref CONFTEST: drm_driver_has_gem_prime_res_obj CONFTEST: migrate_vma_setup CONFTEST: drm_gem_object_lookup CONFTEST: radix_tree_replace_slot CONFTEST: drm_connector_funcs_have_mode_in_name CONFTEST: drm_reinit_primary_mode_group CONFTEST: drm_atomic_state_ref_counting CONFTEST: drm_connector_for_each_possible_encoder CONFTEST: drm_framebuffer_get CONFTEST: drm_rotation_available CONFTEST: drm_dev_put CONFTEST: get_user_pages CONFTEST: is_export_symbol_gpl_of_node_to_nid CONFTEST: is_export_symbol_gpl_sme_active CONFTEST: is_export_symbol_present_swiotlb_map_sg_attrs CONFTEST: is_export_symbol_present_get_unused_fd CONFTEST: nvhost_dma_fence_unpack CONFTEST: is_export_symbol_present_swiotlb_dma_ops CONFTEST: is_export_symbol_present___close_fd CONFTEST: is_export_symbol_present_close_fd CONFTEST: is_export_symbol_present_get_unused_fd_flags CONFTEST: is_export_symbol_present_nvhost_syncpt_unit_interface_get_byte_offset CONFTEST: is_export_symbol_present_nvhost_get_default_device CONFTEST: is_export_symbol_present_nvhost_syncpt_unit_interface_get_aperture CONFTEST: is_export_symbol_present_tegra_dce_register_ipc_client CONFTEST: is_export_symbol_present_tegra_dce_client_ipc_send_recv CONFTEST: is_export_symbol_present_tegra_dce_unregister_ipc_client CONFTEST: is_export_symbol_present_dram_clk_to_mc_clk CONFTEST: is_export_symbol_present_get_dram_num_channels CONFTEST: drm_atomic_helper_connector_dpms CONFTEST: is_export_symbol_present_tegra_dram_types CONFTEST: is_export_symbol_present_kthread_create_on_node CONFTEST: drm_vma_offset_exact_lookup_locked CONFTEST: kuid_t CONFTEST: file_operations CONFTEST: file_inode CONFTEST: drm_format_num_planes CONFTEST: acpi_op_remove CONFTEST: dma_ops CONFTEST: get_user_pages_remote CONFTEST: swiotlb_dma_ops CONFTEST: noncoherent_swiotlb_dma_ops CONFTEST: vm_fault_has_address CONFTEST: vmf_insert_pfn_prot CONFTEST: vm_insert_pfn_prot CONFTEST: vm_ops_fault_removed_vma_arg CONFTEST: node_states_n_memory CONFTEST: backlight_properties_type CONFTEST: device_driver_of_match_table CONFTEST: vmbus_channel_has_ringbuffer_page CONFTEST: device_of_node CONFTEST: sysfs_slab_unlink CONFTEST: timespec64 CONFTEST: vmalloc_has_pgprot_t_arg CONFTEST: mm_has_mmap_lock CONFTEST: mt_device_gre CONFTEST: proc_ops CONFTEST: kmem_cache_has_kobj_remove_work CONFTEST: remove_memory_has_nid_arg CONFTEST: acpi_fadt_low_power_s0 CONFTEST: address_space CONFTEST: backing_dev_info CONFTEST: mmu_notifier_ops_invalidate_range CONFTEST: pci_channel_state CONFTEST: pci_dev_has_ats_enabled CONFTEST: drm_bus_present CONFTEST: drm_bus_has_get_irq CONFTEST: drm_bus_has_bus_type CONFTEST: drm_bus_has_get_name CONFTEST: mm_context_t CONFTEST: vm_fault_t CONFTEST: drm_driver_has_set_busid CONFTEST: drm_master_drop_has_from_release_arg CONFTEST: drm_driver_unload_has_int_return_type CONFTEST: drm_driver_has_legacy_dev_list CONFTEST: migrate_vma_added_flags CONFTEST: drm_driver_has_device_list CONFTEST: make_device_exclusive_range CONFTEST: drm_mode_object_find_has_file_priv_arg CONFTEST: drm_crtc_state_has_connectors_changed CONFTEST: drm_helper_mode_fill_fb_struct CONFTEST: dma_buf_owner CONFTEST: drm_driver_prime_flag_present CONFTEST: drm_atomic_helper_crtc_destroy_state_has_crtc_arg CONFTEST: drm_atomic_helper_plane_destroy_state_has_plane_arg CONFTEST: drm_gem_object_has_resv CONFTEST: drm_format_modifiers_present CONFTEST: drm_connector_list_iter CONFTEST: drm_crtc_state_has_async_flip CONFTEST: drm_crtc_state_has_pageflip_flags CONFTEST: drm_vma_node_is_allowed_has_tag_arg CONFTEST: drm_init_function_args CONFTEST: drm_atomic_helper_swap_state_has_stall_arg CONFTEST: drm_vma_offset_node_has_readonly CONFTEST: drm_display_mode_has_vrefresh CONFTEST: drm_driver_master_set_has_int_return_type CONFTEST: drm_device_has_pdev CONFTEST: drm_driver_has_gem_free_object CONFTEST: drm_prime_pages_to_sg_has_drm_device_arg CONFTEST: drm_driver_has_gem_prime_callbacks CONFTEST: drm_mode_config_has_allow_fb_modifiers CONFTEST: drm_gem_object_vmap_has_map_arg CONFTEST: nvidia_vgpu_kvm_build CONFTEST: dom0_kernel_present CONFTEST: nvidia_grid_build CONFTEST: nvidia_grid_csp_build CONFTEST: is_export_symbol_gpl_refcount_inc CONFTEST: is_export_symbol_gpl_refcount_dec_and_test CONFTEST: pci_class_multimedia_hd_audio CONFTEST: ib_peer_memory_symbols CONFTEST: drm_alpha_blending_available CONFTEST: drm_crtc_atomic_check_has_atomic_state_arg CONFTEST: drm_crtc_state_has_no_vblank CONFTEST: drm_plane_atomic_check_has_atomic_state_arg CONFTEST: pm_runtime_available CONFTEST: drm_available CONFTEST: drm_atomic_available x86_64-pld-linux-gcc -Wp,-MMD,/tmp/B.kh2ccaeq/BUILD/NVIDIA-Linux-x86_64-510.68.02/kernel/nvidia/.nv.o.d -nostdinc -I./arch/x86/include -I./arch/x86/include/generated -I./include -I./arch/x86/include/uapi -I./arch/x86/include/generated/uapi -I./include/uapi -I./include/generated/uapi -include ./include/linux/compiler-version.h -include ./include/linux/kconfig.h -include ./include/linux/compiler_types.h -D__KERNEL__ -fmacro-prefix-map=./= -Wall -Wundef -Werror=strict-prototypes -Wno-trigraphs -fno-strict-aliasing -fno-common -fshort-wchar -fno-PIE -Werror=implicit-function-declaration -Werror=implicit-int -Werror=return-type -Wno-format-security -std=gnu89 -mno-sse -mno-mmx -mno-sse2 -mno-3dnow -mno-avx -fcf-protection=none -m64 -falign-jumps=1 -falign-loops=1 -mno-80387 -mno-fp-ret-in-387 -mpreferred-stack-boundary=3 -mskip-rax-setup -mtune=generic -mno-red-zone -mcmodel=kernel -DCONFIG_X86_X32_ABI -Wno-sign-compare -fno-asynchronous-unwind-tables -mindirect-branch=thunk-extern -mindirect-branch-register -mindirect-branch-cs-prefix -fno-jump-tables -fno-delete-null-pointer-checks -Wno-frame-address -Wno-format-truncation -Wno-format-overflow -Wno-address-of-packed-member -O2 -fno-allow-store-data-races -Wframe-larger-than=2048 -fstack-protector-strong -Wimplicit-fallthrough=5 -Wno-main -Wno-unused-but-set-variable -Wno-unused-const-variable -fno-stack-clash-protection -fzero-call-used-regs=used-gpr -pg -mrecord-mcount -mfentry -DCC_USING_FENTRY -Wdeclaration-after-statement -Wvla -Wno-pointer-sign -Wcast-function-type -Wno-stringop-truncation -Wno-zero-length-bounds -Wno-array-bounds -Wno-stringop-overflow -Wno-restrict -Wno-maybe-uninitialized -Wno-alloc-size-larger-than -fno-strict-overflow -fno-stack-check -fconserve-stack -Werror=date-time -Werror=incompatible-pointer-types -Werror=designated-init -Wno-packed-not-aligned -gsplit-dwarf -gdwarf-4 -gz=zlib -fplugin=./scripts/gcc-plugins/structleak_plugin.so -fplugin=./scripts/gcc-plugins/randomize_layout_plugin.so -fplugin=./scripts/gcc-plugins/stackleak_plugin.so -fplugin-arg-structleak_plugin-byref-all -DSTRUCTLEAK_PLUGIN -DRANDSTRUCT_PLUGIN -fplugin-arg-randomize_layout_plugin-performance-mode -DSTACKLEAK_PLUGIN -fplugin-arg-stackleak_plugin-track-min-size=100 -fplugin-arg-stackleak_plugin-arch=x86 -I/tmp/B.kh2ccaeq/BUILD/NVIDIA-Linux-x86_64-510.68.02/kernel/common/inc -I/tmp/B.kh2ccaeq/BUILD/NVIDIA-Linux-x86_64-510.68.02/kernel -Wall -MD -Wno-cast-qual -Wno-error -Wno-format-extra-args -D__KERNEL__ -DMODULE -DNVRM -DNV_VERSION_STRING=\"510.68.02\" -Wno-unused-function -Wuninitialized -fno-strict-aliasing -mno-red-zone -mcmodel=kernel -DNV_UVM_ENABLE -DNV_SPECTRE_V2=0 -DNV_KERNEL_INTERFACE_LAYER -I/tmp/B.kh2ccaeq/BUILD/NVIDIA-Linux-x86_64-510.68.02/kernel/nvidia -DNVIDIA_UNDEF_LEGACY_BIT_MACROS -UDEBUG -U_DEBUG -DNDEBUG -DMODULE -DKBUILD_BASENAME='"nv"' -DKBUILD_MODNAME='"nvidia"' -D__KBUILD_MODNAME=kmod_nvidia -c -o /tmp/B.kh2ccaeq/BUILD/NVIDIA-Linux-x86_64-510.68.02/kernel/nvidia/nv.o /tmp/B.kh2ccaeq/BUILD/NVIDIA-Linux-x86_64-510.68.02/kernel/nvidia/nv.c ; ./tools/objtool/objtool orc generate --module --no-fp --retpoline --uaccess /tmp/B.kh2ccaeq/BUILD/NVIDIA-Linux-x86_64-510.68.02/kernel/nvidia/nv.o cc1: error: incompatible gcc/plugin versions cc1: error: failed to initialize plugin ./scripts/gcc-plugins/stackleak_plugin.so cc1: error: incompatible gcc/plugin versions cc1: error: failed to initialize plugin ./scripts/gcc-plugins/structleak_plugin.so cc1: error: incompatible gcc/plugin versions cc1: error: failed to initialize plugin ./scripts/gcc-plugins/randomize_layout_plugin.so make[2]: *** [scripts/Makefile.build:288: /tmp/B.kh2ccaeq/BUILD/NVIDIA-Linux-x86_64-510.68.02/kernel/nvidia/nv.o] Error 1 make[2]: *** Waiting for unfinished jobs.... x86_64-pld-linux-gcc -Wp,-MMD,/tmp/B.kh2ccaeq/BUILD/NVIDIA-Linux-x86_64-510.68.02/kernel/nvidia/.nv-pci.o.d -nostdinc -I./arch/x86/include -I./arch/x86/include/generated -I./include -I./arch/x86/include/uapi -I./arch/x86/include/generated/uapi -I./include/uapi -I./include/generated/uapi -include ./include/linux/compiler-version.h -include ./include/linux/kconfig.h -include ./include/linux/compiler_types.h -D__KERNEL__ -fmacro-prefix-map=./= -Wall -Wundef -Werror=strict-prototypes -Wno-trigraphs -fno-strict-aliasing -fno-common -fshort-wchar -fno-PIE -Werror=implicit-function-declaration -Werror=implicit-int -Werror=return-type -Wno-format-security -std=gnu89 -mno-sse -mno-mmx -mno-sse2 -mno-3dnow -mno-avx -fcf-protection=none -m64 -falign-jumps=1 -falign-loops=1 -mno-80387 -mno-fp-ret-in-387 -mpreferred-stack-boundary=3 -mskip-rax-setup -mtune=generic -mno-red-zone -mcmodel=kernel -DCONFIG_X86_X32_ABI -Wno-sign-compare -fno-asynchronous-unwind-tables -mindirect-branch=thunk-extern -mindirect-branch-register -mindirect-branch-cs-prefix -fno-jump-tables -fno-delete-null-pointer-checks -Wno-frame-address -Wno-format-truncation -Wno-format-overflow -Wno-address-of-packed-member -O2 -fno-allow-store-data-races -Wframe-larger-than=2048 -fstack-protector-strong -Wimplicit-fallthrough=5 -Wno-main -Wno-unused-but-set-variable -Wno-unused-const-variable -fno-stack-clash-protection -fzero-call-used-regs=used-gpr -pg -mrecord-mcount -mfentry -DCC_USING_FENTRY -Wdeclaration-after-statement -Wvla -Wno-pointer-sign -Wcast-function-type -Wno-stringop-truncation -Wno-zero-length-bounds -Wno-array-bounds -Wno-stringop-overflow -Wno-restrict -Wno-maybe-uninitialized -Wno-alloc-size-larger-than -fno-strict-overflow -fno-stack-check -fconserve-stack -Werror=date-time -Werror=incompatible-pointer-types -Werror=designated-init -Wno-packed-not-aligned -gsplit-dwarf -gdwarf-4 -gz=zlib -fplugin=./scripts/gcc-plugins/structleak_plugin.so -fplugin=./scripts/gcc-plugins/randomize_layout_plugin.so -fplugin=./scripts/gcc-plugins/stackleak_plugin.so -fplugin-arg-structleak_plugin-byref-all -DSTRUCTLEAK_PLUGIN -DRANDSTRUCT_PLUGIN -fplugin-arg-randomize_layout_plugin-performance-mode -DSTACKLEAK_PLUGIN -fplugin-arg-stackleak_plugin-track-min-size=100 -fplugin-arg-stackleak_plugin-arch=x86 -I/tmp/B.kh2ccaeq/BUILD/NVIDIA-Linux-x86_64-510.68.02/kernel/common/inc -I/tmp/B.kh2ccaeq/BUILD/NVIDIA-Linux-x86_64-510.68.02/kernel -Wall -MD -Wno-cast-qual -Wno-error -Wno-format-extra-args -D__KERNEL__ -DMODULE -DNVRM -DNV_VERSION_STRING=\"510.68.02\" -Wno-unused-function -Wuninitialized -fno-strict-aliasing -mno-red-zone -mcmodel=kernel -DNV_UVM_ENABLE -DNV_SPECTRE_V2=0 -DNV_KERNEL_INTERFACE_LAYER -I/tmp/B.kh2ccaeq/BUILD/NVIDIA-Linux-x86_64-510.68.02/kernel/nvidia -DNVIDIA_UNDEF_LEGACY_BIT_MACROS -UDEBUG -U_DEBUG -DNDEBUG -DMODULE -DKBUILD_BASENAME='"nv_pci"' -DKBUILD_MODNAME='"nvidia"' -D__KBUILD_MODNAME=kmod_nvidia -c -o /tmp/B.kh2ccaeq/BUILD/NVIDIA-Linux-x86_64-510.68.02/kernel/nvidia/nv-pci.o /tmp/B.kh2ccaeq/BUILD/NVIDIA-Linux-x86_64-510.68.02/kernel/nvidia/nv-pci.c ; ./tools/objtool/objtool orc generate --module --no-fp --retpoline --uaccess /tmp/B.kh2ccaeq/BUILD/NVIDIA-Linux-x86_64-510.68.02/kernel/nvidia/nv-pci.o cc1: error: incompatible gcc/plugin versions cc1: error: failed to initialize plugin ./scripts/gcc-plugins/stackleak_plugin.so cc1: error: incompatible gcc/plugin versions cc1: error: failed to initialize plugin ./scripts/gcc-plugins/structleak_plugin.so cc1: error: incompatible gcc/plugin versions cc1: error: failed to initialize plugin ./scripts/gcc-plugins/randomize_layout_plugin.so make[2]: *** [scripts/Makefile.build:288: /tmp/B.kh2ccaeq/BUILD/NVIDIA-Linux-x86_64-510.68.02/kernel/nvidia/nv-pci.o] Error 1 x86_64-pld-linux-gcc -Wp,-MMD,/tmp/B.kh2ccaeq/BUILD/NVIDIA-Linux-x86_64-510.68.02/kernel/nvidia/.nv-acpi.o.d -nostdinc -I./arch/x86/include -I./arch/x86/include/generated -I./include -I./arch/x86/include/uapi -I./arch/x86/include/generated/uapi -I./include/uapi -I./include/generated/uapi -include ./include/linux/compiler-version.h -include ./include/linux/kconfig.h -include ./include/linux/compiler_types.h -D__KERNEL__ -fmacro-prefix-map=./= -Wall -Wundef -Werror=strict-prototypes -Wno-trigraphs -fno-strict-aliasing -fno-common -fshort-wchar -fno-PIE -Werror=implicit-function-declaration -Werror=implicit-int -Werror=return-type -Wno-format-security -std=gnu89 -mno-sse -mno-mmx -mno-sse2 -mno-3dnow -mno-avx -fcf-protection=none -m64 -falign-jumps=1 -falign-loops=1 -mno-80387 -mno-fp-ret-in-387 -mpreferred-stack-boundary=3 -mskip-rax-setup -mtune=generic -mno-red-zone -mcmodel=kernel -DCONFIG_X86_X32_ABI -Wno-sign-compare -fno-asynchronous-unwind-tables -mindirect-branch=thunk-extern -mindirect-branch-register -mindirect-branch-cs-prefix -fno-jump-tables -fno-delete-null-pointer-checks -Wno-frame-address -Wno-format-truncation -Wno-format-overflow -Wno-address-of-packed-member -O2 -fno-allow-store-data-races -Wframe-larger-than=2048 -fstack-protector-strong -Wimplicit-fallthrough=5 -Wno-main -Wno-unused-but-set-variable -Wno-unused-const-variable -fno-stack-clash-protection -fzero-call-used-regs=used-gpr -pg -mrecord-mcount -mfentry -DCC_USING_FENTRY -Wdeclaration-after-statement -Wvla -Wno-pointer-sign -Wcast-function-type -Wno-stringop-truncation -Wno-zero-length-bounds -Wno-array-bounds -Wno-stringop-overflow -Wno-restrict -Wno-maybe-uninitialized -Wno-alloc-size-larger-than -fno-strict-overflow -fno-stack-check -fconserve-stack -Werror=date-time -Werror=incompatible-pointer-types -Werror=designated-init -Wno-packed-not-aligned -gsplit-dwarf -gdwarf-4 -gz=zlib -fplugin=./scripts/gcc-plugins/structleak_plugin.so -fplugin=./scripts/gcc-plugins/randomize_layout_plugin.so -fplugin=./scripts/gcc-plugins/stackleak_plugin.so -fplugin-arg-structleak_plugin-byref-all -DSTRUCTLEAK_PLUGIN -DRANDSTRUCT_PLUGIN -fplugin-arg-randomize_layout_plugin-performance-mode -DSTACKLEAK_PLUGIN -fplugin-arg-stackleak_plugin-track-min-size=100 -fplugin-arg-stackleak_plugin-arch=x86 -I/tmp/B.kh2ccaeq/BUILD/NVIDIA-Linux-x86_64-510.68.02/kernel/common/inc -I/tmp/B.kh2ccaeq/BUILD/NVIDIA-Linux-x86_64-510.68.02/kernel -Wall -MD -Wno-cast-qual -Wno-error -Wno-format-extra-args -D__KERNEL__ -DMODULE -DNVRM -DNV_VERSION_STRING=\"510.68.02\" -Wno-unused-function -Wuninitialized -fno-strict-aliasing -mno-red-zone -mcmodel=kernel -DNV_UVM_ENABLE -DNV_SPECTRE_V2=0 -DNV_KERNEL_INTERFACE_LAYER -I/tmp/B.kh2ccaeq/BUILD/NVIDIA-Linux-x86_64-510.68.02/kernel/nvidia -DNVIDIA_UNDEF_LEGACY_BIT_MACROS -UDEBUG -U_DEBUG -DNDEBUG -DMODULE -DKBUILD_BASENAME='"nv_acpi"' -DKBUILD_MODNAME='"nvidia"' -D__KBUILD_MODNAME=kmod_nvidia -c -o /tmp/B.kh2ccaeq/BUILD/NVIDIA-Linux-x86_64-510.68.02/kernel/nvidia/nv-acpi.o /tmp/B.kh2ccaeq/BUILD/NVIDIA-Linux-x86_64-510.68.02/kernel/nvidia/nv-acpi.c ; ./tools/objtool/objtool orc generate --module --no-fp --retpoline --uaccess /tmp/B.kh2ccaeq/BUILD/NVIDIA-Linux-x86_64-510.68.02/kernel/nvidia/nv-acpi.o cc1: error: incompatible gcc/plugin versions cc1: error: failed to initialize plugin ./scripts/gcc-plugins/stackleak_plugin.so cc1: error: incompatible gcc/plugin versions cc1: error: failed to initialize plugin ./scripts/gcc-plugins/structleak_plugin.so cc1: error: incompatible gcc/plugin versions cc1: error: failed to initialize plugin ./scripts/gcc-plugins/randomize_layout_plugin.so make[2]: *** [scripts/Makefile.build:288: /tmp/B.kh2ccaeq/BUILD/NVIDIA-Linux-x86_64-510.68.02/kernel/nvidia/nv-acpi.o] Error 1 make[1]: *** [Makefile:1831: /tmp/B.kh2ccaeq/BUILD/NVIDIA-Linux-x86_64-510.68.02/kernel] Error 2 make: *** [Makefile:82: modules] Error 2 error: Bad exit status from /tmp/B.kh2ccaeq/BUILD/tmp/rpm-tmp.IAV3v8 (%build) RPM build errors: Could not canonicalize hostname: ymir Bad exit status from /tmp/B.kh2ccaeq/BUILD/tmp/rpm-tmp.IAV3v8 (%build) ended at: Thu Apr 28 16:52:14 2022, done in 0:00:55.869749 error: No files produced. + chmod -R u+rwX /tmp/B.kh2ccaeq/BUILD + rm -rf /tmp/B.kh2ccaeq/tmp /tmp/B.kh2ccaeq/BUILD + rm -rf /tmp/B.kh2ccaeq Begin-PLD-Builder-Info Build-Time: user:130.50s sys:37.90s real:104.26s (faults io:27 non-io:5068120) End-PLD-Builder-Info
[Back to list of logs] [View rpm -qa of builder]