FailedOk

th/SRPMS[OK]
th/x32[OK]
th/i686[OK]
th/x86_64[OK]

ac/SRPMS[OK]
ac/i386[OK]
ac/i586[OK]
ac/i686[OK]
ac/alpha[OK]
ac/amd64[OK]
ac/athlon[OK]
ac/ppc[OK]
ac/sparc[OK]
ac/sparc64[OK]

Advanced Search
main()
Powered by PLD Linux
(c) 2002-2021 PLD Team
$Revision: 1.37 $
Powered by electricity.
Your IP: 52.23.219.12

zeitgeist e56144cc-c5b8-4a3e-ad38-5e03692131f9

Status:Failed
Source URL:https://buildlogs.pld-linux.org/pld/th/x86_64/FAIL/zeitgeist,e56144cc-c5b8-4a3e-ad38-5e03692131f9.bz2
text/plain URL:View!
full text:View!
rpm -qa of builder:View!
Date:2021/11/21 09:19:19
Runtime:0:00:18.652566

Toc:

  • error 1
  • rpm: error: Failed build dependencies:
  • error 2
  • rpm: error: Failed build dependencies:
  • error 3
  • rpm: error: Failed build dependencies:
  • prep
  • Executing(%prep): /bin/sh -e /tmp/B.c9grpdbx/BUILD/tmp/rpm-tmp.YU4du4
  • build
  • Executing(%build): /bin/sh -e /tmp/B.c9grpdbx/BUILD/tmp/rpm-tmp.lNV7oI
  • error 4
  • where-clause.vala:219.35-219.63: error: The name `pdata' does not exist in the context of `GLib.PtrArray*'
  • error 5
  • make[2]: *** [Makefile:1298: libzeitgeist_internal_la_vala.stamp] Error 1
  • error 6
  • make[1]: *** [Makefile:551: all-recursive] Error 1
  • error 7
  • error: Bad exit status from /tmp/B.c9grpdbx/BUILD/tmp/rpm-tmp.lNV7oI (%build)
  • error 8
  • RPM build errors:
  • error 9
  • error: No files produced.

Content:

checking if we should skip the build
started at: Sun Nov 21 09:18:44 2021
killing old processes on a builder
sending signal 9 to pid -1
cleaning up /tmp
fetching https://srcbuilder.pld-linux.org/th//srpms/e56144cc-c5b8-4a3e-ad38-5e03692131f9/zeitgeist-1.0.3-3.src.rpm
fetched 854802 bytes, 2305.8 K/s
installing srpm: zeitgeist-1.0.3-3.src.rpm
+ install -d /tmp/B.c9grpdbx/BUILD /tmp/B.c9grpdbx/RPMS
+ LC_ALL=en_US.UTF-8
+ rpm -qp --changelog zeitgeist-1.0.3-3.src.rpm
* Sat Nov 20 2021 PLD Linux Team <feedback@pld-linux.org>
- For complete changelog see: http://git.pld-linux.org/?p=packages/zeitgeist.git;a=log;h=master
* Sat Nov 20 2021 Jan Rękorajski <baggins@pld-linux.org> b61611e
- rebuild with separate debuginfo build-ids * Sun Feb 28 2021 Jan Rękorajski <baggins@pld-linux.org> 87c1833
- release 2 (by relup.sh) * Sat Feb 27 2021 Jan Palus <atler@pld-linux.org> 67e0975
- unconditional noarch bash/vala subpackages; noarch python3 subpackage * Fri Oct 23 2020 Jan Palus <atler@pld-linux.org> 1e77dad
- up to 1.0.3 * Sun May 19 2019 Jakub Bogusz <qboosh@pld-linux.org> 2c75b57
- updated dependencies, release 2 * Sat Mar 09 2019 Jan Palus <atler@pld-linux.org> 4ff2124
- up to 1.0.2 * Wed Feb 14 2018 Jan Palus <atler@pld-linux.org> ed9efce
- up to 1.0.1 * Fri Apr 28 2017 Jakub Bogusz <qboosh@pld-linux.org> d14ab1c
- release 2 (rebuild with xapian-core 1.4.x) * Mon Apr 10 2017 Jan Palus <atler@pld-linux.org> 3b9419e
- up to 1.0 * Mon Mar 28 2016 Elan Ruusamäe <glen@delfi.ee> 5415db6
- noarch vala subpackage * Sat Nov 28 2015 Jacek Konieczny <jajcus@jajcus.net> 42d3105
- release 2 (by relup.sh) * Wed Jul 15 2015 Jakub Bogusz <qboosh@pld-linux.org> 40bd811
- updated glib2 version * Sun Jul 12 2015 Jan Palus <atler@pld-linux.org> 5b478cd
- up to 0.9.16 * Fri Feb 27 2015 Elan Ruusamäe <glen@delfi.ee> ade8250
- x32 rebuild - release 6 (by relup.sh) * Sun Dec 28 2014 Jan Rękorajski <baggins@pld-linux.org> 1e2ac2a
- updated gettext BR * Sun Dec 07 2014 Arkadiusz Miśkiewicz <arekm@maven.pl> e5bf836
- libffi rebuild - release 5 (by relup.sh) * Sun Jun 22 2014 Jakub Bogusz <qboosh@pld-linux.org> 7104332
- added vala patch (add missing zeitgeist VAPI dependency) - release 4 * Sun Jun 22 2014 Jakub Bogusz <qboosh@pld-linux.org> 6544abd
- moved top zeitgeist data dir to -libs (common dependency for base and python-) * Sat Mar 15 2014 Elan Ruusamäe <glen@delfi.ee> 44f1d5e
- noarch bash completions * Sat Jan 11 2014 Jan Palus <jan.palus@gmail.com> c631b20
- enable zeitgeist-fts - rel 3 + rpm -Uhv --nodeps --define '_topdir /tmp/B.c9grpdbx' --define '_specdir %{_topdir}' --define '_sourcedir %{_specdir}' --define '_rpmdir %{_topdir}/RPMS' --define '_builddir %{_topdir}/BUILD' zeitgeist-1.0.3-3.src.rpm Updating / installing... zeitgeist-1.0.3-3 ######################################## + rm -f zeitgeist-1.0.3-3.src.rpm + install -m 700 -d /tmp/B.c9grpdbx/BUILD/tmp + TMPDIR=/tmp/B.c9grpdbx/BUILD/tmp + exec nice -n 0 rpmbuild -bp --short-circuit --nodeps --define '_topdir /tmp/B.c9grpdbx' --define '_specdir %{_topdir}' --define '_sourcedir %{_specdir}' --define '_rpmdir %{_topdir}/RPMS' --define '_builddir %{_topdir}/BUILD' --target x86_64-pld-linux --define 'prep exit 0' /tmp/B.c9grpdbx/zeitgeist.spec warning: Could not canonicalize hostname: ymir Building target platforms: x86_64-pld-linux Building for target x86_64-pld-linux checking BuildConflict-ing packages rpm: warning: Could not canonicalize hostname: ymir rpm: error: Failed build dependencies: rpm: dee-devel >= 1.0.2 is needed by zeitgeist-1.0.3-3.x86_64 rpm: Building target platforms: x86_64-pld-linux rpm: Building for target x86_64-pld-linux no BuildConflicts found checking BR rpm: warning: Could not canonicalize hostname: ymir rpm: error: Failed build dependencies: rpm: dee-devel >= 1.0.2 is needed by zeitgeist-1.0.3-3.x86_64 rpm: Building target platforms: x86_64-pld-linux rpm: Building for target x86_64-pld-linux updating poldek cache... ready is up to date th is up to date th is up to date th-ready is up to date th-ready is up to date th-test is up to date Retrieving th-test::packages.ndir.diff.toc.gz..............................................done Retrieving diff::packages.ndir.2021.11.21-08.03.01.gz......................................done Loading [pndir]th-test... Applying packages.ndir.2021.11.21-08.03.01.gz... Retrieving diff::packages.ndir.2021.11.21-08.04.02.gz......................................done Applying packages.ndir.2021.11.21-08.04.02.gz... Retrieving diff::packages.ndir.2021.11.21-08.06.02.gz......................................done Applying packages.ndir.2021.11.21-08.06.02.gz... Retrieving diff::packages.ndir.2021.11.21-08.07.01.gz......................................done Applying packages.ndir.2021.11.21-08.07.01.gz... Writing /root/.cache/poldek/[...]/packages.ndir.gz... coq-8.13.1-3.x86_64: capabilities will be splitted due to their size over 64KB coq-8.13.1-3.x86_64: capabilities will be splitted due to their size over 64KB coq-8.13.1-3.x86_64: capabilities will be splitted due to their size over 64KB checking conflicting packages in BRed packages poldek: Loading [pndir]ready... poldek: Loading [pndir]th-test... poldek: Loading [pndir]th-test... poldek: Loading [pndir]th-ready... poldek: Loading [pndir]th-ready... poldek: Loading [pndir]th... poldek: Loading [pndir]th... poldek: 34303 packages read poldek: Removed 3830 duplicate packages from available set poldek: Processing dependencies... poldek: dee-devel-1.2.7-10.x86_64 marks dee-1.2.7-10.x86_64 (cap dee = 1.2.7-10) poldek: There are 2 packages to install (1 marked by dependencies): poldek: A dee-1.2.7-10.x86_64 dee-devel-1.2.7-10.x86_64 poldek: This operation will use 991.3KB of disk space. poldek: Need to get 154.9KB of archives (154.9KB to download). poldek: poldek: Retrieving [1/2] th::dee-1.2.7-10.x86_64.rpm...............................................done poldek: Retrieving [2/2] th::dee-devel-1.2.7-10.x86_64.rpm.........................................done poldek: dee-1.2.7-10.x86_64.rpm: digests OK poldek: dee-devel-1.2.7-10.x86_64.rpm: digests OK poldek: Executing pm-command.sh --upgrade -vh --test --root / --define _check_dirname_deps 0... poldek: warning: /root/.cache/poldek/ftp_ep09.pld-linux.org.dists.th.PLD.x86.64.RPMS/dee-1.2.7-10.x86_64.rpm: Header V4 DSA/SHA1 Signature, key ID e4f1bc2d: NOKEY poldek: Verifying... ######################################## poldek: Preparing... ######################################## no conflicts found checking BR rpm: warning: Could not canonicalize hostname: ymir rpm: error: Failed build dependencies: rpm: dee-devel >= 1.0.2 is needed by zeitgeist-1.0.3-3.x86_64 rpm: Building target platforms: x86_64-pld-linux rpm: Building for target x86_64-pld-linux installing BR: dee\-devel + poldek --noask --caplookup -Q -v '--ignore=hhvm-*' '--ignore=php4-*' '--ignore=php52-*' '--ignore=php54-*' '--ignore=php55-*' '--ignore=php56-*' '--ignore=php70-*' '--ignore=php71-*' '--ignore=php72-*' '--ignore=php73-*' '--ignore=php74-*' '--ignore=php80-*' --upgrade dee-devel Loading [pndir]ready... Loading [pndir]th-test... Loading [pndir]th-test... Loading [pndir]th-ready... Loading [pndir]th-ready... Loading [pndir]th... Loading [pndir]th... 34303 packages read Removed 3830 duplicate packages from available set Processing dependencies... dee-devel-1.2.7-10.x86_64 marks dee-1.2.7-10.x86_64 (cap dee = 1.2.7-10) There are 2 packages to install (1 marked by dependencies): A dee-1.2.7-10.x86_64 dee-devel-1.2.7-10.x86_64 This operation will use 991.3KB of disk space. dee-devel-1.2.7-10.x86_64.rpm: digests OK dee-1.2.7-10.x86_64.rpm: digests OK Need to get 154.9KB of archives. dee-1.2.7-10.x86_64.rpm: digests OK dee-devel-1.2.7-10.x86_64.rpm: digests OK Executing pm-command.sh --upgrade -vh --root / --define _check_dirname_deps 0... warning: /root/.cache/poldek/ftp_ep09.pld-linux.org.dists.th.PLD.x86.64.RPMS/dee-1.2.7-10.x86_64.rpm: Header V4 DSA/SHA1 Signature, key ID e4f1bc2d: NOKEY Verifying... ######################################## Preparing... ######################################## Updating / installing... dee-1.2.7-10 ######################################## dee-devel-1.2.7-10 ######################################## building RPM using: set -ex; : build-id: e56144cc-c5b8-4a3e-ad38-5e03692131f9; TMPDIR=/tmp/B.c9grpdbx/BUILD/tmp exec nice -n 0 rpmbuild -bb --define '_smp_mflags -j9' --define '_make_opts -Otarget' --define '_pld_builder 1' --define '_topdir /tmp/B.c9grpdbx' --define '_specdir %{_topdir}' --define '_sourcedir %{_specdir}' --define '_rpmdir %{_topdir}/RPMS' --define '_builddir %{_topdir}/BUILD' --target x86_64-pld-linux /tmp/B.c9grpdbx/zeitgeist.spec + : build-id: e56144cc-c5b8-4a3e-ad38-5e03692131f9 + TMPDIR=/tmp/B.c9grpdbx/BUILD/tmp + exec nice -n 0 rpmbuild -bb --define '_smp_mflags -j9' --define '_make_opts -Otarget' --define '_pld_builder 1' --define '_topdir /tmp/B.c9grpdbx' --define '_specdir %{_topdir}' --define '_sourcedir %{_specdir}' --define '_rpmdir %{_topdir}/RPMS' --define '_builddir %{_topdir}/BUILD' --target x86_64-pld-linux /tmp/B.c9grpdbx/zeitgeist.spec warning: Could not canonicalize hostname: ymir Building target platforms: x86_64-pld-linux Building for target x86_64-pld-linux Executing(%prep): /bin/sh -e /tmp/B.c9grpdbx/BUILD/tmp/rpm-tmp.YU4du4 + umask 022 + cd /tmp/B.c9grpdbx/BUILD + cd /tmp/B.c9grpdbx/BUILD + rm -rf zeitgeist-1.0.3 + /usr/bin/xz -dc /tmp/B.c9grpdbx/zeitgeist-1.0.3.tar.xz + /bin/tar -xof - + STATUS=0 + '[' 0 -ne 0 ']' + cd zeitgeist-1.0.3 + /bin/chmod -Rf a+rX,u+w,g-w,o-w . + echo 'Patch #0 (zeitgeist-lt.patch):' Patch #0 (zeitgeist-lt.patch): + </tmp/B.c9grpdbx/zeitgeist-lt.patch + /usr/bin/patch -s -p1 '--fuzz=0' + echo 'Patch #1 (zeitgeist-vala.patch):' Patch #1 (zeitgeist-vala.patch): + </tmp/B.c9grpdbx/zeitgeist-vala.patch + /usr/bin/patch -s -p1 '--fuzz=0' + RPM_EC=0 + jobs -p + exit 0 Executing(%build): /bin/sh -e /tmp/B.c9grpdbx/BUILD/tmp/rpm-tmp.lNV7oI TMP=/home/users/builder/tmp HOME=/home/users/builder PATH=/home/users/builder/GNUstep/Tools:/bin:/usr/bin:/usr/local/bin:/home/users/builder/bin TMPDIR=/tmp/B.c9grpdbx/BUILD/tmp + umask 022 + cd /tmp/B.c9grpdbx/BUILD + cd zeitgeist-1.0.3 + gettextize --copy --force --no-changelog Copying file ABOUT-NLS Copying file build-aux/config.rpath Copying file po/Makefile.in.in Copying file po/Makevars.template Copying file po/Rules-quot Copying file po/boldquot.sed Copying file po/en@boldquot.header Copying file po/en@quot.header Copying file po/insert-header.sin Copying file po/quot.sed Copying file po/remove-potcdate.sin Copying file m4/gettext.m4 Copying file m4/host-cpu-c-abi.m4 Copying file m4/iconv.m4 Copying file m4/intlmacosx.m4 Copying file m4/lib-ld.m4 Copying file m4/lib-link.m4 Copying file m4/lib-prefix.m4 Copying file m4/nls.m4 Copying file m4/po.m4 Copying file m4/progtest.m4 Updating configure.ac (backup is in configure.ac~) Please run 'aclocal -I m4' to regenerate the aclocal.m4 file. You need aclocal from GNU automake 1.9 (or newer) to do this. Then run 'autoconf' to regenerate the configure file. You might also want to copy the convenience header file gettext.h from the /usr/share/gettext directory into your package. It is a wrapper around <libintl.h> that implements the configure --disable-nls option. + '[' ! -f po/Makevars ']' + libtoolize --copy --force --install libtoolize: putting auxiliary files in AC_CONFIG_AUX_DIR, 'build-aux'. libtoolize: copying file 'build-aux/config.guess' libtoolize: copying file 'build-aux/config.sub' libtoolize: copying file 'build-aux/install-sh' libtoolize: copying file 'build-aux/ltmain.sh' libtoolize: putting macros in AC_CONFIG_MACRO_DIRS, 'm4'. libtoolize: copying file 'm4/libtool.m4' libtoolize: copying file 'm4/ltoptions.m4' libtoolize: copying file 'm4/ltsugar.m4' libtoolize: copying file 'm4/ltversion.m4' libtoolize: copying file 'm4/lt~obsolete.m4' + aclocal + autoconf + autoheader + automake -a -c -f --foreign configure.ac:16: installing 'build-aux/compile' configure.ac:11: installing 'build-aux/missing' datahub/Makefile.am: installing 'build-aux/depcomp' extensions/fts++/test/Makefile.am:18: warning: source file '$(srcdir)/../stringutils.cpp' is in a subdirectory, extensions/fts++/test/Makefile.am:18: but option 'subdir-objects' is disabled automake: warning: possible forward-incompatibility. automake: At least a source file is in a subdirectory, but the 'subdir-objects' automake: automake option hasn't been enabled. For now, the corresponding output automake: object file(s) will be placed in the top-level directory. However, automake: this behaviour will change in future Automake versions: they will automake: unconditionally cause object files to be placed in the same subdirectory automake: of the corresponding sources. automake: You are advised to start using 'subdir-objects' option throughout your automake: project, to avoid future incompatibilities. extensions/fts++/test/Makefile.am:18: warning: source file '$(srcdir)/../controller.cpp' is in a subdirectory, extensions/fts++/test/Makefile.am:18: but option 'subdir-objects' is disabled extensions/fts++/test/Makefile.am:18: warning: source file '$(srcdir)/../indexer.cpp' is in a subdirectory, extensions/fts++/test/Makefile.am:18: but option 'subdir-objects' is disabled extensions/fts++/test/Makefile.am:18: warning: source file '$(srcdir)/../task.cpp' is in a subdirectory, extensions/fts++/test/Makefile.am:18: but option 'subdir-objects' is disabled extensions/fts++/test/Makefile.am:18: warning: source file '$(srcdir)/../fts.cpp' is in a subdirectory, extensions/fts++/test/Makefile.am:18: but option 'subdir-objects' is disabled + ./configure 'LDFLAGS=-Wl,--as-needed -Wl,--no-copy-dt-needed-entries -Wl,-z,relro -Wl,-z,combreloc ' 'CFLAGS=-O2 -fwrapv -pipe -Wformat -Werror=format-security -gdwarf-4 -fno-debug-types-section -fvar-tracking-assignments -g2 -Wp,-D_FORTIFY_SOURCE=2 -fstack-protector-strong --param=ssp-buffer-size=4 -Werror=trampolines -fPIC -march=x86-64 -mtune=generic -gdwarf-4 -fno-debug-types-section -fvar-tracking-assignments -g2 ' 'CXXFLAGS=-O2 -fwrapv -pipe -Wformat -Werror=format-security -gdwarf-4 -fno-debug-types-section -fvar-tracking-assignments -g2 -Wp,-D_FORTIFY_SOURCE=2 -fstack-protector-strong --param=ssp-buffer-size=4 -Werror=trampolines -fPIC -march=x86-64 -mtune=generic -gdwarf-4 -fno-debug-types-section -fvar-tracking-assignments -g2 ' 'FFLAGS=-O2 -fwrapv -pipe -Wformat -Werror=format-security -gdwarf-4 -fno-debug-types-section -fvar-tracking-assignments -g2 -Wp,-D_FORTIFY_SOURCE=2 -fstack-protector-strong --param=ssp-buffer-size=4 -Werror=trampolines -fPIC -march=x86-64 -mtune=generic -gdwarf-4 -fno-debug-types-section -fvar-tracking-assignments -g2 ' 'FCFLAGS=-O2 -fwrapv -pipe -Wformat -Werror=format-security -gdwarf-4 -fno-debug-types-section -fvar-tracking-assignments -g2 -Wp,-D_FORTIFY_SOURCE=2 -fstack-protector-strong --param=ssp-buffer-size=4 -Werror=trampolines -fPIC -march=x86-64 -mtune=generic -gdwarf-4 -fno-debug-types-section -fvar-tracking-assignments -g2 ' 'CPPFLAGS=' 'CC=x86_64-pld-linux-gcc' 'CXX=x86_64-pld-linux-g++' '--host=x86_64-pld-linux' '--build=x86_64-pld-linux' '--prefix=/usr' '--exec-prefix=/usr' '--bindir=/usr/bin' '--sbindir=/usr/sbin' '--sysconfdir=/etc' '--datadir=/usr/share' '--includedir=/usr/include' '--libdir=/usr/lib64' '--libexecdir=/usr/libexec' '--localstatedir=/var' '--sharedstatedir=/var/lib' '--mandir=/usr/share/man' '--infodir=/usr/share/info' '--x-libraries=/usr/lib64' --disable-silent-rules --enable-fts checking for a BSD-compatible install... /usr/bin/install -c checking whether build environment is sane... yes checking for a race-free mkdir -p... /bin/mkdir -p checking for mawk... mawk checking whether make sets $(MAKE)... yes checking whether make supports nested variables... yes checking whether UID '1000' is supported by ustar format... yes checking whether GID '1000' is supported by ustar format... yes checking how to create a ustar tar archive... gnutar checking whether to enable maintainer-specific portions of Makefiles... yes checking for a Python interpreter with version >= 3... python3 checking for python3... /usr/bin/python3 checking for python3 version... 3.9 checking for python3 platform... linux checking for python3 script directory... ${prefix}/share/python3.9/site-packages checking for python3 extension module directory... ${exec_prefix}/lib64/python3.9/site-packages checking for x86_64-pld-linux-gcc... x86_64-pld-linux-gcc checking whether the C compiler works... yes checking for C compiler default output file name... a.out checking for suffix of executables... checking whether we are cross compiling... no checking for suffix of object files... o checking whether the compiler supports GNU C... yes checking whether x86_64-pld-linux-gcc accepts -g... yes checking for x86_64-pld-linux-gcc option to enable C11 features... none needed checking whether x86_64-pld-linux-gcc understands -c and -o together... yes checking whether make supports the include directive... yes (GNU style) checking dependency style of x86_64-pld-linux-gcc... gcc3 checking whether the compiler supports GNU C++... yes checking whether x86_64-pld-linux-g++ accepts -g... yes checking for x86_64-pld-linux-g++ option to enable C++11 features... none needed checking dependency style of x86_64-pld-linux-g++... gcc3 checking whether x86_64-pld-linux-g++ understands -c and -o together... yes checking build system type... x86_64-pld-linux-gnu checking host system type... x86_64-pld-linux-gnu checking how to print strings... print -r checking for a sed that does not truncate output... /bin/sed checking for grep that handles long lines and -e... /bin/grep checking for egrep... /bin/grep -E checking for fgrep... /bin/grep -F checking for ld used by x86_64-pld-linux-gcc... /usr/bin/ld checking if the linker (/usr/bin/ld) is GNU ld... yes checking for BSD- or MS-compatible name lister (nm)... /usr/bin/nm -B checking the name lister (/usr/bin/nm -B) interface... BSD nm checking whether ln -s works... yes checking the maximum length of command line arguments... 1572864 checking how to convert x86_64-pld-linux-gnu file names to x86_64-pld-linux-gnu format... func_convert_file_noop checking how to convert x86_64-pld-linux-gnu file names to toolchain format... func_convert_file_noop checking for /usr/bin/ld option to reload object files... -r checking for x86_64-pld-linux-objdump... no checking for objdump... objdump checking how to recognize dependent libraries... pass_all checking for x86_64-pld-linux-dlltool... no checking for dlltool... no checking how to associate runtime and link libraries... print -r -- checking for x86_64-pld-linux-ar... no checking for ar... ar checking for archiver @FILE support... @ checking for x86_64-pld-linux-strip... no checking for strip... strip checking for x86_64-pld-linux-ranlib... no checking for ranlib... ranlib checking command to parse /usr/bin/nm -B output from x86_64-pld-linux-gcc object... ok checking for sysroot... no checking for a working dd... /bin/dd checking how to truncate binary pipes... /bin/dd bs=4096 count=1 checking for x86_64-pld-linux-mt... no checking for mt... no checking if : is a manifest tool... no checking for stdio.h... yes checking for stdlib.h... yes checking for string.h... yes checking for inttypes.h... yes checking for stdint.h... yes checking for strings.h... yes checking for sys/stat.h... yes checking for sys/types.h... yes checking for unistd.h... yes checking for dlfcn.h... yes checking for objdir... .libs checking if x86_64-pld-linux-gcc supports -fno-rtti -fno-exceptions... no checking for x86_64-pld-linux-gcc option to produce PIC... -fPIC -DPIC checking if x86_64-pld-linux-gcc PIC flag -fPIC -DPIC works... yes checking if x86_64-pld-linux-gcc static flag -static works... yes checking if x86_64-pld-linux-gcc supports -c -o file.o... yes checking if x86_64-pld-linux-gcc supports -c -o file.o... (cached) yes checking whether the x86_64-pld-linux-gcc linker (/usr/bin/ld -m elf_x86_64) supports shared libraries... yes checking whether -lc should be explicitly linked in... no checking dynamic linker characteristics... GNU/Linux ld.so checking how to hardcode library paths into programs... immediate checking whether stripping libraries is possible... yes checking if libtool supports shared libraries... yes checking whether to build shared libraries... yes checking whether to build static libraries... no checking how to run the C++ preprocessor... x86_64-pld-linux-g++ -E checking for ld used by x86_64-pld-linux-g++... /usr/bin/ld -m elf_x86_64 checking if the linker (/usr/bin/ld -m elf_x86_64) is GNU ld... yes checking whether the x86_64-pld-linux-g++ linker (/usr/bin/ld -m elf_x86_64) supports shared libraries... yes checking for x86_64-pld-linux-g++ option to produce PIC... -fPIC -DPIC checking if x86_64-pld-linux-g++ PIC flag -fPIC -DPIC works... yes checking if x86_64-pld-linux-g++ static flag -static works... yes checking if x86_64-pld-linux-g++ supports -c -o file.o... yes checking if x86_64-pld-linux-g++ supports -c -o file.o... (cached) yes checking whether the x86_64-pld-linux-g++ linker (/usr/bin/ld -m elf_x86_64) supports shared libraries... yes checking dynamic linker characteristics... (cached) GNU/Linux ld.so checking how to hardcode library paths into programs... immediate checking for x86_64-pld-linux-pkg-config... no checking for pkg-config... /usr/bin/pkg-config checking pkg-config is at least version 0.21... yes checking for valac... /usr/bin/valac checking whether /usr/bin/valac supports at least API version 0.22.0... yes checking whether make supports nested variables... (cached) yes checking whether NLS is requested... yes checking for msgfmt... /usr/bin/msgfmt checking for gmsgfmt... /usr/bin/msgfmt checking for xgettext... /usr/bin/xgettext checking for msgmerge... /usr/bin/msgmerge checking for ld... /usr/bin/ld -m elf_x86_64 checking if the linker (/usr/bin/ld -m elf_x86_64) is GNU ld... yes checking for shared library run path origin... done checking 32-bit host C ABI... no checking how to run the C preprocessor... x86_64-pld-linux-gcc -E checking for ELF binary format... yes checking for the common suffixes of directories in the library search path... lib,lib,lib64 checking for CFPreferencesCopyAppValue... no checking for CFLocaleCopyPreferredLanguages... no checking for GNU gettext in libc... yes checking whether to use NLS... yes checking where the gettext function comes from... libc checking for glib-2.0 >= 2.35.4 gobject-2.0 >= 2.35.4 gmodule-2.0 >= 2.35.4 gio-unix-2.0 >= 2.35.4 sqlite3 >= 3.7.11... yes checking for dee-icu-1.0 >= 1.0.2... yes checking for xapian-config... yes checking for telepathy-glib >= 0.18.0... yes checking for glib-2.0 >= 2.35.4 gobject-2.0 >= 2.35.4 gio-2.0 >= 2.35.4 gio-unix-2.0 >= 2.35.4 gtk+-3.0 >= 3.0.0 json-glib-1.0 >= 0.14.0 telepathy-glib >= 0.18.0... yes checking for gobject-introspection... yes checking for python3-rdflib... yes checking that generated files are newer than configure... done configure: creating ./config.status config.status: creating Makefile config.status: creating src/Makefile config.status: creating libzeitgeist/Makefile config.status: creating libzeitgeist/zeitgeist-2.0.pc config.status: creating datahub/Makefile config.status: creating extensions/Makefile config.status: creating extensions/fts++/Makefile config.status: creating extensions/fts++/test/Makefile config.status: creating data/Makefile config.status: creating data/ontology/Makefile config.status: creating python/Makefile config.status: creating test/Makefile config.status: creating test/dbus/Makefile config.status: creating test/direct/Makefile config.status: creating test/c/Makefile config.status: creating test/data/Makefile config.status: creating examples/Makefile config.status: creating examples/c/Makefile config.status: creating examples/vala/Makefile config.status: creating doc/Makefile config.status: creating doc/libzeitgeist/Makefile config.status: creating po/Makefile.in config.status: creating config.h config.status: executing depfiles commands config.status: executing libtool commands config.status: executing po-directories commands config.status: creating po/POTFILES config.status: creating po/Makefile zeitgeist-1.0.3 Build environment Install Prefix: /usr Optional dependencies fts++: yes dee-icu: yes Other build options: DataHub: yes Telepathy provider: yes Downloads monitor: yes SQL debugging: no libzeitgeist docs: no GObject Introspection: yes + /usr/bin/make -Otarget -j9 /usr/bin/make all-recursive Making all in libzeitgeist make[2]: Entering directory '/tmp/B.c9grpdbx/BUILD/zeitgeist-1.0.3/libzeitgeist' /usr/bin/valac \ --target-glib=2.36 --pkg gio-2.0 --pkg gio-unix-2.0 --pkg sqlite3 ../config.vapi -C --vapi zeitgeist-datamodel-2.0.vapi -H zeitgeist-datamodel.h --library zeitgeist-2.0 \ data-source.vala errors.vala mimetype.vala enumerations.vala event.vala subject.vala timerange.vala timestamp.vala ontology-uris.vala ontology.vala result-set.vala simple-result-set.vala utils.vala event.vala:250.24-250.56: warning: Access to possible `null'. Perform a check or use an unsafe cast. path = (info as DesktopAppInfo).filename; ^^^^^^^^^^^^^^^^^^^^^^^^^^^^^^^^^ timestamp.vala:77.32-77.46: warning: `GLib.TimeVal' has been deprecated since 2.62 timestamp.vala:95.27-95.33: warning: `GLib.TimeVal' has been deprecated since 2.62 timestamp.vala:95.17-95.23: warning: `GLib.TimeVal' has been deprecated since 2.62 timestamp.vala:122.27-122.33: warning: `GLib.TimeVal' has been deprecated since 2.62 timestamp.vala:122.17-122.23: warning: `GLib.TimeVal' has been deprecated since 2.62 timestamp.vala:139.17-139.23: warning: `GLib.TimeVal' has been deprecated since 2.62 timestamp.vala:185.17-185.23: warning: `GLib.TimeVal' has been deprecated since 2.62 timestamp.vala:186.9-186.25: warning: `GLib.Date.set_time_val' has been deprecated since 2.62 errors.vala:39.5-39.43: warning: Method `Zeitgeist.vala_bug_workaround' never used private static void vala_bug_workaround () ^^^^^^^^^^^^^^^^^^^^^^^^^^^^^^^^^^^^^^^ event.vala:299.5-299.47: warning: Method `Zeitgeist.Event.optimize_variant_allocation' never used private Variant optimize_variant_allocation (Variant event_variant) { ^^^^^^^^^^^^^^^^^^^^^^^^^^^^^^^^^^^^^^^^^^^ Compilation succeeded - 11 warning(s) touch libzeitgeist_datamodel_2_0_la_vala.stamp make[2]: Leaving directory '/tmp/B.c9grpdbx/BUILD/zeitgeist-1.0.3/libzeitgeist' make[2]: Entering directory '/tmp/B.c9grpdbx/BUILD/zeitgeist-1.0.3/libzeitgeist' /usr/bin/valac \ --target-glib=2.36 --pkg gio-2.0 --pkg gio-unix-2.0 --pkg sqlite3 ../config.vapi -C ./zeitgeist-datamodel-2.0.vapi --vapi zeitgeist-internal.vapi -H zeitgeist-internal.h \ db-reader.vala sql.vala sql-schema.vala table-lookup.vala where-clause.vala sql.vala:456.13-457.55: warning: unhandled error `Zeitgeist.EngineError' where-clause.vala:219.35-219.63: error: The name `pdata' does not exist in the context of `GLib.PtrArray*' Memory.copy(pointers, ((PtrArray *) gptrarr)->pdata, ^^^^^^^^^^^^^^^^^^^^^^^^^^^^^ Compilation failed: 1 error(s), 1 warning(s) make[2]: *** [Makefile:1298: libzeitgeist_internal_la_vala.stamp] Error 1 make[2]: Leaving directory '/tmp/B.c9grpdbx/BUILD/zeitgeist-1.0.3/libzeitgeist' make[1]: *** [Makefile:551: all-recursive] Error 1 make: *** [Makefile:462: all] Error 2 error: Bad exit status from /tmp/B.c9grpdbx/BUILD/tmp/rpm-tmp.lNV7oI (%build) RPM build errors: Could not canonicalize hostname: ymir Bad exit status from /tmp/B.c9grpdbx/BUILD/tmp/rpm-tmp.lNV7oI (%build) ended at: Sun Nov 21 09:19:19 2021, done in 0:00:18.652566 error: No files produced. + chmod -R u+rwX /tmp/B.c9grpdbx/BUILD + rm -rf /tmp/B.c9grpdbx/tmp /tmp/B.c9grpdbx/BUILD + rm -rf /tmp/B.c9grpdbx Begin-PLD-Builder-Info Build-Time: user:23.22s sys:5.43s real:35.80s (faults io:25 non-io:1415244) End-PLD-Builder-Info
[Back to list of logs] [View rpm -qa of builder]