FailedOk

th/SRPMS[OK]
th/x32[OK]
th/i686[OK]
th/x86_64[OK]

ac/SRPMS[OK]
ac/i386[OK]
ac/i586[OK]
ac/i686[OK]
ac/alpha[OK]
ac/amd64[OK]
ac/athlon[OK]
ac/ppc[OK]
ac/sparc[OK]
ac/sparc64[OK]

Advanced Search
main()
Powered by PLD Linux
(c) 2002-2021 PLD Team
$Revision: 1.37 $
Powered by Joe.
Your IP: 44.197.197.23

zfs 945e193e-5c59-4319-a82f-6f99c05a6fbf

Status:Failed
Source URL:https://buildlogs.pld-linux.org/pld/th/x86_64/FAIL/zfs,945e193e-5c59-4319-a82f-6f99c05a6fbf.bz2
text/plain URL:View!
rpm -qa of builder:View!
Date:2021/09/07 09:48:18
Runtime:0:05:16.358564

Toc:

  • prep
  • Executing(%prep): /bin/sh -e /tmp/B.u6el52es/BUILD/tmp/rpm-tmp.MNj1OX
  • build
  • Executing(%build): /bin/sh -e /tmp/B.u6el52es/BUILD/tmp/rpm-tmp.5dAh4w
  • error 1
  • /tmp/B.u6el52es/BUILD/zfs-2.0.5/module/zfs/../os/linux/zfs/zvol_os.c:763:26: error: implicit declaration of function 'blk_alloc_queue'; did you mean 'blk_sync_queue'? [-Werror=implicit-function-declaration]
  • error 2
  • make[5]: *** [scripts/Makefile.build:271: /tmp/B.u6el52es/BUILD/zfs-2.0.5/module/zfs/../os/linux/zfs/zvol_os.o] Error 1
  • error 3
  • make[4]: *** [scripts/Makefile.build:514: /tmp/B.u6el52es/BUILD/zfs-2.0.5/module/zfs] Error 2
  • error 4
  • make[3]: *** [Makefile:1851: /tmp/B.u6el52es/BUILD/zfs-2.0.5/module] Error 2
  • error 5
  • make[2]: *** [Makefile:49: modules-Linux] Error 2
  • error 6
  • make[1]: *** [Makefile:892: all-recursive] Error 1
  • error 7
  • error: Bad exit status from /tmp/B.u6el52es/BUILD/tmp/rpm-tmp.5dAh4w (%build)
  • error 8
  • RPM build errors:
  • error 9
  • error: No files produced.

Content:

request from: baggins
checking if we should skip the build
started at: Tue Sep  7 09:42:42 2021
killing old processes on a builder
sending signal 9 to pid -1
cleaning up /tmp
fetching https://srcbuilder.pld-linux.org/th//srpms/945e193e-5c59-4319-a82f-6f99c05a6fbf/zfs-kernel-2.0.5-1%405.14.1_1.src.rpm
fetched 13027839 bytes, 16658.8 K/s
installing srpm: zfs-kernel-2.0.5-1@5.14.1_1.src.rpm
+ install -d /tmp/B.u6el52es/BUILD /tmp/B.u6el52es/RPMS
+ LC_ALL=en_US.UTF-8
+ rpm -qp --changelog zfs-kernel-2.0.5-1@5.14.1_1.src.rpm
* Tue Sep 07 2021 PLD Linux Team <feedback@pld-linux.org>
- For complete changelog see: http://git.pld-linux.org/?p=packages/zfs.git;a=log;h=master
* Fri Jul 02 2021 Jan Rękorajski <baggins@pld-linux.org> c21d951
- up to 2.0.5 * Mon May 03 2021 Jan Rękorajski <baggins@pld-linux.org> 0b2b52b
- fixes for building with kernel 5.12, rel 2 * Sat Mar 13 2021 Jan Rękorajski <baggins@pld-linux.org> 74936f0
- up to 2.0.4 * Wed Mar 03 2021 Jan Rękorajski <baggins@pld-linux.org> 05190e6
- release 3 (by relup.sh) * Sat Feb 06 2021 Jan Rękorajski <baggins@pld-linux.org> 2008335
- fix files, rel 2 * Sat Feb 06 2021 Jan Rękorajski <baggins@pld-linux.org> 0ec7471
- up to 2.0.2 * Mon Dec 28 2020 Jakub Bogusz <qboosh@pld-linux.org> efbd975
- pl for pam- - libtirpc is required now (for glibc 2.32+) - sorted man pages, check-files cleanup * Fri Dec 25 2020 Jan Rękorajski <baggins@pld-linux.org> fb4e6df
- BR pam-devel * Fri Dec 25 2020 Jan Rękorajski <baggins@pld-linux.org> 499b6b3
- updated files - added pam_zfs_key package - rel 1 * Fri Dec 25 2020 Jan Rękorajski <baggins@pld-linux.org> 73a8807
- started update to 2.0.0, lots of unpackaged files * Wed Oct 21 2020 Jan Rękorajski <baggins@pld-linux.org> 92a9ea6
- up to 0.8.5 * Sun Aug 16 2020 Jan Rękorajski <baggins@pld-linux.org> b2ee62c
- release 2 (by relup.sh) * Sun Aug 16 2020 Jan Rękorajski <baggins@pld-linux.org> 597c77d
- fix building with kernel 5.8 * Sun May 31 2020 Jakub Bogusz <qboosh@pld-linux.org> 9a52de1
- updated to 0.8.4 - removed obsolete kernel-5.6 patch * Sun Apr 05 2020 Jan Rękorajski <baggins@pld-linux.org> c6c7714
- up to 0.8.3 - upstream fixes for kernel 5.6 - more bashizm removed - fix linking libnvpair (missing aok symbol) - shebang fixes * Sun Dec 01 2019 Jan Rękorajski <baggins@pld-linux.org> f390918
- up to 0.8.2 * Thu Oct 31 2019 Jan Rękorajski <baggins@pld-linux.org> 46c9785
- release 5 (by relup.sh) * Mon Oct 28 2019 Jan Rękorajski <baggins@pld-linux.org> caf5d53
- rebuild with python 3.8 - release 4 (by relup.sh) * Wed Sep 18 2019 Jan Rękorajski <baggins@pld-linux.org> 137ebc1
- fix build with kernel 5.3 - rel 3 * Wed Sep 18 2019 Jan Rękorajski <baggins@pld-linux.org> 2ce6242
- rel 2 + rpm -Uhv --nodeps --define '_topdir /tmp/B.u6el52es' --define '_specdir %{_topdir}' --define '_sourcedir %{_specdir}' --define '_rpmdir %{_topdir}/RPMS' --define '_builddir %{_topdir}/BUILD' --without userspace --define 'build_kernels 4.14,head,5.4,4.9,5.10,4.19' zfs-kernel-2.0.5-1@5.14.1_1.src.rpm Updating / installing... zfs-kernel-2.0.5-1@5.14.1_1 ######################################## + rm -f zfs-kernel-2.0.5-1@5.14.1_1.src.rpm + install -m 700 -d /tmp/B.u6el52es/BUILD/tmp + TMPDIR=/tmp/B.u6el52es/BUILD/tmp + exec nice -n 0 rpmbuild -bp --short-circuit --nodeps --define '_topdir /tmp/B.u6el52es' --define '_specdir %{_topdir}' --define '_sourcedir %{_specdir}' --define '_rpmdir %{_topdir}/RPMS' --define '_builddir %{_topdir}/BUILD' --without userspace --target x86_64-pld-linux --define 'build_kernels 4.14,head,5.4,4.9,5.10,4.19' --define 'prep exit 0' /tmp/B.u6el52es/zfs.spec warning: Could not canonicalize hostname: ymir Building target platforms: x86_64-pld-linux Building for target x86_64-pld-linux checking BuildConflict-ing packages rpm: warning: Could not canonicalize hostname: ymir rpm: Building target platforms: x86_64-pld-linux rpm: Building for target x86_64-pld-linux no BuildConflicts found checking BR rpm: warning: Could not canonicalize hostname: ymir rpm: Building target platforms: x86_64-pld-linux rpm: Building for target x86_64-pld-linux no BR needed building RPM using: set -ex; : build-id: 945e193e-5c59-4319-a82f-6f99c05a6fbf; TMPDIR=/tmp/B.u6el52es/BUILD/tmp exec nice -n 0 rpmbuild -bb --define '_smp_mflags -j9' --define '_make_opts -Otarget' --define '_pld_builder 1' --define '_topdir /tmp/B.u6el52es' --define '_specdir %{_topdir}' --define '_sourcedir %{_specdir}' --define '_rpmdir %{_topdir}/RPMS' --define '_builddir %{_topdir}/BUILD' --without userspace --target x86_64-pld-linux --define 'build_kernels 4.14,head,5.4,4.9,5.10,4.19' /tmp/B.u6el52es/zfs.spec + : build-id: 945e193e-5c59-4319-a82f-6f99c05a6fbf + TMPDIR=/tmp/B.u6el52es/BUILD/tmp + exec nice -n 0 rpmbuild -bb --define '_smp_mflags -j9' --define '_make_opts -Otarget' --define '_pld_builder 1' --define '_topdir /tmp/B.u6el52es' --define '_specdir %{_topdir}' --define '_sourcedir %{_specdir}' --define '_rpmdir %{_topdir}/RPMS' --define '_builddir %{_topdir}/BUILD' --without userspace --target x86_64-pld-linux --define 'build_kernels 4.14,head,5.4,4.9,5.10,4.19' /tmp/B.u6el52es/zfs.spec warning: Could not canonicalize hostname: ymir Building target platforms: x86_64-pld-linux Building for target x86_64-pld-linux Executing(%prep): /bin/sh -e /tmp/B.u6el52es/BUILD/tmp/rpm-tmp.MNj1OX + umask 022 + cd /tmp/B.u6el52es/BUILD + cd /tmp/B.u6el52es/BUILD + rm -rf zfs-2.0.5 + /bin/gzip -dc /tmp/B.u6el52es/zfs-2.0.5.tar.gz + /bin/tar -xof - + STATUS=0 + '[' 0 -ne 0 ']' + cd zfs-2.0.5 + /bin/chmod -Rf a+rX,u+w,g-w,o-w . + echo 'Patch #0 (initdir.patch):' Patch #0 (initdir.patch): + </tmp/B.u6el52es/initdir.patch + /usr/bin/patch -s -p1 '--fuzz=0' + echo 'Patch #1 (am.patch):' Patch #1 (am.patch): + </tmp/B.u6el52es/am.patch + /usr/bin/patch -s -p1 '--fuzz=0' + /bin/sed -E -i -e '1s,#!\s*/usr/bin/env\s+python2(\s|$),#!/usr/bin/python2\1,' cmd/arc_summary/arc_summary2 + /bin/sed -E -i -e '1s,#!\s*/usr/bin/env\s+python3(\s|$),#!/usr/bin/python3\1,' cmd/arc_summary/arc_summary3 + /bin/sed -E -i -e '1s,#!\s*/usr/bin/env\s+@PYTHON_SHEBANG@(\s|$),#!/usr/bin/python3\1,' cmd/arcstat/arcstat.in cmd/dbufstat/dbufstat.in + /bin/sed -E -i -e '1s,#!\s*/usr/bin/env\s+bash(\s|$),#!/bin/bash\1,' contrib/dracut/02zfsexpandknowledge/module-setup.sh.in contrib/dracut/90zfs/module-setup.sh.in scripts/zimport.sh scripts/zloop.sh + RPM_EC=0 + jobs -p + exit 0 Executing(%build): /bin/sh -e /tmp/B.u6el52es/BUILD/tmp/rpm-tmp.5dAh4w TMP=/home/users/builder/tmp HOME=/home/users/builder PATH=/home/users/builder/GNUstep/Tools:/bin:/usr/bin:/usr/local/bin:/home/users/builder/bin TMPDIR=/tmp/B.u6el52es/BUILD/tmp + umask 022 + cd /tmp/B.u6el52es/BUILD + cd zfs-2.0.5 + libtoolize --copy --force --install libtoolize: putting auxiliary files in AC_CONFIG_AUX_DIR, 'config'. libtoolize: copying file 'config/config.guess' libtoolize: copying file 'config/config.sub' libtoolize: copying file 'config/install-sh' libtoolize: copying file 'config/ltmain.sh' libtoolize: putting macros in AC_CONFIG_MACRO_DIRS, 'config'. libtoolize: copying file 'config/libtool.m4' libtoolize: copying file 'config/ltoptions.m4' libtoolize: copying file 'config/ltsugar.m4' libtoolize: copying file 'config/ltversion.m4' libtoolize: copying file 'config/lt~obsolete.m4' + aclocal -I config + autoconf + autoheader + automake -a -c -f --foreign configure.ac:48: installing 'config/compile' configure.ac:42: installing 'config/missing' cmd/mount_zfs/Makefile.am: installing 'config/depcomp' + ./configure 'LDFLAGS=-Wl,--as-needed -Wl,--no-copy-dt-needed-entries -Wl,-z,relro -Wl,-z,combreloc ' 'CFLAGS=-O2 -fwrapv -pipe -Wformat -Werror=format-security -Wp,-D_FORTIFY_SOURCE=2 -fstack-protector-strong --param=ssp-buffer-size=4 -Werror=trampolines -fPIC -march=x86-64 -mtune=generic ' 'CXXFLAGS=-O2 -fwrapv -pipe -Wformat -Werror=format-security -Wp,-D_FORTIFY_SOURCE=2 -fstack-protector-strong --param=ssp-buffer-size=4 -Werror=trampolines -fPIC -march=x86-64 -mtune=generic ' 'FFLAGS=-O2 -fwrapv -pipe -Wformat -Werror=format-security -Wp,-D_FORTIFY_SOURCE=2 -fstack-protector-strong --param=ssp-buffer-size=4 -Werror=trampolines -fPIC -march=x86-64 -mtune=generic ' 'FCFLAGS=-O2 -fwrapv -pipe -Wformat -Werror=format-security -Wp,-D_FORTIFY_SOURCE=2 -fstack-protector-strong --param=ssp-buffer-size=4 -Werror=trampolines -fPIC -march=x86-64 -mtune=generic ' 'CPPFLAGS=' 'CC=x86_64-pld-linux-gcc' 'CXX=x86_64-pld-linux-g++' '--host=x86_64-pld-linux' '--build=x86_64-pld-linux' '--prefix=/usr' '--exec-prefix=/usr' '--bindir=/usr/bin' '--sbindir=/usr/sbin' '--sysconfdir=/etc' '--datadir=/usr/share' '--includedir=/usr/include' '--libdir=/usr/lib64' '--libexecdir=/usr/libexec' '--localstatedir=/var' '--sharedstatedir=/var/lib' '--mandir=/usr/share/man' '--infodir=/usr/share/info' '--x-libraries=/usr/lib64' --disable-silent-rules '--with-config=kernel' '--with-linux=/usr/src/linux-4.14' '--with-linux-obj=/usr/src/linux-4.14' checking for mawk... mawk checking metadata... META file checking build system type... x86_64-pld-linux-gnu checking host system type... x86_64-pld-linux-gnu checking target system type... x86_64-pld-linux-gnu checking whether to enable maintainer-specific portions of Makefiles... no checking whether make supports nested variables... yes checking for a BSD-compatible install... /usr/bin/install -c checking whether build environment is sane... yes checking for a race-free mkdir -p... /bin/mkdir -p checking whether make sets $(MAKE)... yes checking how to print strings... print -r checking whether make supports the include directive... yes (GNU style) checking for x86_64-pld-linux-gcc... x86_64-pld-linux-gcc checking whether the C compiler works... yes checking for C compiler default output file name... a.out checking for suffix of executables... checking whether we are cross compiling... no checking for suffix of object files... o checking whether the compiler supports GNU C... yes checking whether x86_64-pld-linux-gcc accepts -g... yes checking for x86_64-pld-linux-gcc option to enable C11 features... none needed checking whether x86_64-pld-linux-gcc understands -c and -o together... yes checking dependency style of x86_64-pld-linux-gcc... gcc3 checking for a sed that does not truncate output... /bin/sed checking for grep that handles long lines and -e... /bin/grep checking for egrep... /bin/grep -E checking for fgrep... /bin/grep -F checking for ld used by x86_64-pld-linux-gcc... /usr/bin/ld checking if the linker (/usr/bin/ld) is GNU ld... yes checking for BSD- or MS-compatible name lister (nm)... /usr/bin/nm -B checking the name lister (/usr/bin/nm -B) interface... BSD nm checking whether ln -s works... yes checking the maximum length of command line arguments... 1572864 checking how to convert x86_64-pld-linux-gnu file names to x86_64-pld-linux-gnu format... func_convert_file_noop checking how to convert x86_64-pld-linux-gnu file names to toolchain format... func_convert_file_noop checking for /usr/bin/ld option to reload object files... -r checking for x86_64-pld-linux-objdump... no checking for objdump... objdump checking how to recognize dependent libraries... pass_all checking for x86_64-pld-linux-dlltool... no checking for dlltool... no checking how to associate runtime and link libraries... print -r -- checking for x86_64-pld-linux-ar... no checking for ar... ar checking for archiver @FILE support... @ checking for x86_64-pld-linux-strip... no checking for strip... strip checking for x86_64-pld-linux-ranlib... no checking for ranlib... ranlib checking command to parse /usr/bin/nm -B output from x86_64-pld-linux-gcc object... ok checking for sysroot... no checking for a working dd... /bin/dd checking how to truncate binary pipes... /bin/dd bs=4096 count=1 checking for x86_64-pld-linux-mt... no checking for mt... no checking if : is a manifest tool... no checking for stdio.h... yes checking for stdlib.h... yes checking for string.h... yes checking for inttypes.h... yes checking for stdint.h... yes checking for strings.h... yes checking for sys/stat.h... yes checking for sys/types.h... yes checking for unistd.h... yes checking for dlfcn.h... yes checking for objdir... .libs checking if x86_64-pld-linux-gcc supports -fno-rtti -fno-exceptions... no checking for x86_64-pld-linux-gcc option to produce PIC... -fPIC -DPIC checking if x86_64-pld-linux-gcc PIC flag -fPIC -DPIC works... yes checking if x86_64-pld-linux-gcc static flag -static works... yes checking if x86_64-pld-linux-gcc supports -c -o file.o... yes checking if x86_64-pld-linux-gcc supports -c -o file.o... (cached) yes checking whether the x86_64-pld-linux-gcc linker (/usr/bin/ld -m elf_x86_64) supports shared libraries... yes checking whether -lc should be explicitly linked in... no checking dynamic linker characteristics... GNU/Linux ld.so checking how to hardcode library paths into programs... immediate checking whether stripping libraries is possible... yes checking if libtool supports shared libraries... yes checking whether to build shared libraries... yes checking whether to build static libraries... yes checking for x86_64-pld-linux-gcc... (cached) x86_64-pld-linux-gcc checking whether the compiler supports GNU C... (cached) yes checking whether x86_64-pld-linux-gcc accepts -g... (cached) yes checking for x86_64-pld-linux-gcc option to enable C11 features... (cached) none needed checking whether x86_64-pld-linux-gcc understands -c and -o together... (cached) yes checking dependency style of x86_64-pld-linux-gcc... (cached) gcc3 checking for x86_64-pld-linux-pkg-config... no checking for pkg-config... /usr/bin/pkg-config checking pkg-config is at least version 0.9.0... yes checking dependency style of x86_64-pld-linux-gcc... gcc3 checking whether to build with code coverage support... no checking how to create a pax tar archive... gnutar checking zfs author... OpenZFS checking zfs license... CDDL checking whether NLS is requested... yes checking for msgfmt... /usr/bin/msgfmt checking for gmsgfmt... /usr/bin/msgfmt checking for xgettext... /usr/bin/xgettext checking for msgmerge... /usr/bin/msgmerge checking for ld... /usr/bin/ld -m elf_x86_64 checking if the linker (/usr/bin/ld -m elf_x86_64) is GNU ld... yes checking for shared library run path origin... done checking 32-bit host C ABI... no checking for the common suffixes of directories in the library search path... lib64,lib64 checking zfs config... kernel checking the number of available CPUs... 8 checking whether x86_64-pld-linux-gcc supports -Wno-unused-but-set-variable... yes checking whether x86_64-pld-linux-gcc supports -Wno-bool-compare... yes checking whether x86_64-pld-linux-gcc supports -Wframe-larger-than=<size>... yes checking whether x86_64-pld-linux-gcc supports -Wno-format-truncation... yes checking whether x86_64-pld-linux-gcc supports -Wno-format-zero-length... yes checking whether x86_64-pld-linux-gcc supports -fno-omit-frame-pointer... yes checking whether x86_64-pld-linux-gcc supports -fno-ipa-sra... yes checking whether to build with -fsanitize=address support... no checking whether host toolchain supports SSE... yes checking whether host toolchain supports SSE2... yes checking whether host toolchain supports SSE3... yes checking whether host toolchain supports SSSE3... yes checking whether host toolchain supports SSE4.1... yes checking whether host toolchain supports SSE4.2... yes checking whether host toolchain supports AVX... yes checking whether host toolchain supports AVX2... yes checking whether host toolchain supports AVX512F... yes checking whether host toolchain supports AVX512CD... yes checking whether host toolchain supports AVX512DQ... yes checking whether host toolchain supports AVX512BW... yes checking whether host toolchain supports AVX512IFMA... yes checking whether host toolchain supports AVX512VBMI... yes checking whether host toolchain supports AVX512PF... yes checking whether host toolchain supports AVX512ER... yes checking whether host toolchain supports AVX512VL... yes checking whether host toolchain supports AES... yes checking whether host toolchain supports PCLMULQDQ... yes checking whether host toolchain supports MOVBE... yes checking for system type (linux-gnu)... Linux checking for python3... python3 checking for python version... 3.9 checking for python platform... linux checking for python script directory... ${prefix}/share/python3.9/site-packages checking for python extension module directory... ${exec_prefix}/lib64/python3.9/site-packages checking for python3.9... /usr/bin/python3.9 checking for a version of Python >= '2.1.0'... yes checking for a version of Python >= '3.4.0'... yes checking for the distutils Python package... yes checking for Python include path... -I/usr/include/python3.9 checking for Python library path... -L/usr/lib64 -lpython3.9 checking for Python site-packages path... /usr/local/lib64/python3.9/site-packages checking python extra libraries... -lcrypt -ldl -lm -lm checking python extra linking flags... -Xlinker -export-dynamic checking consistency of all components of python development environment... yes checking for python3.9 module: setuptools... yes checking for python3.9 module: cffi... yes checking whether to enable pyzfs: ... yes checking for sed --in-place... --in-place checking for cppcheck... cppcheck checking kernel source directory... /usr/src/linux-4.14 checking kernel build directory... /usr/src/linux-4.14 checking kernel source version... 4.14.246-1 checking kernel file name for module symbols... Module.symvers checking whether modules can be built... yes checking for kernel config option compatibility... done checking whether kernel was built with 16K or larger stacks... yes checking whether mutex_lock() is GPL-only... no checking whether CONFIG_TRIM_UNUSED_KSYM is disabled... yes checking whether CONFIG_ZLIB_INFLATE is defined... yes checking whether CONFIG_ZLIB_DEFLATE is defined... yes checking whether fpu headers are available... asm/fpu/api.h checking whether objtool header is available... linux/frame.h checking whether wait_queue_entry_t exists... yes checking whether /dev/zfs minor is available... 249 checking whether DECLARE_EVENT_CLASS() is available... no checking for available kernel interfaces... done checking whether access_ok() has 'type' parameter... yes checking whether global_node_page_state() exists... yes checking whether global_zone_page_state() exists... yes checking whether enum node_stat_item contains NR_FILE_PAGES... yes checking whether enum node_stat_item contains NR_INACTIVE_ANON... yes checking whether enum node_stat_item contains NR_INACTIVE_FILE... yes checking whether enum zone_stat_item contains NR_FILE_PAGES... no checking whether enum zone_stat_item contains NR_INACTIVE_ANON... no checking whether enum zone_stat_item contains NR_INACTIVE_FILE... no checking whether global_page_state enums are sane... yes checking whether compile-time stack validation (objtool) is available... yes checking whether STACK_FRAME_NON_STANDARD is defined... yes checking whether PDE_DATA() is available... yes checking whether fops->fallocate() exists... yes checking whether zlib_deflate_workspacesize() wants 2 args... yes checking whether struct rw_semaphore has member activity... no checking whether struct rw_semaphore has atomic_long_t member count... yes checking whether header linux/sched/rt.h exists... yes checking whether header linux/sched/signal.h exists... yes checking whether io_schedule_timeout() is available... yes checking whether usleep_range() is available... yes checking whether kmem_cache_create_usercopy() exists... no checking whether kvmalloc(ptr, flags) is available... yes checking whether __vmalloc(ptr, flags, pageflags) is available... yes checking whether wait_on_bit() takes an action... no checking whether wq_head->head and wq_entry->entry exist... yes checking whether timestamp_truncate() exists... no checking whether inode->i_*time's are timespec64... no checking whether inode_lock_shared() exists... yes checking whether group_info->gid exists... yes checking whether kernel_write() takes loff_t pointer... yes checking whether kernel_read() takes loff_t pointer... yes checking whether timer_setup() is available... yes checking whether timer function expects timer_list... no checking whether struct timer_list has flags... yes checking whether super_block->s_user_ns exists... yes checking whether proc_ops structure exists... no checking whether bops->check_events() exists... yes checking whether bops->release() is void... yes checking whether bops->revalidate_disk() exists... yes checking whether REQ_FAILFAST_MASK is defined... yes checking whether REQ_DISCARD is defined... no checking whether REQ_FLUSH is defined... no checking whether REQ_PREFLUSH is defined... yes checking whether REQ_OP_DISCARD is defined... yes checking whether REQ_OP_SECURE_ERASE is defined... yes checking whether REQ_OP_FLUSH is defined... yes checking whether bio->bi_opf is defined... yes checking whether bio_set_op_attrs is available... yes checking whether bio_set_dev() is available... yes checking whether bio_set_dev() is GPL-only... no checking whether bio_end_io_t wants 1 arg... yes checking whether bio->bi_status exists... yes checking whether bio has bi_iter... yes checking whether submit_bio() wants 1 arg... yes checking whether current->bio_list exists... yes checking whether blkg_tryget() is available... no checking whether bio->bi_bdev->bd_disk exists... no checking whether blkdev_get_by_path() exists... yes checking whether blkdev_put() exists... yes checking whether blkdev_reread_part() exists... yes checking whether invalidate_bdev() exists... yes checking whether lookup_bdev() wants dev_t arg... no checking whether lookup_bdev() wants 1 arg... yes checking whether bdev_logical_block_size() is available... yes checking whether bdev_physical_block_size() is available... yes checking whether check_disk_change() exists... yes checking whether bdev_disk_changed() exists... no checking whether bdev_whole() is available... no checking whether struct blk_plug is available... yes checking whether blk_queue bdi is dynamic... yes checking whether blk_queue_discard() is available... yes checking whether blk_queue_secure_erase() is available... yes checking whether blk_queue_flag_set() exists... no checking whether blk_queue_flag_clear() exists... no checking whether blk_queue_flush() is available... no checking whether blk_queue_write_cache() exists... yes checking whether blk_queue_write_cache() is GPL-only... yes checking whether blk_queue_max_hw_sectors() is available... yes checking whether blk_queue_max_segments() is available... yes checking whether revalidate_disk_size() is available... no checking whether revalidate_disk() is available... yes checking whether get_disk_ro() is available... yes checking whether generic_readlink is global... no checking whether ql->discard_granularity is available... yes checking whether inode_owner_or_capable() exists... yes checking whether super_block uses const struct xattr_handler... yes checking whether xattr_handler has name... yes checking whether xattr_handler->get() wants dentry and inode... yes checking whether xattr_handler->set() wants dentry, inode, and user_namespace... no checking whether xattr_handler->set() wants dentry and inode... yes checking whether xattr_handler->list() wants simple... yes checking whether posix_acl_from_xattr() needs user_ns... yes checking whether generic_setxattr() exists... no checking whether posix_acl_release() is available... yes checking whether posix_acl_release() is GPL-only... yes checking whether set_cached_acl() is usable... yes checking whether __posix_acl_chmod exists... yes checking whether posix_acl_equiv_mode() wants umode_t... yes checking whether posix_acl_valid() wants user namespace... yes checking whether iops->get_acl() exists... yes checking whether iops->set_acl() exists... yes checking whether uncached_acl_sentinel() exists... yes checking whether posix_acl has refcount_t... no checking whether iops->getattr() takes user_namespace... no checking whether iops->getattr() takes a path... yes checking whether inode_set_flags() exists... yes checking whether inode_set_iversion() exists... no checking whether sops->show_options() wants dentry... yes checking whether file_inode() is available... yes checking whether file_dentry() is available... yes checking whether fops->fsync() wants no dentry... no checking whether fops->fsync() wants range... range checking whether fops->aio_fsync() exists... no checking whether sops->evict_inode() exists... yes checking whether sops->dirty_inode() wants flags... yes checking whether super_block has s_shrink... yes checking whether shrink_control has nid... yes checking whether new 2-argument shrinker exists... no checking whether ->count_objects callback exists... yes checking whether struct shrink_control exists... yes checking whether iops->mkdir() takes struct user_namespace*... checking whether iops->mkdir() takes umode_t... yes checking whether iops->lookup() passes flags... yes checking whether iops->create() takes struct user_namespace*... no checking whether iops->create() passes flags... yes checking whether iops->get_link() passes delayed... yes checking whether i_op->tmpfile() exists... yes checking whether dops->d_automount() exists... yes checking whether eops->encode_fh() wants inode... yes checking whether eops->commit_metadata() exists... yes checking whether clear_inode() is available... yes checking whether setattr_prepare() is available and accepts struct user_namespace*... no checking whether setattr_prepare() is available, doesn't accept user_namespace... yes checking whether insert_inode_locked() is available... yes checking whether d_make_root() is available... yes checking whether d_obtain_alias() is available... yes checking whether d_prune_aliases() is available... yes checking whether d_set_d_op() is available... yes checking whether dops->d_revalidate() takes struct nameidata... no checking whether dentry uses const struct dentry_operations... yes checking whether super_block has s_d_op... yes checking whether truncate_setsize() is available... yes checking whether security_inode_init_security wants callback... yes checking whether fst->mount() exists... yes checking whether super_setup_bdi_name() exists... yes checking whether set_nlink() is available... yes checking whether sget() wants 5 args... yes checking whether lseek_execute() is available... no checking whether vfs_getattr() wants 4 args... yes checking whether vfs_getattr() wants 2 args... no checking whether vfs_getattr() wants 3 args... no checking whether vfs_fsync() wants 2 args... yes checking whether fops->iterate_shared() is available... yes checking whether aops->direct_IO() uses iov_iter... yes checking whether fops->read/write_iter() are available... yes checking whether new_sync_read/write() are available... no checking whether generic_write_checks() takes kiocb... yes checking whether iov_iter types are available... yes checking whether iov_iter_init() is available... yes checking whether iov_iter_advance() is available... yes checking whether iov_iter_revert() is available... yes checking whether iov_iter_fault_in_readable() is available... yes checking whether iov_iter_count() is available... yes checking whether copy_to_iter() is available... yes checking whether copy_from_iter() is available... yes checking whether kmap_atomic wants 1 args... yes checking whether follow_down_one() is available... yes checking whether submit_bio is member of struct block_device_operations... no checking whether blk_alloc_queue() expects request function... no checking whether make_request_fn() returns void... no checking whether make_request_fn() returns blk_qc_t... yes checking whether generic disk_*_io_acct() are available... no checking whether generic bio_*_io_acct() are available... no checking whether generic_*_io_acct wants 4 args... yes checking whether kernel fpu is available... internal checking whether kernel defines fmode_t... yes checking whether kuid_t/kgid_t is available... yes checking whether i_(uid|gid)_(read|write) exist... yes checking whether module_param_call() is hardened... no checking whether iops->rename() takes struct user_namespace*... no yes checking whether current_time() exists... yes checking whether ns_capable exists... yes checking whether has_capability() is available... yes checking whether cred_t->user_ns exists... yes checking whether kuid_has_mapping/kgid_has_mapping exist... yes checking whether in_compat_syscall() is available... yes checking whether ktime_get_coarse_real_ts64() exists... no checking whether ktime_get_raw_ts64() exists... no checking whether totalram_pages() exists... no checking whether totalhigh_pages() exists... no checking whether kstrtoul() exists... yes checking whether percpu_counter_init() wants gfp_t... yes checking whether is inside percpu_ref.data... no checking whether generic_fillattr requres struct user_namespace*... no checking whether iops->mknod() takes struct user_namespace*... no checking whether iops->symlink() takes struct user_namespace*... no checking whether bio_max_segs() exists... no checking os distribution... ubuntu checking default package type... deb checking default init directory... /etc/rc.d/init.d checking default init script type and shell... lsb:/bin/sh checking default nfs server init script... nfs checking default init config directory... /etc/default checking whether initramfs-tools is available... no checking whether rpm is available... yes (4.16.1.3) checking whether rpmbuild is available... yes (4.16.1.3) ./configure[101506]: dpkg-architecture: inaccessible or not found checking whether spec files are available... yes (rpm/generic/*.spec.in) checking whether dpkg is available... no checking whether dpkg-buildpackage is available... no checking whether alien is available... no checking whether assertion support will be enabled... no checking whether debuginfo support will be forced... no checking whether basic kmem accounting is enabled... no checking whether detailed kmem tracking is enabled... no checking that generated files are newer than configure... done configure: creating ./config.status config.status: creating Makefile config.status: creating cmd/Makefile config.status: creating cmd/arc_summary/Makefile config.status: creating cmd/arcstat/Makefile config.status: creating cmd/dbufstat/Makefile config.status: creating cmd/fsck_zfs/Makefile config.status: creating cmd/mount_zfs/Makefile config.status: creating cmd/raidz_test/Makefile config.status: creating cmd/vdev_id/Makefile config.status: creating cmd/zdb/Makefile config.status: creating cmd/zed/Makefile config.status: creating cmd/zed/zed.d/Makefile config.status: creating cmd/zfs/Makefile config.status: creating cmd/zfs_ids_to_path/Makefile config.status: creating cmd/zgenhostid/Makefile config.status: creating cmd/zhack/Makefile config.status: creating cmd/zinject/Makefile config.status: creating cmd/zpool/Makefile config.status: creating cmd/zstream/Makefile config.status: creating cmd/zstreamdump/Makefile config.status: creating cmd/ztest/Makefile config.status: creating cmd/zvol_id/Makefile config.status: creating cmd/zvol_wait/Makefile config.status: creating contrib/Makefile config.status: creating contrib/bash_completion.d/Makefile config.status: creating contrib/bpftrace/Makefile config.status: creating contrib/dracut/02zfsexpandknowledge/Makefile config.status: creating contrib/dracut/90zfs/Makefile config.status: creating contrib/dracut/Makefile config.status: creating contrib/initramfs/Makefile config.status: creating contrib/initramfs/conf.d/Makefile config.status: creating contrib/initramfs/conf-hooks.d/Makefile config.status: creating contrib/initramfs/hooks/Makefile config.status: creating contrib/initramfs/scripts/Makefile config.status: creating contrib/initramfs/scripts/local-top/Makefile config.status: creating contrib/pam_zfs_key/Makefile config.status: creating contrib/pyzfs/Makefile config.status: creating contrib/pyzfs/setup.py config.status: creating contrib/zcp/Makefile config.status: creating etc/Makefile config.status: creating etc/default/Makefile config.status: creating etc/init.d/Makefile config.status: creating etc/modules-load.d/Makefile config.status: creating etc/sudoers.d/Makefile config.status: creating etc/systemd/Makefile config.status: creating etc/systemd/system-generators/Makefile config.status: creating etc/systemd/system/Makefile config.status: creating etc/zfs/Makefile config.status: creating include/Makefile config.status: creating include/os/Makefile config.status: creating include/os/freebsd/Makefile config.status: creating include/os/freebsd/linux/Makefile config.status: creating include/os/freebsd/spl/Makefile config.status: creating include/os/freebsd/spl/acl/Makefile config.status: creating include/os/freebsd/spl/rpc/Makefile config.status: creating include/os/freebsd/spl/sys/Makefile config.status: creating include/os/freebsd/zfs/Makefile config.status: creating include/os/freebsd/zfs/sys/Makefile config.status: creating include/os/linux/Makefile config.status: creating include/os/linux/kernel/Makefile config.status: creating include/os/linux/kernel/linux/Makefile config.status: creating include/os/linux/spl/Makefile config.status: creating include/os/linux/spl/rpc/Makefile config.status: creating include/os/linux/spl/sys/Makefile config.status: creating include/os/linux/zfs/Makefile config.status: creating include/os/linux/zfs/sys/Makefile config.status: creating include/sys/Makefile config.status: creating include/sys/crypto/Makefile config.status: creating include/sys/fm/Makefile config.status: creating include/sys/fm/fs/Makefile config.status: creating include/sys/fs/Makefile config.status: creating include/sys/lua/Makefile config.status: creating include/sys/sysevent/Makefile config.status: creating include/sys/zstd/Makefile config.status: creating lib/Makefile config.status: creating lib/libavl/Makefile config.status: creating lib/libefi/Makefile config.status: creating lib/libicp/Makefile config.status: creating lib/libnvpair/Makefile config.status: creating lib/libshare/Makefile config.status: creating lib/libspl/Makefile config.status: creating lib/libspl/include/Makefile config.status: creating lib/libspl/include/ia32/Makefile config.status: creating lib/libspl/include/ia32/sys/Makefile config.status: creating lib/libspl/include/os/Makefile config.status: creating lib/libspl/include/os/freebsd/Makefile config.status: creating lib/libspl/include/os/freebsd/sys/Makefile config.status: creating lib/libspl/include/os/linux/Makefile config.status: creating lib/libspl/include/os/linux/sys/Makefile config.status: creating lib/libspl/include/rpc/Makefile config.status: creating lib/libspl/include/sys/Makefile config.status: creating lib/libspl/include/sys/dktp/Makefile config.status: creating lib/libspl/include/util/Makefile config.status: creating lib/libtpool/Makefile config.status: creating lib/libunicode/Makefile config.status: creating lib/libuutil/Makefile config.status: creating lib/libzfs/Makefile config.status: creating lib/libzfs/libzfs.pc config.status: creating lib/libzfsbootenv/Makefile config.status: creating lib/libzfsbootenv/libzfsbootenv.pc config.status: creating lib/libzfs_core/Makefile config.status: creating lib/libzfs_core/libzfs_core.pc config.status: creating lib/libzpool/Makefile config.status: creating lib/libzstd/Makefile config.status: creating lib/libzutil/Makefile config.status: creating man/Makefile config.status: creating man/man1/Makefile config.status: creating man/man5/Makefile config.status: creating man/man8/Makefile config.status: creating module/Kbuild config.status: creating module/Makefile config.status: creating module/avl/Makefile config.status: creating module/icp/Makefile config.status: creating module/lua/Makefile config.status: creating module/nvpair/Makefile config.status: creating module/os/linux/spl/Makefile config.status: creating module/os/linux/zfs/Makefile config.status: creating module/spl/Makefile config.status: creating module/unicode/Makefile config.status: creating module/zcommon/Makefile config.status: creating module/zfs/Makefile config.status: creating module/zstd/Makefile config.status: creating rpm/Makefile config.status: creating rpm/generic/Makefile config.status: creating rpm/generic/zfs-dkms.spec config.status: creating rpm/generic/zfs-kmod.spec config.status: creating rpm/generic/zfs.spec config.status: creating rpm/redhat/Makefile config.status: creating rpm/redhat/zfs-dkms.spec config.status: creating rpm/redhat/zfs-kmod.spec config.status: creating rpm/redhat/zfs.spec config.status: creating scripts/Makefile config.status: creating tests/Makefile config.status: creating tests/runfiles/Makefile config.status: creating tests/test-runner/Makefile config.status: creating tests/test-runner/bin/Makefile config.status: creating tests/test-runner/include/Makefile config.status: creating tests/test-runner/man/Makefile config.status: creating tests/zfs-tests/Makefile config.status: creating tests/zfs-tests/callbacks/Makefile config.status: creating tests/zfs-tests/cmd/Makefile config.status: creating tests/zfs-tests/cmd/badsend/Makefile config.status: creating tests/zfs-tests/cmd/btree_test/Makefile config.status: creating tests/zfs-tests/cmd/chg_usr_exec/Makefile config.status: creating tests/zfs-tests/cmd/devname2devid/Makefile config.status: creating tests/zfs-tests/cmd/dir_rd_update/Makefile config.status: creating tests/zfs-tests/cmd/file_check/Makefile config.status: creating tests/zfs-tests/cmd/file_trunc/Makefile config.status: creating tests/zfs-tests/cmd/file_write/Makefile config.status: creating tests/zfs-tests/cmd/get_diff/Makefile config.status: creating tests/zfs-tests/cmd/largest_file/Makefile config.status: creating tests/zfs-tests/cmd/libzfs_input_check/Makefile config.status: creating tests/zfs-tests/cmd/mkbusy/Makefile config.status: creating tests/zfs-tests/cmd/mkfile/Makefile config.status: creating tests/zfs-tests/cmd/mkfiles/Makefile config.status: creating tests/zfs-tests/cmd/mktree/Makefile config.status: creating tests/zfs-tests/cmd/mmap_exec/Makefile config.status: creating tests/zfs-tests/cmd/mmap_libaio/Makefile config.status: creating tests/zfs-tests/cmd/mmapwrite/Makefile config.status: creating tests/zfs-tests/cmd/nvlist_to_lua/Makefile config.status: creating tests/zfs-tests/cmd/randfree_file/Makefile config.status: creating tests/zfs-tests/cmd/randwritecomp/Makefile config.status: creating tests/zfs-tests/cmd/readmmap/Makefile config.status: creating tests/zfs-tests/cmd/rename_dir/Makefile config.status: creating tests/zfs-tests/cmd/rm_lnkcnt_zero_file/Makefile config.status: creating tests/zfs-tests/cmd/send_doall/Makefile config.status: creating tests/zfs-tests/cmd/stride_dd/Makefile config.status: creating tests/zfs-tests/cmd/threadsappend/Makefile config.status: creating tests/zfs-tests/cmd/user_ns_exec/Makefile config.status: creating tests/zfs-tests/cmd/xattrtest/Makefile config.status: creating tests/zfs-tests/include/Makefile config.status: creating tests/zfs-tests/tests/Makefile config.status: creating tests/zfs-tests/tests/functional/Makefile config.status: creating tests/zfs-tests/tests/functional/acl/Makefile config.status: creating tests/zfs-tests/tests/functional/acl/off/Makefile config.status: creating tests/zfs-tests/tests/functional/acl/posix/Makefile config.status: creating tests/zfs-tests/tests/functional/acl/posix-sa/Makefile config.status: creating tests/zfs-tests/tests/functional/alloc_class/Makefile config.status: creating tests/zfs-tests/tests/functional/arc/Makefile config.status: creating tests/zfs-tests/tests/functional/atime/Makefile config.status: creating tests/zfs-tests/tests/functional/bootfs/Makefile config.status: creating tests/zfs-tests/tests/functional/btree/Makefile config.status: creating tests/zfs-tests/tests/functional/cache/Makefile config.status: creating tests/zfs-tests/tests/functional/cachefile/Makefile config.status: creating tests/zfs-tests/tests/functional/casenorm/Makefile config.status: creating tests/zfs-tests/tests/functional/channel_program/Makefile config.status: creating tests/zfs-tests/tests/functional/channel_program/lua_core/Makefile config.status: creating tests/zfs-tests/tests/functional/channel_program/synctask_core/Makefile config.status: creating tests/zfs-tests/tests/functional/chattr/Makefile config.status: creating tests/zfs-tests/tests/functional/checksum/Makefile config.status: creating tests/zfs-tests/tests/functional/clean_mirror/Makefile config.status: creating tests/zfs-tests/tests/functional/cli_root/Makefile config.status: creating tests/zfs-tests/tests/functional/cli_root/zdb/Makefile config.status: creating tests/zfs-tests/tests/functional/cli_root/zfs/Makefile config.status: creating tests/zfs-tests/tests/functional/cli_root/zfs_bookmark/Makefile config.status: creating tests/zfs-tests/tests/functional/cli_root/zfs_change-key/Makefile config.status: creating tests/zfs-tests/tests/functional/cli_root/zfs_clone/Makefile config.status: creating tests/zfs-tests/tests/functional/cli_root/zfs_copies/Makefile config.status: creating tests/zfs-tests/tests/functional/cli_root/zfs_create/Makefile config.status: creating tests/zfs-tests/tests/functional/cli_root/zfs_destroy/Makefile config.status: creating tests/zfs-tests/tests/functional/cli_root/zfs_diff/Makefile config.status: creating tests/zfs-tests/tests/functional/cli_root/zfs_get/Makefile config.status: creating tests/zfs-tests/tests/functional/cli_root/zfs_ids_to_path/Makefile config.status: creating tests/zfs-tests/tests/functional/cli_root/zfs_inherit/Makefile config.status: creating tests/zfs-tests/tests/functional/cli_root/zfs_jail/Makefile config.status: creating tests/zfs-tests/tests/functional/cli_root/zfs_load-key/Makefile config.status: creating tests/zfs-tests/tests/functional/cli_root/zfs_mount/Makefile config.status: creating tests/zfs-tests/tests/functional/cli_root/zfs_program/Makefile config.status: creating tests/zfs-tests/tests/functional/cli_root/zfs_promote/Makefile config.status: creating tests/zfs-tests/tests/functional/cli_root/zfs_property/Makefile config.status: creating tests/zfs-tests/tests/functional/cli_root/zfs_receive/Makefile config.status: creating tests/zfs-tests/tests/functional/cli_root/zfs_rename/Makefile config.status: creating tests/zfs-tests/tests/functional/cli_root/zfs_reservation/Makefile config.status: creating tests/zfs-tests/tests/functional/cli_root/zfs_rollback/Makefile config.status: creating tests/zfs-tests/tests/functional/cli_root/zfs_send/Makefile config.status: creating tests/zfs-tests/tests/functional/cli_root/zfs_set/Makefile config.status: creating tests/zfs-tests/tests/functional/cli_root/zfs_share/Makefile config.status: creating tests/zfs-tests/tests/functional/cli_root/zfs_snapshot/Makefile config.status: creating tests/zfs-tests/tests/functional/cli_root/zfs_sysfs/Makefile config.status: creating tests/zfs-tests/tests/functional/cli_root/zfs_unload-key/Makefile config.status: creating tests/zfs-tests/tests/functional/cli_root/zfs_unmount/Makefile config.status: creating tests/zfs-tests/tests/functional/cli_root/zfs_unshare/Makefile config.status: creating tests/zfs-tests/tests/functional/cli_root/zfs_upgrade/Makefile config.status: creating tests/zfs-tests/tests/functional/cli_root/zfs_wait/Makefile config.status: creating tests/zfs-tests/tests/functional/cli_root/zpool/Makefile config.status: creating tests/zfs-tests/tests/functional/cli_root/zpool_add/Makefile config.status: creating tests/zfs-tests/tests/functional/cli_root/zpool_attach/Makefile config.status: creating tests/zfs-tests/tests/functional/cli_root/zpool_clear/Makefile config.status: creating tests/zfs-tests/tests/functional/cli_root/zpool_create/Makefile config.status: creating tests/zfs-tests/tests/functional/cli_root/zpool_destroy/Makefile config.status: creating tests/zfs-tests/tests/functional/cli_root/zpool_detach/Makefile config.status: creating tests/zfs-tests/tests/functional/cli_root/zpool_events/Makefile config.status: creating tests/zfs-tests/tests/functional/cli_root/zpool_expand/Makefile config.status: creating tests/zfs-tests/tests/functional/cli_root/zpool_export/Makefile config.status: creating tests/zfs-tests/tests/functional/cli_root/zpool_get/Makefile config.status: creating tests/zfs-tests/tests/functional/cli_root/zpool_history/Makefile config.status: creating tests/zfs-tests/tests/functional/cli_root/zpool_import/Makefile config.status: creating tests/zfs-tests/tests/functional/cli_root/zpool_import/blockfiles/Makefile config.status: creating tests/zfs-tests/tests/functional/cli_root/zpool_initialize/Makefile config.status: creating tests/zfs-tests/tests/functional/cli_root/zpool_labelclear/Makefile config.status: creating tests/zfs-tests/tests/functional/cli_root/zpool_offline/Makefile config.status: creating tests/zfs-tests/tests/functional/cli_root/zpool_online/Makefile config.status: creating tests/zfs-tests/tests/functional/cli_root/zpool_remove/Makefile config.status: creating tests/zfs-tests/tests/functional/cli_root/zpool_reopen/Makefile config.status: creating tests/zfs-tests/tests/functional/cli_root/zpool_replace/Makefile config.status: creating tests/zfs-tests/tests/functional/cli_root/zpool_resilver/Makefile config.status: creating tests/zfs-tests/tests/functional/cli_root/zpool_scrub/Makefile config.status: creating tests/zfs-tests/tests/functional/cli_root/zpool_set/Makefile config.status: creating tests/zfs-tests/tests/functional/cli_root/zpool_split/Makefile config.status: creating tests/zfs-tests/tests/functional/cli_root/zpool_status/Makefile config.status: creating tests/zfs-tests/tests/functional/cli_root/zpool_sync/Makefile config.status: creating tests/zfs-tests/tests/functional/cli_root/zpool_trim/Makefile config.status: creating tests/zfs-tests/tests/functional/cli_root/zpool_upgrade/Makefile config.status: creating tests/zfs-tests/tests/functional/cli_root/zpool_upgrade/blockfiles/Makefile config.status: creating tests/zfs-tests/tests/functional/cli_root/zpool_wait/Makefile config.status: creating tests/zfs-tests/tests/functional/cli_root/zpool_wait/scan/Makefile config.status: creating tests/zfs-tests/tests/functional/cli_user/Makefile config.status: creating tests/zfs-tests/tests/functional/cli_user/misc/Makefile config.status: creating tests/zfs-tests/tests/functional/cli_user/zfs_list/Makefile config.status: creating tests/zfs-tests/tests/functional/cli_user/zpool_iostat/Makefile config.status: creating tests/zfs-tests/tests/functional/cli_user/zpool_list/Makefile config.status: creating tests/zfs-tests/tests/functional/cli_user/zpool_status/Makefile config.status: creating tests/zfs-tests/tests/functional/compression/Makefile config.status: creating tests/zfs-tests/tests/functional/cp_files/Makefile config.status: creating tests/zfs-tests/tests/functional/ctime/Makefile config.status: creating tests/zfs-tests/tests/functional/deadman/Makefile config.status: creating tests/zfs-tests/tests/functional/delegate/Makefile config.status: creating tests/zfs-tests/tests/functional/devices/Makefile config.status: creating tests/zfs-tests/tests/functional/events/Makefile config.status: creating tests/zfs-tests/tests/functional/exec/Makefile config.status: creating tests/zfs-tests/tests/functional/fallocate/Makefile config.status: creating tests/zfs-tests/tests/functional/fault/Makefile config.status: creating tests/zfs-tests/tests/functional/features/Makefile config.status: creating tests/zfs-tests/tests/functional/features/async_destroy/Makefile config.status: creating tests/zfs-tests/tests/functional/features/large_dnode/Makefile config.status: creating tests/zfs-tests/tests/functional/grow/Makefile config.status: creating tests/zfs-tests/tests/functional/history/Makefile config.status: creating tests/zfs-tests/tests/functional/hkdf/Makefile config.status: creating tests/zfs-tests/tests/functional/inheritance/Makefile config.status: creating tests/zfs-tests/tests/functional/inuse/Makefile config.status: creating tests/zfs-tests/tests/functional/io/Makefile config.status: creating tests/zfs-tests/tests/functional/large_files/Makefile config.status: creating tests/zfs-tests/tests/functional/largest_pool/Makefile config.status: creating tests/zfs-tests/tests/functional/libzfs/Makefile config.status: creating tests/zfs-tests/tests/functional/limits/Makefile config.status: creating tests/zfs-tests/tests/functional/link_count/Makefile config.status: creating tests/zfs-tests/tests/functional/log_spacemap/Makefile config.status: creating tests/zfs-tests/tests/functional/migration/Makefile config.status: creating tests/zfs-tests/tests/functional/mmap/Makefile config.status: creating tests/zfs-tests/tests/functional/mmp/Makefile config.status: creating tests/zfs-tests/tests/functional/mount/Makefile config.status: creating tests/zfs-tests/tests/functional/mv_files/Makefile config.status: creating tests/zfs-tests/tests/functional/nestedfs/Makefile config.status: creating tests/zfs-tests/tests/functional/no_space/Makefile config.status: creating tests/zfs-tests/tests/functional/nopwrite/Makefile config.status: creating tests/zfs-tests/tests/functional/online_offline/Makefile config.status: creating tests/zfs-tests/tests/functional/pam/Makefile config.status: creating tests/zfs-tests/tests/functional/persist_l2arc/Makefile config.status: creating tests/zfs-tests/tests/functional/pool_checkpoint/Makefile config.status: creating tests/zfs-tests/tests/functional/pool_names/Makefile config.status: creating tests/zfs-tests/tests/functional/poolversion/Makefile config.status: creating tests/zfs-tests/tests/functional/privilege/Makefile config.status: creating tests/zfs-tests/tests/functional/procfs/Makefile config.status: creating tests/zfs-tests/tests/functional/projectquota/Makefile config.status: creating tests/zfs-tests/tests/functional/pyzfs/Makefile config.status: creating tests/zfs-tests/tests/functional/quota/Makefile config.status: creating tests/zfs-tests/tests/functional/raidz/Makefile config.status: creating tests/zfs-tests/tests/functional/redacted_send/Makefile config.status: creating tests/zfs-tests/tests/functional/redundancy/Makefile config.status: creating tests/zfs-tests/tests/functional/refquota/Makefile config.status: creating tests/zfs-tests/tests/functional/refreserv/Makefile config.status: creating tests/zfs-tests/tests/functional/removal/Makefile config.status: creating tests/zfs-tests/tests/functional/rename_dirs/Makefile config.status: creating tests/zfs-tests/tests/functional/replacement/Makefile config.status: creating tests/zfs-tests/tests/functional/reservation/Makefile config.status: creating tests/zfs-tests/tests/functional/rootpool/Makefile config.status: creating tests/zfs-tests/tests/functional/rsend/Makefile config.status: creating tests/zfs-tests/tests/functional/scrub_mirror/Makefile config.status: creating tests/zfs-tests/tests/functional/slog/Makefile config.status: creating tests/zfs-tests/tests/functional/snapshot/Makefile config.status: creating tests/zfs-tests/tests/functional/snapused/Makefile config.status: creating tests/zfs-tests/tests/functional/sparse/Makefile config.status: creating tests/zfs-tests/tests/functional/suid/Makefile config.status: creating tests/zfs-tests/tests/functional/threadsappend/Makefile config.status: creating tests/zfs-tests/tests/functional/tmpfile/Makefile config.status: creating tests/zfs-tests/tests/functional/trim/Makefile config.status: creating tests/zfs-tests/tests/functional/truncate/Makefile config.status: creating tests/zfs-tests/tests/functional/upgrade/Makefile config.status: creating tests/zfs-tests/tests/functional/user_namespace/Makefile config.status: creating tests/zfs-tests/tests/functional/userquota/Makefile config.status: creating tests/zfs-tests/tests/functional/vdev_zaps/Makefile config.status: creating tests/zfs-tests/tests/functional/write_dirs/Makefile config.status: creating tests/zfs-tests/tests/functional/xattr/Makefile config.status: creating tests/zfs-tests/tests/functional/zvol/Makefile config.status: creating tests/zfs-tests/tests/functional/zvol/zvol_ENOSPC/Makefile config.status: creating tests/zfs-tests/tests/functional/zvol/zvol_cli/Makefile config.status: creating tests/zfs-tests/tests/functional/zvol/zvol_misc/Makefile config.status: creating tests/zfs-tests/tests/functional/zvol/zvol_swap/Makefile config.status: creating tests/zfs-tests/tests/perf/Makefile config.status: creating tests/zfs-tests/tests/perf/fio/Makefile config.status: creating tests/zfs-tests/tests/perf/regression/Makefile config.status: creating tests/zfs-tests/tests/perf/scripts/Makefile config.status: creating tests/zfs-tests/tests/stress/Makefile config.status: creating udev/Makefile config.status: creating udev/rules.d/Makefile config.status: creating zfs.release config.status: creating zfs_config.h config.status: executing depfiles commands config.status: executing libtool commands config.status: executing po-directories commands + /usr/bin/make -Otarget -j9 clean Making clean in include Making clean in sys Making clean in fm Making clean in fs make[4]: Entering directory '/tmp/B.u6el52es/BUILD/zfs-2.0.5/include/sys/fm/fs' rm -rf .libs _libs make[4]: Leaving directory '/tmp/B.u6el52es/BUILD/zfs-2.0.5/include/sys/fm/fs' make[4]: Entering directory '/tmp/B.u6el52es/BUILD/zfs-2.0.5/include/sys/fm/fs' rm -f *.lo make[4]: Leaving directory '/tmp/B.u6el52es/BUILD/zfs-2.0.5/include/sys/fm/fs' make[4]: Entering directory '/tmp/B.u6el52es/BUILD/zfs-2.0.5/include/sys/fm' rm -rf .libs _libs make[4]: Leaving directory '/tmp/B.u6el52es/BUILD/zfs-2.0.5/include/sys/fm' make[4]: Entering directory '/tmp/B.u6el52es/BUILD/zfs-2.0.5/include/sys/fm' rm -f *.lo make[4]: Leaving directory '/tmp/B.u6el52es/BUILD/zfs-2.0.5/include/sys/fm' Making clean in fs make[3]: Entering directory '/tmp/B.u6el52es/BUILD/zfs-2.0.5/include/sys/fs' rm -rf .libs _libs make[3]: Leaving directory '/tmp/B.u6el52es/BUILD/zfs-2.0.5/include/sys/fs' make[3]: Entering directory '/tmp/B.u6el52es/BUILD/zfs-2.0.5/include/sys/fs' rm -f *.lo make[3]: Leaving directory '/tmp/B.u6el52es/BUILD/zfs-2.0.5/include/sys/fs' Making clean in crypto make[3]: Entering directory '/tmp/B.u6el52es/BUILD/zfs-2.0.5/include/sys/crypto' rm -rf .libs _libs make[3]: Leaving directory '/tmp/B.u6el52es/BUILD/zfs-2.0.5/include/sys/crypto' make[3]: Entering directory '/tmp/B.u6el52es/BUILD/zfs-2.0.5/include/sys/crypto' rm -f *.lo make[3]: Leaving directory '/tmp/B.u6el52es/BUILD/zfs-2.0.5/include/sys/crypto' Making clean in lua make[3]: Entering directory '/tmp/B.u6el52es/BUILD/zfs-2.0.5/include/sys/lua' rm -rf .libs _libs make[3]: Leaving directory '/tmp/B.u6el52es/BUILD/zfs-2.0.5/include/sys/lua' make[3]: Entering directory '/tmp/B.u6el52es/BUILD/zfs-2.0.5/include/sys/lua' rm -f *.lo make[3]: Leaving directory '/tmp/B.u6el52es/BUILD/zfs-2.0.5/include/sys/lua' Making clean in sysevent make[3]: Entering directory '/tmp/B.u6el52es/BUILD/zfs-2.0.5/include/sys/sysevent' rm -rf .libs _libs make[3]: Leaving directory '/tmp/B.u6el52es/BUILD/zfs-2.0.5/include/sys/sysevent' make[3]: Entering directory '/tmp/B.u6el52es/BUILD/zfs-2.0.5/include/sys/sysevent' rm -f *.lo make[3]: Leaving directory '/tmp/B.u6el52es/BUILD/zfs-2.0.5/include/sys/sysevent' Making clean in zstd make[3]: Entering directory '/tmp/B.u6el52es/BUILD/zfs-2.0.5/include/sys/zstd' rm -rf .libs _libs make[3]: Leaving directory '/tmp/B.u6el52es/BUILD/zfs-2.0.5/include/sys/zstd' make[3]: Entering directory '/tmp/B.u6el52es/BUILD/zfs-2.0.5/include/sys/zstd' rm -f *.lo make[3]: Leaving directory '/tmp/B.u6el52es/BUILD/zfs-2.0.5/include/sys/zstd' make[3]: Entering directory '/tmp/B.u6el52es/BUILD/zfs-2.0.5/include/sys' rm -rf .libs _libs make[3]: Leaving directory '/tmp/B.u6el52es/BUILD/zfs-2.0.5/include/sys' make[3]: Entering directory '/tmp/B.u6el52es/BUILD/zfs-2.0.5/include/sys' rm -f *.lo make[3]: Leaving directory '/tmp/B.u6el52es/BUILD/zfs-2.0.5/include/sys' Making clean in os Making clean in linux Making clean in kernel Making clean in linux make[5]: Entering directory '/tmp/B.u6el52es/BUILD/zfs-2.0.5/include/os/linux/kernel/linux' rm -rf .libs _libs make[5]: Leaving directory '/tmp/B.u6el52es/BUILD/zfs-2.0.5/include/os/linux/kernel/linux' make[5]: Entering directory '/tmp/B.u6el52es/BUILD/zfs-2.0.5/include/os/linux/kernel/linux' rm -f *.lo make[5]: Leaving directory '/tmp/B.u6el52es/BUILD/zfs-2.0.5/include/os/linux/kernel/linux' make[5]: Entering directory '/tmp/B.u6el52es/BUILD/zfs-2.0.5/include/os/linux/kernel' rm -rf .libs _libs make[5]: Leaving directory '/tmp/B.u6el52es/BUILD/zfs-2.0.5/include/os/linux/kernel' make[5]: Entering directory '/tmp/B.u6el52es/BUILD/zfs-2.0.5/include/os/linux/kernel' rm -f *.lo make[5]: Leaving directory '/tmp/B.u6el52es/BUILD/zfs-2.0.5/include/os/linux/kernel' Making clean in spl Making clean in rpc make[5]: Entering directory '/tmp/B.u6el52es/BUILD/zfs-2.0.5/include/os/linux/spl/rpc' rm -rf .libs _libs make[5]: Leaving directory '/tmp/B.u6el52es/BUILD/zfs-2.0.5/include/os/linux/spl/rpc' make[5]: Entering directory '/tmp/B.u6el52es/BUILD/zfs-2.0.5/include/os/linux/spl/rpc' rm -f *.lo make[5]: Leaving directory '/tmp/B.u6el52es/BUILD/zfs-2.0.5/include/os/linux/spl/rpc' Making clean in sys make[5]: Entering directory '/tmp/B.u6el52es/BUILD/zfs-2.0.5/include/os/linux/spl/sys' rm -rf .libs _libs make[5]: Leaving directory '/tmp/B.u6el52es/BUILD/zfs-2.0.5/include/os/linux/spl/sys' make[5]: Entering directory '/tmp/B.u6el52es/BUILD/zfs-2.0.5/include/os/linux/spl/sys' rm -f *.lo make[5]: Leaving directory '/tmp/B.u6el52es/BUILD/zfs-2.0.5/include/os/linux/spl/sys' make[5]: Entering directory '/tmp/B.u6el52es/BUILD/zfs-2.0.5/include/os/linux/spl' rm -rf .libs _libs make[5]: Leaving directory '/tmp/B.u6el52es/BUILD/zfs-2.0.5/include/os/linux/spl' make[5]: Entering directory '/tmp/B.u6el52es/BUILD/zfs-2.0.5/include/os/linux/spl' rm -f *.lo make[5]: Leaving directory '/tmp/B.u6el52es/BUILD/zfs-2.0.5/include/os/linux/spl' Making clean in zfs Making clean in sys make[5]: Entering directory '/tmp/B.u6el52es/BUILD/zfs-2.0.5/include/os/linux/zfs/sys' rm -rf .libs _libs make[5]: Leaving directory '/tmp/B.u6el52es/BUILD/zfs-2.0.5/include/os/linux/zfs/sys' make[5]: Entering directory '/tmp/B.u6el52es/BUILD/zfs-2.0.5/include/os/linux/zfs/sys' rm -f *.lo make[5]: Leaving directory '/tmp/B.u6el52es/BUILD/zfs-2.0.5/include/os/linux/zfs/sys' make[5]: Entering directory '/tmp/B.u6el52es/BUILD/zfs-2.0.5/include/os/linux/zfs' rm -rf .libs _libs make[5]: Leaving directory '/tmp/B.u6el52es/BUILD/zfs-2.0.5/include/os/linux/zfs' make[5]: Entering directory '/tmp/B.u6el52es/BUILD/zfs-2.0.5/include/os/linux/zfs' rm -f *.lo make[5]: Leaving directory '/tmp/B.u6el52es/BUILD/zfs-2.0.5/include/os/linux/zfs' make[4]: Entering directory '/tmp/B.u6el52es/BUILD/zfs-2.0.5/include/os/linux' rm -rf .libs _libs make[4]: Leaving directory '/tmp/B.u6el52es/BUILD/zfs-2.0.5/include/os/linux' make[4]: Entering directory '/tmp/B.u6el52es/BUILD/zfs-2.0.5/include/os/linux' rm -f *.lo make[4]: Leaving directory '/tmp/B.u6el52es/BUILD/zfs-2.0.5/include/os/linux' make[3]: Entering directory '/tmp/B.u6el52es/BUILD/zfs-2.0.5/include/os' rm -rf .libs _libs make[3]: Leaving directory '/tmp/B.u6el52es/BUILD/zfs-2.0.5/include/os' make[3]: Entering directory '/tmp/B.u6el52es/BUILD/zfs-2.0.5/include/os' rm -f *.lo make[3]: Leaving directory '/tmp/B.u6el52es/BUILD/zfs-2.0.5/include/os' make[2]: Entering directory '/tmp/B.u6el52es/BUILD/zfs-2.0.5/include' rm -rf .libs _libs make[2]: Leaving directory '/tmp/B.u6el52es/BUILD/zfs-2.0.5/include' make[2]: Entering directory '/tmp/B.u6el52es/BUILD/zfs-2.0.5/include' rm -f *.lo make[2]: Leaving directory '/tmp/B.u6el52es/BUILD/zfs-2.0.5/include' Making clean in rpm Making clean in generic make[2]: Entering directory '/tmp/B.u6el52es/BUILD/zfs-2.0.5/rpm/generic' rm -rf .libs _libs make[2]: Leaving directory '/tmp/B.u6el52es/BUILD/zfs-2.0.5/rpm/generic' make[2]: Entering directory '/tmp/B.u6el52es/BUILD/zfs-2.0.5/rpm/generic' rm -f *.lo make[2]: Leaving directory '/tmp/B.u6el52es/BUILD/zfs-2.0.5/rpm/generic' Making clean in redhat make[2]: Entering directory '/tmp/B.u6el52es/BUILD/zfs-2.0.5/rpm/redhat' rm -rf .libs _libs make[2]: Leaving directory '/tmp/B.u6el52es/BUILD/zfs-2.0.5/rpm/redhat' make[2]: Entering directory '/tmp/B.u6el52es/BUILD/zfs-2.0.5/rpm/redhat' rm -f *.lo make[2]: Leaving directory '/tmp/B.u6el52es/BUILD/zfs-2.0.5/rpm/redhat' make[2]: Entering directory '/tmp/B.u6el52es/BUILD/zfs-2.0.5/rpm' rm -rf .libs _libs make[2]: Leaving directory '/tmp/B.u6el52es/BUILD/zfs-2.0.5/rpm' make[2]: Entering directory '/tmp/B.u6el52es/BUILD/zfs-2.0.5/rpm' rm -f *.lo make[2]: Leaving directory '/tmp/B.u6el52es/BUILD/zfs-2.0.5/rpm' Making clean in scripts make[1]: Entering directory '/tmp/B.u6el52es/BUILD/zfs-2.0.5/scripts' rm -rf .libs _libs make[1]: Leaving directory '/tmp/B.u6el52es/BUILD/zfs-2.0.5/scripts' make[1]: Entering directory '/tmp/B.u6el52es/BUILD/zfs-2.0.5/scripts' rm -f common.sh make[1]: Leaving directory '/tmp/B.u6el52es/BUILD/zfs-2.0.5/scripts' make[1]: Entering directory '/tmp/B.u6el52es/BUILD/zfs-2.0.5/scripts' rm -f *.lo make[1]: Leaving directory '/tmp/B.u6el52es/BUILD/zfs-2.0.5/scripts' Making clean in module /usr/bin/make -C /usr/src/linux-4.14 M=`pwd` clean make[1]: Entering directory '/tmp/B.u6el52es/BUILD/zfs-2.0.5/module' if [ -f Module.symvers ]; then rm -f Module.symvers; fi if [ -f Module.markers ]; then rm -f Module.markers; fi find . -name '*.ur-safe' -type f -print | xargs rm -f make[1]: Leaving directory '/tmp/B.u6el52es/BUILD/zfs-2.0.5/module' make[1]: Entering directory '/tmp/B.u6el52es/BUILD/zfs-2.0.5' rm -rf .libs _libs make[1]: Leaving directory '/tmp/B.u6el52es/BUILD/zfs-2.0.5' make[1]: Entering directory '/tmp/B.u6el52es/BUILD/zfs-2.0.5' rm -f *.lo make[1]: Leaving directory '/tmp/B.u6el52es/BUILD/zfs-2.0.5' + /usr/bin/make -Otarget -j9 ./scripts/make_gitrev.sh include/zfs_gitrev.h /usr/bin/make all-recursive Making all in include Making all in sys Making all in fm Making all in fs make[5]: Nothing to be done for 'all'. make[5]: Nothing to be done for 'all-am'. Making all in fs make[4]: Nothing to be done for 'all'. Making all in crypto make[4]: Nothing to be done for 'all'. Making all in lua make[4]: Nothing to be done for 'all'. Making all in sysevent make[4]: Nothing to be done for 'all'. Making all in zstd make[4]: Nothing to be done for 'all'. make[4]: Nothing to be done for 'all-am'. Making all in os Making all in linux Making all in kernel Making all in linux make[6]: Nothing to be done for 'all'. make[6]: Nothing to be done for 'all-am'. Making all in spl Making all in rpc make[6]: Nothing to be done for 'all'. Making all in sys make[6]: Nothing to be done for 'all'. make[6]: Nothing to be done for 'all-am'. Making all in zfs Making all in sys make[6]: Nothing to be done for 'all'. make[6]: Nothing to be done for 'all-am'. make[5]: Nothing to be done for 'all-am'. make[4]: Nothing to be done for 'all-am'. make[3]: Nothing to be done for 'all-am'. Making all in rpm Making all in generic make[3]: Nothing to be done for 'all'. Making all in redhat make[3]: Nothing to be done for 'all'. make[3]: Nothing to be done for 'all-am'. Making all in scripts make[2]: Entering directory '/tmp/B.u6el52es/BUILD/zfs-2.0.5/scripts' /bin/sed -e '\|^export BIN_DIR=|s|$|/tmp/B.u6el52es/BUILD/zfs-2.0.5/bin|' \ -e '\|^export SBIN_DIR=|s|$|/tmp/B.u6el52es/BUILD/zfs-2.0.5/bin|' \ -e '\|^export ZTS_DIR=|s|$|/tmp/B.u6el52es/BUILD/zfs-2.0.5/tests|' \ -e '\|^export SCRIPT_DIR=|s|$|/tmp/B.u6el52es/BUILD/zfs-2.0.5/scripts|' \ /tmp/B.u6el52es/BUILD/zfs-2.0.5/scripts/common.sh.in >common.sh echo "$EXTRA_ENVIRONMENT" >>common.sh make[2]: Leaving directory '/tmp/B.u6el52es/BUILD/zfs-2.0.5/scripts' Making all in module list='icp lua zstd'; for targetdir in $list; do \ /usr/bin/make -C $targetdir; \ done make[3]: Entering directory '/tmp/B.u6el52es/BUILD/zfs-2.0.5/module/icp' mkdir -p api core spi io os algs algs/aes algs/edonr algs/modes algs/sha1 algs/sha2 algs/skein asm-x86_64 asm-x86_64/aes asm-x86_64/modes asm-x86_64/sha1 asm-x86_64/sha2 asm-i386 asm-generic make[3]: Leaving directory '/tmp/B.u6el52es/BUILD/zfs-2.0.5/module/icp' make[3]: Entering directory '/tmp/B.u6el52es/BUILD/zfs-2.0.5/module/lua' mkdir -p setjmp make[3]: Leaving directory '/tmp/B.u6el52es/BUILD/zfs-2.0.5/module/lua' make[3]: Entering directory '/tmp/B.u6el52es/BUILD/zfs-2.0.5/module/zstd' mkdir -p lib make[3]: Leaving directory '/tmp/B.u6el52es/BUILD/zfs-2.0.5/module/zstd' /usr/bin/make -C /usr/src/linux-4.14 M=`pwd` CONFIG_ZFS=m modules CC [M] /tmp/B.u6el52es/BUILD/zfs-2.0.5/module/spl/../os/linux/spl/spl-atomic.o CC [M] /tmp/B.u6el52es/BUILD/zfs-2.0.5/module/avl/avl.o CC [M] /tmp/B.u6el52es/BUILD/zfs-2.0.5/module/icp/illumos-crypto.o LD [M] /tmp/B.u6el52es/BUILD/zfs-2.0.5/module/avl/zavl.o CC [M] /tmp/B.u6el52es/BUILD/zfs-2.0.5/module/zfs/abd.o CC [M] /tmp/B.u6el52es/BUILD/zfs-2.0.5/module/zcommon/cityhash.o CC [M] /tmp/B.u6el52es/BUILD/zfs-2.0.5/module/spl/../os/linux/spl/spl-condvar.o CC [M] /tmp/B.u6el52es/BUILD/zfs-2.0.5/module/zstd/zfs_zstd.o CC [M] /tmp/B.u6el52es/BUILD/zfs-2.0.5/module/zcommon/zfeature_common.o CC [M] /tmp/B.u6el52es/BUILD/zfs-2.0.5/module/lua/lapi.o CC [M] /tmp/B.u6el52es/BUILD/zfs-2.0.5/module/zfs/aggsum.o CC [M] /tmp/B.u6el52es/BUILD/zfs-2.0.5/module/unicode/u8_textprep.o CC [M] /tmp/B.u6el52es/BUILD/zfs-2.0.5/module/spl/../os/linux/spl/spl-cred.o CC [M] /tmp/B.u6el52es/BUILD/zfs-2.0.5/module/icp/api/kcf_cipher.o CC [M] /tmp/B.u6el52es/BUILD/zfs-2.0.5/module/nvpair/nvpair.o CC [M] /tmp/B.u6el52es/BUILD/zfs-2.0.5/module/icp/api/kcf_digest.o CC [M] /tmp/B.u6el52es/BUILD/zfs-2.0.5/module/zcommon/zfs_comutil.o CC [M] /tmp/B.u6el52es/BUILD/zfs-2.0.5/module/spl/../os/linux/spl/spl-err.o CC [M] /tmp/B.u6el52es/BUILD/zfs-2.0.5/module/lua/lauxlib.o CC [M] /tmp/B.u6el52es/BUILD/zfs-2.0.5/module/unicode/uconv.o LD [M] /tmp/B.u6el52es/BUILD/zfs-2.0.5/module/unicode/zunicode.o CC [M] /tmp/B.u6el52es/BUILD/zfs-2.0.5/module/nvpair/fnvpair.o CC [M] /tmp/B.u6el52es/BUILD/zfs-2.0.5/module/zcommon/zfs_deleg.o CC [M] /tmp/B.u6el52es/BUILD/zfs-2.0.5/module/icp/api/kcf_miscapi.o /tmp/B.u6el52es/BUILD/zfs-2.0.5/module/icp/api/kcf_miscapi.c:65:22: warning: argument 1 of type 'char *' declared as a pointer [-Warray-parameter=] 65 | crypto_mech2id(char *mechname) | ~~~~~~^~~~~~~~ In file included from /tmp/B.u6el52es/BUILD/zfs-2.0.5/module/icp/api/kcf_miscapi.c:28: /tmp/B.u6el52es/BUILD/zfs-2.0.5/include/sys/crypto/api.h:61:61: note: previously declared as an array 'char[32]' 61 | extern crypto_mech_type_t crypto_mech2id(crypto_mech_name_t name); | ~~~~~~~~~~~~~~~~~~~^~~~ CC [M] /tmp/B.u6el52es/BUILD/zfs-2.0.5/module/zcommon/zfs_fletcher_superscalar.o CC [M] /tmp/B.u6el52es/BUILD/zfs-2.0.5/module/icp/api/kcf_mac.o CC [M] /tmp/B.u6el52es/BUILD/zfs-2.0.5/module/nvpair/nvpair_alloc_spl.o CC [M] /tmp/B.u6el52es/BUILD/zfs-2.0.5/module/spl/../os/linux/spl/spl-kmem.o CC [M] /tmp/B.u6el52es/BUILD/zfs-2.0.5/module/lua/lbaselib.o CC [M] /tmp/B.u6el52es/BUILD/zfs-2.0.5/module/spl/../os/linux/spl/spl-generic.o CC [M] /tmp/B.u6el52es/BUILD/zfs-2.0.5/module/nvpair/nvpair_alloc_fixed.o LD [M] /tmp/B.u6el52es/BUILD/zfs-2.0.5/module/nvpair/znvpair.o CC [M] /tmp/B.u6el52es/BUILD/zfs-2.0.5/module/lua/lcompat.o CC [M] /tmp/B.u6el52es/BUILD/zfs-2.0.5/module/lua/lcode.o CC [M] /tmp/B.u6el52es/BUILD/zfs-2.0.5/module/icp/api/kcf_ctxops.o CC [M] /tmp/B.u6el52es/BUILD/zfs-2.0.5/module/zcommon/zfs_fletcher.o CC [M] /tmp/B.u6el52es/BUILD/zfs-2.0.5/module/zcommon/zfs_fletcher_superscalar4.o CC [M] /tmp/B.u6el52es/BUILD/zfs-2.0.5/module/lua/lcorolib.o CC [M] /tmp/B.u6el52es/BUILD/zfs-2.0.5/module/lua/lctype.o CC [M] /tmp/B.u6el52es/BUILD/zfs-2.0.5/module/spl/../os/linux/spl/spl-kmem-cache.o CC [M] /tmp/B.u6el52es/BUILD/zfs-2.0.5/module/spl/../os/linux/spl/spl-proc.o CC [M] /tmp/B.u6el52es/BUILD/zfs-2.0.5/module/spl/../os/linux/spl/spl-kstat.o CC [M] /tmp/B.u6el52es/BUILD/zfs-2.0.5/module/zfs/arc.o CC [M] /tmp/B.u6el52es/BUILD/zfs-2.0.5/module/spl/../os/linux/spl/spl-procfs-list.o CC [M] /tmp/B.u6el52es/BUILD/zfs-2.0.5/module/icp/core/kcf_callprov.o CC [M] /tmp/B.u6el52es/BUILD/zfs-2.0.5/module/lua/ldebug.o CC [M] /tmp/B.u6el52es/BUILD/zfs-2.0.5/module/zcommon/zfs_namecheck.o CC [M] /tmp/B.u6el52es/BUILD/zfs-2.0.5/module/lua/ldo.o CC [M] /tmp/B.u6el52es/BUILD/zfs-2.0.5/module/zfs/blkptr.o CC [M] /tmp/B.u6el52es/BUILD/zfs-2.0.5/module/zcommon/zpool_prop.o CC [M] /tmp/B.u6el52es/BUILD/zfs-2.0.5/module/zfs/bplist.o CC [M] /tmp/B.u6el52es/BUILD/zfs-2.0.5/module/spl/../os/linux/spl/spl-thread.o CC [M] /tmp/B.u6el52es/BUILD/zfs-2.0.5/module/spl/../os/linux/spl/spl-taskq.o CC [M] /tmp/B.u6el52es/BUILD/zfs-2.0.5/module/zcommon/zfs_prop.o CC [M] /tmp/B.u6el52es/BUILD/zfs-2.0.5/module/icp/core/kcf_prov_tabs.o CC [M] /tmp/B.u6el52es/BUILD/zfs-2.0.5/module/lua/lfunc.o CC [M] /tmp/B.u6el52es/BUILD/zfs-2.0.5/module/zcommon/zfs_fletcher_intel.o CC [M] /tmp/B.u6el52es/BUILD/zfs-2.0.5/module/spl/../os/linux/spl/spl-trace.o CC [M] /tmp/B.u6el52es/BUILD/zfs-2.0.5/module/zfs/bptree.o CC [M] /tmp/B.u6el52es/BUILD/zfs-2.0.5/module/zfs/bpobj.o CC [M] /tmp/B.u6el52es/BUILD/zfs-2.0.5/module/zcommon/zprop_common.o CC [M] /tmp/B.u6el52es/BUILD/zfs-2.0.5/module/spl/../os/linux/spl/spl-tsd.o CC [M] /tmp/B.u6el52es/BUILD/zfs-2.0.5/module/icp/core/kcf_sched.o CC [M] /tmp/B.u6el52es/BUILD/zfs-2.0.5/module/zcommon/zfs_fletcher_sse.o CC [M] /tmp/B.u6el52es/BUILD/zfs-2.0.5/module/zcommon/zfs_fletcher_avx512.o LD [M] /tmp/B.u6el52es/BUILD/zfs-2.0.5/module/zcommon/zcommon.o CC [M] /tmp/B.u6el52es/BUILD/zfs-2.0.5/module/lua/lgc.o CC [M] /tmp/B.u6el52es/BUILD/zfs-2.0.5/module/zfs/btree.o CC [M] /tmp/B.u6el52es/BUILD/zfs-2.0.5/module/spl/../os/linux/spl/spl-vmem.o CC [M] /tmp/B.u6el52es/BUILD/zfs-2.0.5/module/spl/../os/linux/spl/spl-xdr.o CC [M] /tmp/B.u6el52es/BUILD/zfs-2.0.5/module/icp/core/kcf_mech_tabs.o CC [M] /tmp/B.u6el52es/BUILD/zfs-2.0.5/module/lua/llex.o CC [M] /tmp/B.u6el52es/BUILD/zfs-2.0.5/module/spl/../os/linux/spl/spl-zlib.o LD [M] /tmp/B.u6el52es/BUILD/zfs-2.0.5/module/spl/spl.o CC [M] /tmp/B.u6el52es/BUILD/zfs-2.0.5/module/lua/lmem.o CC [M] /tmp/B.u6el52es/BUILD/zfs-2.0.5/module/zfs/bqueue.o CC [M] /tmp/B.u6el52es/BUILD/zfs-2.0.5/module/lua/lobject.o CC [M] /tmp/B.u6el52es/BUILD/zfs-2.0.5/module/lua/lopcodes.o CC [M] /tmp/B.u6el52es/BUILD/zfs-2.0.5/module/zfs/dataset_kstats.o CC [M] /tmp/B.u6el52es/BUILD/zfs-2.0.5/module/icp/core/kcf_prov_lib.o CC [M] /tmp/B.u6el52es/BUILD/zfs-2.0.5/module/lua/lstate.o CC [M] /tmp/B.u6el52es/BUILD/zfs-2.0.5/module/icp/spi/kcf_spi.o CC [M] /tmp/B.u6el52es/BUILD/zfs-2.0.5/module/lua/lstring.o CC [M] /tmp/B.u6el52es/BUILD/zfs-2.0.5/module/icp/io/aes.o CC [M] /tmp/B.u6el52es/BUILD/zfs-2.0.5/module/icp/io/edonr_mod.o CC [M] /tmp/B.u6el52es/BUILD/zfs-2.0.5/module/zfs/dbuf_stats.o CC [M] /tmp/B.u6el52es/BUILD/zfs-2.0.5/module/lua/lparser.o CC [M] /tmp/B.u6el52es/BUILD/zfs-2.0.5/module/icp/io/sha1_mod.o CC [M] /tmp/B.u6el52es/BUILD/zfs-2.0.5/module/zfs/ddt_zap.o CC [M] /tmp/B.u6el52es/BUILD/zfs-2.0.5/module/icp/io/skein_mod.o CC [M] /tmp/B.u6el52es/BUILD/zfs-2.0.5/module/icp/io/sha2_mod.o CC [M] /tmp/B.u6el52es/BUILD/zfs-2.0.5/module/lua/ltable.o CC [M] /tmp/B.u6el52es/BUILD/zfs-2.0.5/module/lua/lstrlib.o CC [M] /tmp/B.u6el52es/BUILD/zfs-2.0.5/module/zfs/ddt.o CC [M] /tmp/B.u6el52es/BUILD/zfs-2.0.5/module/zfs/dbuf.o CC [M] /tmp/B.u6el52es/BUILD/zfs-2.0.5/module/icp/os/modhash.o CC [M] /tmp/B.u6el52es/BUILD/zfs-2.0.5/module/icp/os/modconf.o CC [M] /tmp/B.u6el52es/BUILD/zfs-2.0.5/module/zfs/dmu_diff.o CC [M] /tmp/B.u6el52es/BUILD/zfs-2.0.5/module/lua/ltm.o CC [M] /tmp/B.u6el52es/BUILD/zfs-2.0.5/module/lua/ltablib.o CC [M] /tmp/B.u6el52es/BUILD/zfs-2.0.5/module/icp/algs/modes/cbc.o CC [M] /tmp/B.u6el52es/BUILD/zfs-2.0.5/module/zfs/dmu_object.o CC [M] /tmp/B.u6el52es/BUILD/zfs-2.0.5/module/zfs/dmu.o CC [M] /tmp/B.u6el52es/BUILD/zfs-2.0.5/module/zfs/dmu_redact.o CC [M] /tmp/B.u6el52es/BUILD/zfs-2.0.5/module/lua/lvm.o CC [M] /tmp/B.u6el52es/BUILD/zfs-2.0.5/module/icp/algs/modes/ccm.o AS [M] /tmp/B.u6el52es/BUILD/zfs-2.0.5/module/lua/setjmp/setjmp.o CC [M] /tmp/B.u6el52es/BUILD/zfs-2.0.5/module/zfs/dmu_recv.o CC [M] /tmp/B.u6el52es/BUILD/zfs-2.0.5/module/icp/algs/modes/ctr.o CC [M] /tmp/B.u6el52es/BUILD/zfs-2.0.5/module/zfs/dmu_objset.o CC [M] /tmp/B.u6el52es/BUILD/zfs-2.0.5/module/lua/lzio.o LD [M] /tmp/B.u6el52es/BUILD/zfs-2.0.5/module/lua/zlua.o CC [M] /tmp/B.u6el52es/BUILD/zfs-2.0.5/module/zfs/dmu_send.o CC [M] /tmp/B.u6el52es/BUILD/zfs-2.0.5/module/zfs/dmu_traverse.o CC [M] /tmp/B.u6el52es/BUILD/zfs-2.0.5/module/icp/algs/modes/gcm_generic.o CC [M] /tmp/B.u6el52es/BUILD/zfs-2.0.5/module/icp/algs/modes/ecb.o CC [M] /tmp/B.u6el52es/BUILD/zfs-2.0.5/module/zfs/dmu_zfetch.o CC [M] /tmp/B.u6el52es/BUILD/zfs-2.0.5/module/zfs/dmu_tx.o CC [M] /tmp/B.u6el52es/BUILD/zfs-2.0.5/module/icp/algs/modes/modes.o CC [M] /tmp/B.u6el52es/BUILD/zfs-2.0.5/module/zfs/dnode_sync.o CC [M] /tmp/B.u6el52es/BUILD/zfs-2.0.5/module/icp/algs/modes/gcm.o CC [M] /tmp/B.u6el52es/BUILD/zfs-2.0.5/module/icp/algs/aes/aes_impl_generic.o CC [M] /tmp/B.u6el52es/BUILD/zfs-2.0.5/module/icp/algs/aes/aes_impl.o CC [M] /tmp/B.u6el52es/BUILD/zfs-2.0.5/module/zfs/dnode.o CC [M] /tmp/B.u6el52es/BUILD/zfs-2.0.5/module/icp/algs/aes/aes_modes.o CC [M] /tmp/B.u6el52es/BUILD/zfs-2.0.5/module/zfs/dsl_bookmark.o CC [M] /tmp/B.u6el52es/BUILD/zfs-2.0.5/module/zfs/dsl_crypt.o CC [M] /tmp/B.u6el52es/BUILD/zfs-2.0.5/module/zfs/dsl_deadlist.o CC [M] /tmp/B.u6el52es/BUILD/zfs-2.0.5/module/icp/algs/edonr/edonr.o CC [M] /tmp/B.u6el52es/BUILD/zfs-2.0.5/module/icp/algs/sha1/sha1.o CC [M] /tmp/B.u6el52es/BUILD/zfs-2.0.5/module/icp/algs/sha2/sha2.o CC [M] /tmp/B.u6el52es/BUILD/zfs-2.0.5/module/icp/algs/skein/skein_block.o CC [M] /tmp/B.u6el52es/BUILD/zfs-2.0.5/module/zfs/dsl_deleg.o CC [M] /tmp/B.u6el52es/BUILD/zfs-2.0.5/module/icp/algs/skein/skein.o CC [M] /tmp/B.u6el52es/BUILD/zfs-2.0.5/module/icp/algs/skein/skein_iv.o CC [M] /tmp/B.u6el52es/BUILD/zfs-2.0.5/module/zfs/dsl_destroy.o AS [M] /tmp/B.u6el52es/BUILD/zfs-2.0.5/module/icp/asm-x86_64/aes/aes_amd64.o AS [M] /tmp/B.u6el52es/BUILD/zfs-2.0.5/module/icp/asm-x86_64/aes/aes_aesni.o CC [M] /tmp/B.u6el52es/BUILD/zfs-2.0.5/module/zfs/dsl_dataset.o AS [M] /tmp/B.u6el52es/BUILD/zfs-2.0.5/module/icp/asm-x86_64/modes/gcm_pclmulqdq.o AS [M] /tmp/B.u6el52es/BUILD/zfs-2.0.5/module/icp/asm-x86_64/modes/aesni-gcm-x86_64.o CC [M] /tmp/B.u6el52es/BUILD/zfs-2.0.5/module/zfs/dsl_dir.o CC [M] /tmp/B.u6el52es/BUILD/zfs-2.0.5/module/zfs/dsl_pool.o AS [M] /tmp/B.u6el52es/BUILD/zfs-2.0.5/module/icp/asm-x86_64/modes/ghash-x86_64.o AS [M] /tmp/B.u6el52es/BUILD/zfs-2.0.5/module/icp/asm-x86_64/sha1/sha1-x86_64.o /tmp/B.u6el52es/BUILD/zfs-2.0.5/module/icp/asm-x86_64/sha1/.tmp_sha1-x86_64.o: warning: objtool: sha1_block_data_order()+0x11: unsupported stack pointer realignment AS [M] /tmp/B.u6el52es/BUILD/zfs-2.0.5/module/icp/asm-x86_64/sha2/sha256_impl.o /tmp/B.u6el52es/BUILD/zfs-2.0.5/module/icp/asm-x86_64/sha2/.tmp_sha256_impl.o: warning: objtool: SHA256TransformBlocks()+0x19: unsupported stack pointer realignment CC [M] /tmp/B.u6el52es/BUILD/zfs-2.0.5/module/icp/asm-x86_64/aes/aeskey.o CC [M] /tmp/B.u6el52es/BUILD/zfs-2.0.5/module/zfs/dsl_synctask.o CC [M] /tmp/B.u6el52es/BUILD/zfs-2.0.5/module/zfs/dsl_userhold.o AS [M] /tmp/B.u6el52es/BUILD/zfs-2.0.5/module/icp/asm-x86_64/sha2/sha512_impl.o /tmp/B.u6el52es/BUILD/zfs-2.0.5/module/icp/asm-x86_64/sha2/.tmp_sha512_impl.o: warning: objtool: SHA512TransformBlocks()+0x1c: unsupported stack pointer realignment CC [M] /tmp/B.u6el52es/BUILD/zfs-2.0.5/module/zfs/dsl_prop.o CC [M] /tmp/B.u6el52es/BUILD/zfs-2.0.5/module/zfs/edonr_zfs.o CC [M] /tmp/B.u6el52es/BUILD/zfs-2.0.5/module/zfs/gzip.o CC [M] /tmp/B.u6el52es/BUILD/zfs-2.0.5/module/zfs/hkdf.o CC [M] /tmp/B.u6el52es/BUILD/zfs-2.0.5/module/icp/algs/modes/gcm_pclmulqdq.o CC [M] /tmp/B.u6el52es/BUILD/zfs-2.0.5/module/icp/algs/aes/aes_impl_aesni.o CC [M] /tmp/B.u6el52es/BUILD/zfs-2.0.5/module/zfs/dsl_scan.o CC [M] /tmp/B.u6el52es/BUILD/zfs-2.0.5/module/zfs/fm.o CC [M] /tmp/B.u6el52es/BUILD/zfs-2.0.5/module/zfs/lz4.o CC [M] /tmp/B.u6el52es/BUILD/zfs-2.0.5/module/icp/algs/aes/aes_impl_x86-64.o LD [M] /tmp/B.u6el52es/BUILD/zfs-2.0.5/module/icp/icp.o CC [M] /tmp/B.u6el52es/BUILD/zfs-2.0.5/module/zfs/lzjb.o CC [M] /tmp/B.u6el52es/BUILD/zfs-2.0.5/module/zfs/pathname.o CC [M] /tmp/B.u6el52es/BUILD/zfs-2.0.5/module/zfs/objlist.o CC [M] /tmp/B.u6el52es/BUILD/zfs-2.0.5/module/zfs/multilist.o CC [M] /tmp/B.u6el52es/BUILD/zfs-2.0.5/module/zfs/mmp.o CC [M] /tmp/B.u6el52es/BUILD/zfs-2.0.5/module/zfs/refcount.o CC [M] /tmp/B.u6el52es/BUILD/zfs-2.0.5/module/zfs/rrwlock.o CC [M] /tmp/B.u6el52es/BUILD/zfs-2.0.5/module/zfs/range_tree.o CC [M] /tmp/B.u6el52es/BUILD/zfs-2.0.5/module/zfs/sha256.o CC [M] /tmp/B.u6el52es/BUILD/zfs-2.0.5/module/zfs/skein_zfs.o CC [M] /tmp/B.u6el52es/BUILD/zfs-2.0.5/module/zfs/spa_boot.o CC [M] /tmp/B.u6el52es/BUILD/zfs-2.0.5/module/zfs/metaslab.o CC [M] /tmp/B.u6el52es/BUILD/zfs-2.0.5/module/zfs/sa.o CC [M] /tmp/B.u6el52es/BUILD/zfs-2.0.5/module/zfs/spa_checkpoint.o CC [M] /tmp/B.u6el52es/BUILD/zfs-2.0.5/module/zfs/spa_errlog.o CC [M] /tmp/B.u6el52es/BUILD/zfs-2.0.5/module/zfs/spa_log_spacemap.o CC [M] /tmp/B.u6el52es/BUILD/zfs-2.0.5/module/zfs/spa_config.o CC [M] /tmp/B.u6el52es/BUILD/zfs-2.0.5/module/zfs/spa_history.o CC [M] /tmp/B.u6el52es/BUILD/zfs-2.0.5/module/zfs/space_reftree.o CC [M] /tmp/B.u6el52es/BUILD/zfs-2.0.5/module/zfs/spa_stats.o CC [M] /tmp/B.u6el52es/BUILD/zfs-2.0.5/module/zfs/uberblock.o CC [M] /tmp/B.u6el52es/BUILD/zfs-2.0.5/module/zfs/space_map.o CC [M] /tmp/B.u6el52es/BUILD/zfs-2.0.5/module/zfs/unique.o CC [M] /tmp/B.u6el52es/BUILD/zfs-2.0.5/module/zfs/txg.o CC [M] /tmp/B.u6el52es/BUILD/zfs-2.0.5/module/zfs/vdev_cache.o CC [M] /tmp/B.u6el52es/BUILD/zfs-2.0.5/module/zfs/spa_misc.o CC [M] /tmp/B.u6el52es/BUILD/zfs-2.0.5/module/zfs/spa.o CC [M] /tmp/B.u6el52es/BUILD/zfs-2.0.5/module/zfs/vdev_indirect_births.o CC [M] /tmp/B.u6el52es/BUILD/zfs-2.0.5/module/zfs/vdev_indirect_mapping.o CC [M] /tmp/B.u6el52es/BUILD/zfs-2.0.5/module/zfs/vdev_indirect.o CC [M] /tmp/B.u6el52es/BUILD/zfs-2.0.5/module/zfs/vdev_missing.o CC [M] /tmp/B.u6el52es/BUILD/zfs-2.0.5/module/zfs/vdev_mirror.o CC [M] /tmp/B.u6el52es/BUILD/zfs-2.0.5/module/zfs/vdev_label.o CC [M] /tmp/B.u6el52es/BUILD/zfs-2.0.5/module/zfs/vdev_initialize.o CC [M] /tmp/B.u6el52es/BUILD/zfs-2.0.5/module/zfs/vdev_queue.o CC [M] /tmp/B.u6el52es/BUILD/zfs-2.0.5/module/zfs/vdev.o CC [M] /tmp/B.u6el52es/BUILD/zfs-2.0.5/module/zfs/vdev_raidz_math.o CC [M] /tmp/B.u6el52es/BUILD/zfs-2.0.5/module/zfs/vdev_rebuild.o CC [M] /tmp/B.u6el52es/BUILD/zfs-2.0.5/module/zfs/vdev_root.o CC [M] /tmp/B.u6el52es/BUILD/zfs-2.0.5/module/zfs/vdev_raidz.o CC [M] /tmp/B.u6el52es/BUILD/zfs-2.0.5/module/zfs/vdev_raidz_math_scalar.o CC [M] /tmp/B.u6el52es/BUILD/zfs-2.0.5/module/zfs/zap_leaf.o CC [M] /tmp/B.u6el52es/BUILD/zfs-2.0.5/module/zfs/zcp_global.o CC [M] /tmp/B.u6el52es/BUILD/zfs-2.0.5/module/zfs/zap.o CC [M] /tmp/B.u6el52es/BUILD/zfs-2.0.5/module/zfs/zcp_get.o CC [M] /tmp/B.u6el52es/BUILD/zfs-2.0.5/module/zfs/vdev_trim.o CC [M] /tmp/B.u6el52es/BUILD/zfs-2.0.5/module/zfs/zcp.o CC [M] /tmp/B.u6el52es/BUILD/zfs-2.0.5/module/zfs/vdev_removal.o CC [M] /tmp/B.u6el52es/BUILD/zfs-2.0.5/module/zfs/zcp_iter.o CC [M] /tmp/B.u6el52es/BUILD/zfs-2.0.5/module/zfs/zcp_set.o CC [M] /tmp/B.u6el52es/BUILD/zfs-2.0.5/module/zfs/zcp_synctask.o CC [M] /tmp/B.u6el52es/BUILD/zfs-2.0.5/module/zfs/zap_micro.o CC [M] /tmp/B.u6el52es/BUILD/zfs-2.0.5/module/zfs/zfeature.o CC [M] /tmp/B.u6el52es/BUILD/zfs-2.0.5/module/zfs/zfs_byteswap.o CC [M] /tmp/B.u6el52es/BUILD/zfs-2.0.5/module/zfs/zfs_fuid.o CC [M] /tmp/B.u6el52es/BUILD/zfs-2.0.5/module/zfs/zfs_onexit.o CC [M] /tmp/B.u6el52es/BUILD/zfs-2.0.5/module/zfs/zfs_fm.o CC [M] /tmp/B.u6el52es/BUILD/zfs-2.0.5/module/zfs/zfs_ratelimit.o CC [M] /tmp/B.u6el52es/BUILD/zfs-2.0.5/module/zfs/zfs_log.o CC [M] /tmp/B.u6el52es/BUILD/zfs-2.0.5/module/zfs/zfs_replay.o CC [M] /tmp/B.u6el52es/BUILD/zfs-2.0.5/module/zfs/zfs_quota.o CC [M] /tmp/B.u6el52es/BUILD/zfs-2.0.5/module/zfs/zfs_rlock.o CC [M] /tmp/B.u6el52es/BUILD/zfs-2.0.5/module/zfs/zfs_sa.o CC [M] /tmp/B.u6el52es/BUILD/zfs-2.0.5/module/zfs/zio_compress.o CC [M] /tmp/B.u6el52es/BUILD/zfs-2.0.5/module/zfs/zfs_vnops.o CC [M] /tmp/B.u6el52es/BUILD/zfs-2.0.5/module/zfs/zio_checksum.o CC [M] /tmp/B.u6el52es/BUILD/zfs-2.0.5/module/zfs/zle.o CC [M] /tmp/B.u6el52es/BUILD/zfs-2.0.5/module/zfs/zfs_ioctl.o CC [M] /tmp/B.u6el52es/BUILD/zfs-2.0.5/module/zfs/zil.o CC [M] /tmp/B.u6el52es/BUILD/zfs-2.0.5/module/zfs/zthr.o CC [M] /tmp/B.u6el52es/BUILD/zfs-2.0.5/module/zfs/zio_inject.o CC [M] /tmp/B.u6el52es/BUILD/zfs-2.0.5/module/zfs/zrlock.o CC [M] /tmp/B.u6el52es/BUILD/zfs-2.0.5/module/zfs/../os/linux/zfs/qat.o CC [M] /tmp/B.u6el52es/BUILD/zfs-2.0.5/module/zfs/../os/linux/zfs/qat_compress.o CC [M] /tmp/B.u6el52es/BUILD/zfs-2.0.5/module/zfs/zvol.o CC [M] /tmp/B.u6el52es/BUILD/zfs-2.0.5/module/zfs/../os/linux/zfs/mmp_os.o CC [M] /tmp/B.u6el52es/BUILD/zfs-2.0.5/module/zfs/../os/linux/zfs/qat_crypt.o CC [M] /tmp/B.u6el52es/BUILD/zfs-2.0.5/module/zfs/../os/linux/zfs/policy.o CC [M] /tmp/B.u6el52es/BUILD/zfs-2.0.5/module/zfs/../os/linux/zfs/abd_os.o CC [M] /tmp/B.u6el52es/BUILD/zfs-2.0.5/module/zfs/../os/linux/zfs/arc_os.o CC [M] /tmp/B.u6el52es/BUILD/zfs-2.0.5/module/zfs/zio.o CC [M] /tmp/B.u6el52es/BUILD/zfs-2.0.5/module/zfs/../os/linux/zfs/spa_misc_os.o CC [M] /tmp/B.u6el52es/BUILD/zfs-2.0.5/module/zfs/../os/linux/zfs/trace.o CC [M] /tmp/B.u6el52es/BUILD/zfs-2.0.5/module/zfs/../os/linux/zfs/vdev_file.o CC [M] /tmp/B.u6el52es/BUILD/zfs-2.0.5/module/zfs/../os/linux/zfs/vdev_disk.o CC [M] /tmp/B.u6el52es/BUILD/zfs-2.0.5/module/zfs/../os/linux/zfs/zfs_debug.o CC [M] /tmp/B.u6el52es/BUILD/zfs-2.0.5/module/zfs/../os/linux/zfs/zfs_ctldir.o CC [M] /tmp/B.u6el52es/BUILD/zfs-2.0.5/module/zfs/../os/linux/zfs/zfs_dir.o CC [M] /tmp/B.u6el52es/BUILD/zfs-2.0.5/module/zfs/../os/linux/zfs/zfs_file_os.o CC [M] /tmp/B.u6el52es/BUILD/zfs-2.0.5/module/zfs/../os/linux/zfs/zfs_racct.o CC [M] /tmp/B.u6el52es/BUILD/zfs-2.0.5/module/zfs/../os/linux/zfs/zfs_ioctl_os.o CC [M] /tmp/B.u6el52es/BUILD/zfs-2.0.5/module/zfs/../os/linux/zfs/zfs_acl.o CC [M] /tmp/B.u6el52es/BUILD/zfs-2.0.5/module/zfs/../os/linux/zfs/zfs_sysfs.o CC [M] /tmp/B.u6el52es/BUILD/zfs-2.0.5/module/zfs/../os/linux/zfs/zfs_uio.o CC [M] /tmp/B.u6el52es/BUILD/zfs-2.0.5/module/zfs/../os/linux/zfs/zpl_ctldir.o CC [M] /tmp/B.u6el52es/BUILD/zfs-2.0.5/module/zfs/../os/linux/zfs/zpl_export.o CC [M] /tmp/B.u6el52es/BUILD/zfs-2.0.5/module/zfs/../os/linux/zfs/zio_crypt.o CC [M] /tmp/B.u6el52es/BUILD/zfs-2.0.5/module/zfs/../os/linux/zfs/zpl_file.o CC [M] /tmp/B.u6el52es/BUILD/zfs-2.0.5/module/zfs/../os/linux/zfs/zfs_vfsops.o CC [M] /tmp/B.u6el52es/BUILD/zfs-2.0.5/module/zfs/../os/linux/zfs/zpl_inode.o CC [M] /tmp/B.u6el52es/BUILD/zfs-2.0.5/module/zfs/../os/linux/zfs/zfs_znode.o CC [M] /tmp/B.u6el52es/BUILD/zfs-2.0.5/module/zfs/../os/linux/zfs/zpl_super.o CC [M] /tmp/B.u6el52es/BUILD/zfs-2.0.5/module/zfs/../os/linux/zfs/zpl_xattr.o CC [M] /tmp/B.u6el52es/BUILD/zfs-2.0.5/module/zfs/../os/linux/zfs/zvol_os.o CC [M] /tmp/B.u6el52es/BUILD/zfs-2.0.5/module/zfs/../os/linux/zfs/zfs_vnops_os.o CC [M] /tmp/B.u6el52es/BUILD/zfs-2.0.5/module/zfs/vdev_raidz_math_ssse3.o CC [M] /tmp/B.u6el52es/BUILD/zfs-2.0.5/module/zfs/vdev_raidz_math_avx2.o CC [M] /tmp/B.u6el52es/BUILD/zfs-2.0.5/module/zfs/vdev_raidz_math_avx512bw.o CC [M] /tmp/B.u6el52es/BUILD/zfs-2.0.5/module/zfs/vdev_raidz_math_avx512f.o CC [M] /tmp/B.u6el52es/BUILD/zfs-2.0.5/module/zfs/vdev_raidz_math_sse2.o LD [M] /tmp/B.u6el52es/BUILD/zfs-2.0.5/module/zfs/zfs.o CC [M] /tmp/B.u6el52es/BUILD/zfs-2.0.5/module/zstd/lib/zstd.o LD [M] /tmp/B.u6el52es/BUILD/zfs-2.0.5/module/zstd/zzstd.o make[3]: Entering directory '/usr/src/linux-4.14-4.14.246' Building modules, stage 2. make[3]: Leaving directory '/usr/src/linux-4.14-4.14.246' MODPOST 9 modules CC /tmp/B.u6el52es/BUILD/zfs-2.0.5/module/lua/zlua.mod.o LD [M] /tmp/B.u6el52es/BUILD/zfs-2.0.5/module/lua/zlua.ko CC /tmp/B.u6el52es/BUILD/zfs-2.0.5/module/avl/zavl.mod.o CC /tmp/B.u6el52es/BUILD/zfs-2.0.5/module/unicode/zunicode.mod.o CC /tmp/B.u6el52es/BUILD/zfs-2.0.5/module/nvpair/znvpair.mod.o LD [M] /tmp/B.u6el52es/BUILD/zfs-2.0.5/module/avl/zavl.ko LD [M] /tmp/B.u6el52es/BUILD/zfs-2.0.5/module/unicode/zunicode.ko LD [M] /tmp/B.u6el52es/BUILD/zfs-2.0.5/module/nvpair/znvpair.ko CC /tmp/B.u6el52es/BUILD/zfs-2.0.5/module/zcommon/zcommon.mod.o LD [M] /tmp/B.u6el52es/BUILD/zfs-2.0.5/module/zcommon/zcommon.ko CC /tmp/B.u6el52es/BUILD/zfs-2.0.5/module/zfs/zfs.mod.o LD [M] /tmp/B.u6el52es/BUILD/zfs-2.0.5/module/zfs/zfs.ko CC /tmp/B.u6el52es/BUILD/zfs-2.0.5/module/icp/icp.mod.o LD [M] /tmp/B.u6el52es/BUILD/zfs-2.0.5/module/icp/icp.ko CC /tmp/B.u6el52es/BUILD/zfs-2.0.5/module/spl/spl.mod.o LD [M] /tmp/B.u6el52es/BUILD/zfs-2.0.5/module/spl/spl.ko CC /tmp/B.u6el52es/BUILD/zfs-2.0.5/module/zstd/zzstd.mod.o LD [M] /tmp/B.u6el52es/BUILD/zfs-2.0.5/module/zstd/zzstd.ko make[2]: Entering directory '/tmp/B.u6el52es/BUILD/zfs-2.0.5' [ -x ./scripts/zfs-tests.sh ] && \ ./scripts/zfs-tests.sh -c make[2]: Leaving directory '/tmp/B.u6el52es/BUILD/zfs-2.0.5' + pwd + p=/tmp/B.u6el52es/BUILD/zfs-2.0.5 + /usr/bin/make -Otarget -j9 install 'DESTDIR=/tmp/B.u6el52es/BUILD/zfs-2.0.5/installed' 'INSTALL_MOD_DIR=misc' Making install in include Making install in sys Making install in fm Making install in fs make[5]: Nothing to be done for 'install-exec-am'. make[5]: Entering directory '/tmp/B.u6el52es/BUILD/zfs-2.0.5/include/sys/fm/fs' /bin/mkdir -p '/tmp/B.u6el52es/BUILD/zfs-2.0.5/installed/usr/src/zfs-2.0.5/include/sys/fm/fs' /usr/bin/install -c -m 644 zfs.h '/tmp/B.u6el52es/BUILD/zfs-2.0.5/installed/usr/src/zfs-2.0.5/include/sys/fm/fs' make[5]: Leaving directory '/tmp/B.u6el52es/BUILD/zfs-2.0.5/include/sys/fm/fs' make[5]: Nothing to be done for 'install-exec-am'. make[5]: Entering directory '/tmp/B.u6el52es/BUILD/zfs-2.0.5/include/sys/fm' /bin/mkdir -p '/tmp/B.u6el52es/BUILD/zfs-2.0.5/installed/usr/src/zfs-2.0.5/include/sys/fm' /usr/bin/install -c -m 644 protocol.h util.h '/tmp/B.u6el52es/BUILD/zfs-2.0.5/installed/usr/src/zfs-2.0.5/include/sys/fm' make[5]: Leaving directory '/tmp/B.u6el52es/BUILD/zfs-2.0.5/include/sys/fm' Making install in fs make[4]: Nothing to be done for 'install-exec-am'. make[4]: Entering directory '/tmp/B.u6el52es/BUILD/zfs-2.0.5/include/sys/fs' /bin/mkdir -p '/tmp/B.u6el52es/BUILD/zfs-2.0.5/installed/usr/src/zfs-2.0.5/include/sys/fs' /usr/bin/install -c -m 644 zfs.h '/tmp/B.u6el52es/BUILD/zfs-2.0.5/installed/usr/src/zfs-2.0.5/include/sys/fs' make[4]: Leaving directory '/tmp/B.u6el52es/BUILD/zfs-2.0.5/include/sys/fs' Making install in crypto make[4]: Nothing to be done for 'install-exec-am'. make[4]: Entering directory '/tmp/B.u6el52es/BUILD/zfs-2.0.5/include/sys/crypto' /bin/mkdir -p '/tmp/B.u6el52es/BUILD/zfs-2.0.5/installed/usr/src/zfs-2.0.5/include/sys/crypto' /usr/bin/install -c -m 644 api.h common.h icp.h '/tmp/B.u6el52es/BUILD/zfs-2.0.5/installed/usr/src/zfs-2.0.5/include/sys/crypto' make[4]: Leaving directory '/tmp/B.u6el52es/BUILD/zfs-2.0.5/include/sys/crypto' Making install in lua make[4]: Nothing to be done for 'install-exec-am'. make[4]: Entering directory '/tmp/B.u6el52es/BUILD/zfs-2.0.5/include/sys/lua' /bin/mkdir -p '/tmp/B.u6el52es/BUILD/zfs-2.0.5/installed/usr/src/zfs-2.0.5/include/sys/lua' /usr/bin/install -c -m 644 lua.h luaconf.h lualib.h lauxlib.h '/tmp/B.u6el52es/BUILD/zfs-2.0.5/installed/usr/src/zfs-2.0.5/include/sys/lua' make[4]: Leaving directory '/tmp/B.u6el52es/BUILD/zfs-2.0.5/include/sys/lua' Making install in sysevent make[4]: Nothing to be done for 'install-exec-am'. make[4]: Entering directory '/tmp/B.u6el52es/BUILD/zfs-2.0.5/include/sys/sysevent' /bin/mkdir -p '/tmp/B.u6el52es/BUILD/zfs-2.0.5/installed/usr/src/zfs-2.0.5/include/sys/sysevent' /usr/bin/install -c -m 644 eventdefs.h dev.h '/tmp/B.u6el52es/BUILD/zfs-2.0.5/installed/usr/src/zfs-2.0.5/include/sys/sysevent' make[4]: Leaving directory '/tmp/B.u6el52es/BUILD/zfs-2.0.5/include/sys/sysevent' Making install in zstd make[4]: Nothing to be done for 'install-exec-am'. make[4]: Entering directory '/tmp/B.u6el52es/BUILD/zfs-2.0.5/include/sys/zstd' /bin/mkdir -p '/tmp/B.u6el52es/BUILD/zfs-2.0.5/installed/usr/src/zfs-2.0.5/include/sys/zstd' /usr/bin/install -c -m 644 ../../../include/sys/zstd/zstd.h '/tmp/B.u6el52es/BUILD/zfs-2.0.5/installed/usr/src/zfs-2.0.5/include/sys/zstd' make[4]: Leaving directory '/tmp/B.u6el52es/BUILD/zfs-2.0.5/include/sys/zstd' make[4]: Nothing to be done for 'install-exec-am'. make[4]: Entering directory '/tmp/B.u6el52es/BUILD/zfs-2.0.5/include/sys' /bin/mkdir -p '/tmp/B.u6el52es/BUILD/zfs-2.0.5/installed/usr/src/zfs-2.0.5/include/sys' /usr/bin/install -c -m 644 abd.h abd_impl.h aggsum.h arc.h arc_impl.h avl.h avl_impl.h bitops.h blkptr.h bplist.h bpobj.h bptree.h btree.h bqueue.h dataset_kstats.h dbuf.h ddt.h dmu.h dmu_impl.h dmu_objset.h dmu_recv.h dmu_redact.h dmu_send.h dmu_traverse.h dmu_tx.h dmu_zfetch.h dnode.h dsl_bookmark.h dsl_dataset.h dsl_deadlist.h dsl_deleg.h dsl_destroy.h dsl_dir.h dsl_crypt.h dsl_pool.h dsl_prop.h dsl_scan.h dsl_synctask.h dsl_userhold.h edonr.h '/tmp/B.u6el52es/BUILD/zfs-2.0.5/installed/usr/src/zfs-2.0.5/include/sys' /usr/bin/install -c -m 644 efi_partition.h frame.h hkdf.h metaslab.h metaslab_impl.h mmp.h mntent.h mod.h multilist.h note.h nvpair.h nvpair_impl.h objlist.h pathname.h qat.h range_tree.h rrwlock.h sa.h sa_impl.h skein.h spa_boot.h spa_checkpoint.h spa_log_spacemap.h space_map.h space_reftree.h spa.h spa_impl.h spa_checksum.h sysevent.h txg.h txg_impl.h u8_textprep_data.h u8_textprep.h uberblock.h uberblock_impl.h uio_impl.h unique.h uuid.h vdev_disk.h vdev_file.h '/tmp/B.u6el52es/BUILD/zfs-2.0.5/installed/usr/src/zfs-2.0.5/include/sys' /usr/bin/install -c -m 644 vdev.h vdev_impl.h vdev_indirect_births.h vdev_indirect_mapping.h vdev_initialize.h vdev_raidz.h vdev_raidz_impl.h vdev_rebuild.h vdev_removal.h vdev_trim.h xvattr.h zap.h zap_impl.h zap_leaf.h zcp.h zcp_global.h zcp_iter.h zcp_prop.h zcp_set.h zfeature.h zfs_acl.h zfs_bootenv.h zfs_context.h zfs_debug.h zfs_delay.h zfs_file.h zfs_fuid.h zfs_project.h zfs_quota.h zfs_racct.h zfs_ratelimit.h zfs_refcount.h zfs_rlock.h zfs_sa.h zfs_stat.h zfs_sysfs.h zfs_vfsops.h zfs_vnops.h zfs_znode.h zil.h '/tmp/B.u6el52es/BUILD/zfs-2.0.5/installed/usr/src/zfs-2.0.5/include/sys' /usr/bin/install -c -m 644 zil_impl.h zio_checksum.h zio_compress.h zio_crypt.h zio.h zio_impl.h zio_priority.h zrlock.h zthr.h zfs_ioctl.h zfs_ioctl_impl.h zfs_onexit.h zvol.h zvol_impl.h '/tmp/B.u6el52es/BUILD/zfs-2.0.5/installed/usr/src/zfs-2.0.5/include/sys' make[4]: Leaving directory '/tmp/B.u6el52es/BUILD/zfs-2.0.5/include/sys' Making install in os Making install in linux Making install in kernel Making install in linux make[6]: Nothing to be done for 'install-exec-am'. make[6]: Entering directory '/tmp/B.u6el52es/BUILD/zfs-2.0.5/include/os/linux/kernel/linux' /bin/mkdir -p '/tmp/B.u6el52es/BUILD/zfs-2.0.5/installed/usr/src/zfs-2.0.5/include/linux' /usr/bin/install -c -m 644 dcache_compat.h xattr_compat.h vfs_compat.h blkdev_compat.h utsname_compat.h kmap_compat.h percpu_compat.h simd.h simd_x86.h simd_aarch64.h simd_powerpc.h mod_compat.h page_compat.h compiler_compat.h '/tmp/B.u6el52es/BUILD/zfs-2.0.5/installed/usr/src/zfs-2.0.5/include/linux' make[6]: Leaving directory '/tmp/B.u6el52es/BUILD/zfs-2.0.5/include/os/linux/kernel/linux' make[6]: Nothing to be done for 'install-exec-am'. make[6]: Nothing to be done for 'install-data-am'. Making install in spl Making install in rpc make[6]: Nothing to be done for 'install-exec-am'. make[6]: Entering directory '/tmp/B.u6el52es/BUILD/zfs-2.0.5/include/os/linux/spl/rpc' /bin/mkdir -p '/tmp/B.u6el52es/BUILD/zfs-2.0.5/installed/usr/src/zfs-2.0.5/include/spl/rpc' /usr/bin/install -c -m 644 xdr.h '/tmp/B.u6el52es/BUILD/zfs-2.0.5/installed/usr/src/zfs-2.0.5/include/spl/rpc' make[6]: Leaving directory '/tmp/B.u6el52es/BUILD/zfs-2.0.5/include/os/linux/spl/rpc' Making install in sys make[6]: Nothing to be done for 'install-exec-am'. make[6]: Entering directory '/tmp/B.u6el52es/BUILD/zfs-2.0.5/include/os/linux/spl/sys' /bin/mkdir -p '/tmp/B.u6el52es/BUILD/zfs-2.0.5/installed/usr/src/zfs-2.0.5/include/spl/sys' /usr/bin/install -c -m 644 acl.h atomic.h byteorder.h callb.h callo.h cmn_err.h condvar.h console.h cred.h ctype.h debug.h disp.h dkio.h errno.h fcntl.h file.h inttypes.h isa_defs.h kmem_cache.h kmem.h kstat.h list.h mod_os.h mutex.h param.h processor.h proc.h procfs_list.h random.h rwlock.h shrinker.h sid.h signal.h simd.h stat.h strings.h sunddi.h sysmacros.h systeminfo.h taskq.h '/tmp/B.u6el52es/BUILD/zfs-2.0.5/installed/usr/src/zfs-2.0.5/include/spl/sys' /usr/bin/install -c -m 644 thread.h time.h timer.h trace.h trace_spl.h trace_taskq.h tsd.h types32.h types.h uio.h user.h vfs.h vmem.h vmsystm.h vnode.h wait.h zmod.h zone.h '/tmp/B.u6el52es/BUILD/zfs-2.0.5/installed/usr/src/zfs-2.0.5/include/spl/sys' make[6]: Leaving directory '/tmp/B.u6el52es/BUILD/zfs-2.0.5/include/os/linux/spl/sys' make[6]: Nothing to be done for 'install-exec-am'. make[6]: Nothing to be done for 'install-data-am'. Making install in zfs Making install in sys make[6]: Nothing to be done for 'install-exec-am'. make[6]: Entering directory '/tmp/B.u6el52es/BUILD/zfs-2.0.5/include/os/linux/zfs/sys' /bin/mkdir -p '/tmp/B.u6el52es/BUILD/zfs-2.0.5/installed/usr/src/zfs-2.0.5/include/sys' /usr/bin/install -c -m 644 policy.h sha2.h trace_acl.h trace_arc.h trace_common.h trace_zfs.h trace_dbgmsg.h trace_dbuf.h trace_dmu.h trace_dnode.h trace_multilist.h trace_rrwlock.h trace_txg.h trace_vdev.h trace_zil.h trace_zio.h trace_zrlock.h zfs_bootenv_os.h zfs_context_os.h zfs_ctldir.h zfs_dir.h zfs_vfsops_os.h zfs_vnops_os.h zfs_znode_impl.h zpl.h '/tmp/B.u6el52es/BUILD/zfs-2.0.5/installed/usr/src/zfs-2.0.5/include/sys' make[6]: Leaving directory '/tmp/B.u6el52es/BUILD/zfs-2.0.5/include/os/linux/zfs/sys' make[6]: Nothing to be done for 'install-exec-am'. make[6]: Nothing to be done for 'install-data-am'. make[5]: Nothing to be done for 'install-exec-am'. make[5]: Nothing to be done for 'install-data-am'. make[4]: Nothing to be done for 'install-exec-am'. make[4]: Nothing to be done for 'install-data-am'. make[3]: Nothing to be done for 'install-exec-am'. make[3]: Entering directory '/tmp/B.u6el52es/BUILD/zfs-2.0.5/include' /bin/mkdir -p '/tmp/B.u6el52es/BUILD/zfs-2.0.5/installed/usr/src/zfs-2.0.5/include' /usr/bin/install -c -m 644 cityhash.h zfeature_common.h zfs_comutil.h zfs_deleg.h zfs_fletcher.h zfs_namecheck.h zfs_prop.h '/tmp/B.u6el52es/BUILD/zfs-2.0.5/installed/usr/src/zfs-2.0.5/include' make[3]: Leaving directory '/tmp/B.u6el52es/BUILD/zfs-2.0.5/include' Making install in rpm Making install in generic make[3]: Nothing to be done for 'install-exec-am'. make[3]: Nothing to be done for 'install-data-am'. Making install in redhat make[3]: Nothing to be done for 'install-exec-am'. make[3]: Nothing to be done for 'install-data-am'. make[3]: Nothing to be done for 'install-exec-am'. make[3]: Nothing to be done for 'install-data-am'. Making install in scripts make[1]: Entering directory '/tmp/B.u6el52es/BUILD/zfs-2.0.5/scripts' /bin/sed -e '\|^export BIN_DIR=|s|$|/tmp/B.u6el52es/BUILD/zfs-2.0.5/bin|' \ -e '\|^export SBIN_DIR=|s|$|/tmp/B.u6el52es/BUILD/zfs-2.0.5/bin|' \ -e '\|^export ZTS_DIR=|s|$|/tmp/B.u6el52es/BUILD/zfs-2.0.5/tests|' \ -e '\|^export SCRIPT_DIR=|s|$|/tmp/B.u6el52es/BUILD/zfs-2.0.5/scripts|' \ /tmp/B.u6el52es/BUILD/zfs-2.0.5/scripts/common.sh.in >common.sh echo "$EXTRA_ENVIRONMENT" >>common.sh make[1]: Leaving directory '/tmp/B.u6el52es/BUILD/zfs-2.0.5/scripts' make[2]: Nothing to be done for 'install-exec-am'. make[2]: Entering directory '/tmp/B.u6el52es/BUILD/zfs-2.0.5/scripts' /bin/mkdir -p '/tmp/B.u6el52es/BUILD/zfs-2.0.5/installed/usr/share/zfs' /usr/bin/install -c zimport.sh zfs.sh zfs-tests.sh zloop.sh zfs-helpers.sh '/tmp/B.u6el52es/BUILD/zfs-2.0.5/installed/usr/share/zfs' make[2]: Leaving directory '/tmp/B.u6el52es/BUILD/zfs-2.0.5/scripts' /usr/bin/make install-data-hook make[3]: Entering directory '/tmp/B.u6el52es/BUILD/zfs-2.0.5/scripts' /bin/sed -e '\|^export BIN_DIR=|s|$|/usr/bin|' \ -e '\|^export SBIN_DIR=|s|$|/usr/sbin|' \ -e '\|^export ZTS_DIR=|s|$|/usr/share/zfs|' \ -e '\|^export SCRIPT_DIR=|s|$|/usr/share/zfs|' \ /tmp/B.u6el52es/BUILD/zfs-2.0.5/scripts/common.sh.in \ >/tmp/B.u6el52es/BUILD/zfs-2.0.5/installed/usr/share/zfs/common.sh make[3]: Leaving directory '/tmp/B.u6el52es/BUILD/zfs-2.0.5/scripts' Making install in module /usr/bin/make -C /usr/src/linux-4.14 M=`pwd` modules_install \ INSTALL_MOD_PATH=/tmp/B.u6el52es/BUILD/zfs-2.0.5/installed \ INSTALL_MOD_DIR=misc \ KERNELRELEASE=4.14.246-1 INSTALL /tmp/B.u6el52es/BUILD/zfs-2.0.5/module/avl/zavl.ko INSTALL /tmp/B.u6el52es/BUILD/zfs-2.0.5/module/unicode/zunicode.ko INSTALL /tmp/B.u6el52es/BUILD/zfs-2.0.5/module/nvpair/znvpair.ko INSTALL /tmp/B.u6el52es/BUILD/zfs-2.0.5/module/zcommon/zcommon.ko INSTALL /tmp/B.u6el52es/BUILD/zfs-2.0.5/module/spl/spl.ko INSTALL /tmp/B.u6el52es/BUILD/zfs-2.0.5/module/lua/zlua.ko INSTALL /tmp/B.u6el52es/BUILD/zfs-2.0.5/module/icp/icp.ko INSTALL /tmp/B.u6el52es/BUILD/zfs-2.0.5/module/zstd/zzstd.ko INSTALL /tmp/B.u6el52es/BUILD/zfs-2.0.5/module/zfs/zfs.ko make[2]: Entering directory '/usr/src/linux-4.14-4.14.246' DEPMOD 4.14.246-1 make[2]: Leaving directory '/usr/src/linux-4.14-4.14.246' make[1]: Entering directory '/tmp/B.u6el52es/BUILD/zfs-2.0.5/module' kmoddir=/tmp/B.u6el52es/BUILD/zfs-2.0.5/installed/lib/modules/4.14.246-1; \ if [ -n "/tmp/B.u6el52es/BUILD/zfs-2.0.5/installed" ]; then \ find $kmoddir -name 'modules.*' | xargs rm -f; \ fi sysmap=/tmp/B.u6el52es/BUILD/zfs-2.0.5/installed/boot/System.map-4.14.246-1; \ if [ -f $sysmap ]; then \ depmod -ae -F $sysmap 4.14.246-1; \ fi make[1]: Leaving directory '/tmp/B.u6el52es/BUILD/zfs-2.0.5/module' make[1]: Entering directory '/tmp/B.u6el52es/BUILD/zfs-2.0.5' [ -x ./scripts/zfs-tests.sh ] && \ ./scripts/zfs-tests.sh -c make[1]: Leaving directory '/tmp/B.u6el52es/BUILD/zfs-2.0.5' make[2]: Nothing to be done for 'install-exec-am'. make[2]: Entering directory '/tmp/B.u6el52es/BUILD/zfs-2.0.5' /bin/mkdir -p '/tmp/B.u6el52es/BUILD/zfs-2.0.5/installed/usr/src/zfs-2.0.5' /usr/bin/install -c -m 644 zfs.release zfs_config.h '/tmp/B.u6el52es/BUILD/zfs-2.0.5/installed/usr/src/zfs-2.0.5' make[2]: Leaving directory '/tmp/B.u6el52es/BUILD/zfs-2.0.5' make[2]: Entering directory '/tmp/B.u6el52es/BUILD/zfs-2.0.5' /bin/mkdir -p '/tmp/B.u6el52es/BUILD/zfs-2.0.5/installed/usr/src/zfs-2.0.5/4.14.246-1' /usr/bin/install -c -m 644 zfs.release.in zfs_config.h.in module/Module.symvers '/tmp/B.u6el52es/BUILD/zfs-2.0.5/installed/usr/src/zfs-2.0.5/4.14.246-1' make[2]: Leaving directory '/tmp/B.u6el52es/BUILD/zfs-2.0.5' /usr/bin/make install-data-hook make[3]: Entering directory '/tmp/B.u6el52es/BUILD/zfs-2.0.5' rm -rf /tmp/B.u6el52es/BUILD/zfs-2.0.5/installed/usr/src/spl-2.0.5 && \ mkdir /tmp/B.u6el52es/BUILD/zfs-2.0.5/installed/usr/src/spl-2.0.5 && \ cd /tmp/B.u6el52es/BUILD/zfs-2.0.5/installed/usr/src/spl-2.0.5 && \ ln -s ../zfs-2.0.5/include/spl include && \ ln -s ../zfs-2.0.5/4.14.246-1 4.14.246-1 && \ ln -s ../zfs-2.0.5/zfs_config.h spl_config.h && \ ln -s ../zfs-2.0.5/zfs.release spl.release && \ cd /tmp/B.u6el52es/BUILD/zfs-2.0.5/installed/usr/src/zfs-2.0.5/4.14.246-1 && \ ln -fs zfs_config.h spl_config.h && \ ln -fs zfs.release spl.release make[3]: Leaving directory '/tmp/B.u6el52es/BUILD/zfs-2.0.5' + ./configure 'LDFLAGS=-Wl,--as-needed -Wl,--no-copy-dt-needed-entries -Wl,-z,relro -Wl,-z,combreloc ' 'CFLAGS=-O2 -fwrapv -pipe -Wformat -Werror=format-security -Wp,-D_FORTIFY_SOURCE=2 -fstack-protector-strong --param=ssp-buffer-size=4 -Werror=trampolines -fPIC -march=x86-64 -mtune=generic ' 'CXXFLAGS=-O2 -fwrapv -pipe -Wformat -Werror=format-security -Wp,-D_FORTIFY_SOURCE=2 -fstack-protector-strong --param=ssp-buffer-size=4 -Werror=trampolines -fPIC -march=x86-64 -mtune=generic ' 'FFLAGS=-O2 -fwrapv -pipe -Wformat -Werror=format-security -Wp,-D_FORTIFY_SOURCE=2 -fstack-protector-strong --param=ssp-buffer-size=4 -Werror=trampolines -fPIC -march=x86-64 -mtune=generic ' 'FCFLAGS=-O2 -fwrapv -pipe -Wformat -Werror=format-security -Wp,-D_FORTIFY_SOURCE=2 -fstack-protector-strong --param=ssp-buffer-size=4 -Werror=trampolines -fPIC -march=x86-64 -mtune=generic ' 'CPPFLAGS=' 'CC=x86_64-pld-linux-gcc' 'CXX=x86_64-pld-linux-g++' '--host=x86_64-pld-linux' '--build=x86_64-pld-linux' '--prefix=/usr' '--exec-prefix=/usr' '--bindir=/usr/bin' '--sbindir=/usr/sbin' '--sysconfdir=/etc' '--datadir=/usr/share' '--includedir=/usr/include' '--libdir=/usr/lib64' '--libexecdir=/usr/libexec' '--localstatedir=/var' '--sharedstatedir=/var/lib' '--mandir=/usr/share/man' '--infodir=/usr/share/info' '--x-libraries=/usr/lib64' --disable-silent-rules '--with-config=kernel' '--with-linux=/usr/src/linux' '--with-linux-obj=/usr/src/linux' checking for mawk... mawk checking metadata... META file checking build system type... x86_64-pld-linux-gnu checking host system type... x86_64-pld-linux-gnu checking target system type... x86_64-pld-linux-gnu checking whether to enable maintainer-specific portions of Makefiles... no checking whether make supports nested variables... yes checking for a BSD-compatible install... /usr/bin/install -c checking whether build environment is sane... yes checking for a race-free mkdir -p... /bin/mkdir -p checking whether make sets $(MAKE)... yes checking how to print strings... print -r checking whether make supports the include directive... yes (GNU style) checking for x86_64-pld-linux-gcc... x86_64-pld-linux-gcc checking whether the C compiler works... yes checking for C compiler default output file name... a.out checking for suffix of executables... checking whether we are cross compiling... no checking for suffix of object files... o checking whether the compiler supports GNU C... yes checking whether x86_64-pld-linux-gcc accepts -g... yes checking for x86_64-pld-linux-gcc option to enable C11 features... none needed checking whether x86_64-pld-linux-gcc understands -c and -o together... yes checking dependency style of x86_64-pld-linux-gcc... gcc3 checking for a sed that does not truncate output... /bin/sed checking for grep that handles long lines and -e... /bin/grep checking for egrep... /bin/grep -E checking for fgrep... /bin/grep -F checking for ld used by x86_64-pld-linux-gcc... /usr/bin/ld checking if the linker (/usr/bin/ld) is GNU ld... yes checking for BSD- or MS-compatible name lister (nm)... /usr/bin/nm -B checking the name lister (/usr/bin/nm -B) interface... BSD nm checking whether ln -s works... yes checking the maximum length of command line arguments... 1572864 checking how to convert x86_64-pld-linux-gnu file names to x86_64-pld-linux-gnu format... func_convert_file_noop checking how to convert x86_64-pld-linux-gnu file names to toolchain format... func_convert_file_noop checking for /usr/bin/ld option to reload object files... -r checking for x86_64-pld-linux-objdump... no checking for objdump... objdump checking how to recognize dependent libraries... pass_all checking for x86_64-pld-linux-dlltool... no checking for dlltool... no checking how to associate runtime and link libraries... print -r -- checking for x86_64-pld-linux-ar... no checking for ar... ar checking for archiver @FILE support... @ checking for x86_64-pld-linux-strip... no checking for strip... strip checking for x86_64-pld-linux-ranlib... no checking for ranlib... ranlib checking command to parse /usr/bin/nm -B output from x86_64-pld-linux-gcc object... ok checking for sysroot... no checking for a working dd... /bin/dd checking how to truncate binary pipes... /bin/dd bs=4096 count=1 checking for x86_64-pld-linux-mt... no checking for mt... no checking if : is a manifest tool... no checking for stdio.h... yes checking for stdlib.h... yes checking for string.h... yes checking for inttypes.h... yes checking for stdint.h... yes checking for strings.h... yes checking for sys/stat.h... yes checking for sys/types.h... yes checking for unistd.h... yes checking for dlfcn.h... yes checking for objdir... .libs checking if x86_64-pld-linux-gcc supports -fno-rtti -fno-exceptions... no checking for x86_64-pld-linux-gcc option to produce PIC... -fPIC -DPIC checking if x86_64-pld-linux-gcc PIC flag -fPIC -DPIC works... yes checking if x86_64-pld-linux-gcc static flag -static works... yes checking if x86_64-pld-linux-gcc supports -c -o file.o... yes checking if x86_64-pld-linux-gcc supports -c -o file.o... (cached) yes checking whether the x86_64-pld-linux-gcc linker (/usr/bin/ld -m elf_x86_64) supports shared libraries... yes checking whether -lc should be explicitly linked in... no checking dynamic linker characteristics... GNU/Linux ld.so checking how to hardcode library paths into programs... immediate checking whether stripping libraries is possible... yes checking if libtool supports shared libraries... yes checking whether to build shared libraries... yes checking whether to build static libraries... yes checking for x86_64-pld-linux-gcc... (cached) x86_64-pld-linux-gcc checking whether the compiler supports GNU C... (cached) yes checking whether x86_64-pld-linux-gcc accepts -g... (cached) yes checking for x86_64-pld-linux-gcc option to enable C11 features... (cached) none needed checking whether x86_64-pld-linux-gcc understands -c and -o together... (cached) yes checking dependency style of x86_64-pld-linux-gcc... (cached) gcc3 checking for x86_64-pld-linux-pkg-config... no checking for pkg-config... /usr/bin/pkg-config checking pkg-config is at least version 0.9.0... yes checking dependency style of x86_64-pld-linux-gcc... gcc3 checking whether to build with code coverage support... no checking how to create a pax tar archive... gnutar checking zfs author... OpenZFS checking zfs license... CDDL checking whether NLS is requested... yes checking for msgfmt... /usr/bin/msgfmt checking for gmsgfmt... /usr/bin/msgfmt checking for xgettext... /usr/bin/xgettext checking for msgmerge... /usr/bin/msgmerge checking for ld... /usr/bin/ld -m elf_x86_64 checking if the linker (/usr/bin/ld -m elf_x86_64) is GNU ld... yes checking for shared library run path origin... done checking 32-bit host C ABI... no checking for the common suffixes of directories in the library search path... lib64,lib64 checking zfs config... kernel checking the number of available CPUs... 8 checking whether x86_64-pld-linux-gcc supports -Wno-unused-but-set-variable... yes checking whether x86_64-pld-linux-gcc supports -Wno-bool-compare... yes checking whether x86_64-pld-linux-gcc supports -Wframe-larger-than=<size>... yes checking whether x86_64-pld-linux-gcc supports -Wno-format-truncation... yes checking whether x86_64-pld-linux-gcc supports -Wno-format-zero-length... yes checking whether x86_64-pld-linux-gcc supports -fno-omit-frame-pointer... yes checking whether x86_64-pld-linux-gcc supports -fno-ipa-sra... yes checking whether to build with -fsanitize=address support... no checking whether host toolchain supports SSE... yes checking whether host toolchain supports SSE2... yes checking whether host toolchain supports SSE3... yes checking whether host toolchain supports SSSE3... yes checking whether host toolchain supports SSE4.1... yes checking whether host toolchain supports SSE4.2... yes checking whether host toolchain supports AVX... yes checking whether host toolchain supports AVX2... yes checking whether host toolchain supports AVX512F... yes checking whether host toolchain supports AVX512CD... yes checking whether host toolchain supports AVX512DQ... yes checking whether host toolchain supports AVX512BW... yes checking whether host toolchain supports AVX512IFMA... yes checking whether host toolchain supports AVX512VBMI... yes checking whether host toolchain supports AVX512PF... yes checking whether host toolchain supports AVX512ER... yes checking whether host toolchain supports AVX512VL... yes checking whether host toolchain supports AES... yes checking whether host toolchain supports PCLMULQDQ... yes checking whether host toolchain supports MOVBE... yes checking for system type (linux-gnu)... Linux checking for python3... python3 checking for python version... 3.9 checking for python platform... linux checking for python script directory... ${prefix}/share/python3.9/site-packages checking for python extension module directory... ${exec_prefix}/lib64/python3.9/site-packages checking for python3.9... /usr/bin/python3.9 checking for a version of Python >= '2.1.0'... yes checking for a version of Python >= '3.4.0'... yes checking for the distutils Python package... yes checking for Python include path... -I/usr/include/python3.9 checking for Python library path... -L/usr/lib64 -lpython3.9 checking for Python site-packages path... /usr/local/lib64/python3.9/site-packages checking python extra libraries... -lcrypt -ldl -lm -lm checking python extra linking flags... -Xlinker -export-dynamic checking consistency of all components of python development environment... yes checking for python3.9 module: setuptools... yes checking for python3.9 module: cffi... yes checking whether to enable pyzfs: ... yes checking for sed --in-place... --in-place checking for cppcheck... cppcheck checking kernel source directory... /usr/src/linux checking kernel build directory... /usr/src/linux checking kernel source version... 5.14.1-1 checking kernel file name for module symbols... Module.symvers checking whether modules can be built... yes checking for kernel config option compatibility... done checking whether kernel was built with 16K or larger stacks... yes checking whether mutex_lock() is GPL-only... no checking whether CONFIG_TRIM_UNUSED_KSYM is disabled... yes checking whether CONFIG_ZLIB_INFLATE is defined... yes checking whether CONFIG_ZLIB_DEFLATE is defined... yes checking whether fpu headers are available... asm/fpu/api.h checking whether objtool header is available... linux/objtool.h checking whether wait_queue_entry_t exists... yes checking whether /dev/zfs minor is available... 249 checking whether DECLARE_EVENT_CLASS() is available... no checking for available kernel interfaces... done checking whether access_ok() has 'type' parameter... no checking whether global_node_page_state() exists... yes checking whether global_zone_page_state() exists... yes checking whether enum node_stat_item contains NR_FILE_PAGES... yes checking whether enum node_stat_item contains NR_INACTIVE_ANON... yes checking whether enum node_stat_item contains NR_INACTIVE_FILE... yes checking whether enum zone_stat_item contains NR_FILE_PAGES... no checking whether enum zone_stat_item contains NR_INACTIVE_ANON... no checking whether enum zone_stat_item contains NR_INACTIVE_FILE... no checking whether global_page_state enums are sane... yes checking whether compile-time stack validation (objtool) is available... yes checking whether STACK_FRAME_NON_STANDARD is defined... yes checking whether PDE_DATA() is available... yes checking whether fops->fallocate() exists... yes checking whether zlib_deflate_workspacesize() wants 2 args... yes checking whether struct rw_semaphore has member activity... no checking whether struct rw_semaphore has atomic_long_t member count... yes checking whether header linux/sched/rt.h exists... yes checking whether header linux/sched/signal.h exists... yes checking whether io_schedule_timeout() is available... yes checking whether usleep_range() is available... yes checking whether kmem_cache_create_usercopy() exists... yes checking whether kvmalloc(ptr, flags) is available... yes checking whether __vmalloc(ptr, flags, pageflags) is available... no checking whether wait_on_bit() takes an action... no checking whether wq_head->head and wq_entry->entry exist... yes checking whether timestamp_truncate() exists... yes checking whether inode->i_*time's are timespec64... yes checking whether inode_lock_shared() exists... yes checking whether group_info->gid exists... yes checking whether kernel_write() takes loff_t pointer... yes checking whether kernel_read() takes loff_t pointer... yes checking whether timer_setup() is available... yes checking whether timer function expects timer_list... yes checking whether struct timer_list has flags... yes checking whether super_block->s_user_ns exists... yes checking whether proc_ops structure exists... yes checking whether bops->check_events() exists... yes checking whether bops->release() is void... yes checking whether bops->revalidate_disk() exists... no checking whether REQ_FAILFAST_MASK is defined... yes checking whether REQ_DISCARD is defined... no checking whether REQ_FLUSH is defined... no checking whether REQ_PREFLUSH is defined... yes checking whether REQ_OP_DISCARD is defined... yes checking whether REQ_OP_SECURE_ERASE is defined... yes checking whether REQ_OP_FLUSH is defined... yes checking whether bio->bi_opf is defined... yes checking whether bio_set_op_attrs is available... yes checking whether bio_set_dev() is available... yes checking whether bio_set_dev() is GPL-only... yes checking whether bio_end_io_t wants 1 arg... yes checking whether bio->bi_status exists... yes checking whether bio has bi_iter... yes checking whether submit_bio() wants 1 arg... yes checking whether current->bio_list exists... yes checking whether blkg_tryget() is available... yes checking whether blkg_tryget() is GPL-only... yes checking whether bio->bi_bdev->bd_disk exists... yes checking whether blkdev_get_by_path() exists... yes checking whether blkdev_put() exists... yes checking whether blkdev_reread_part() exists... no checking whether invalidate_bdev() exists... yes checking whether lookup_bdev() wants dev_t arg... yes checking whether bdev_logical_block_size() is available... yes checking whether bdev_physical_block_size() is available... yes checking whether check_disk_change() exists... no checking whether bdev_disk_changed() exists... yes checking whether bdev_whole() is available... yes checking whether struct blk_plug is available... yes checking whether blk_queue bdi is dynamic... yes checking whether blk_queue_discard() is available... yes checking whether blk_queue_secure_erase() is available... yes checking whether blk_queue_flag_set() exists... yes checking whether blk_queue_flag_clear() exists... yes checking whether blk_queue_flush() is available... no checking whether blk_queue_write_cache() exists... yes checking whether blk_queue_write_cache() is GPL-only... yes checking whether blk_queue_max_hw_sectors() is available... yes checking whether blk_queue_max_segments() is available... yes checking whether revalidate_disk_size() is available... no checking whether revalidate_disk() is available... no checking whether get_disk_ro() is available... yes checking whether generic_readlink is global... no checking whether ql->discard_granularity is available... yes checking whether inode_owner_or_capable() exists... no checking whether inode_owner_or_capable() takes user_ns... yes checking whether super_block uses const struct xattr_handler... yes checking whether xattr_handler has name... yes checking whether xattr_handler->get() wants dentry and inode... yes checking whether xattr_handler->set() wants dentry, inode, and user_namespace... yes checking whether xattr_handler->list() wants simple... yes checking whether posix_acl_from_xattr() needs user_ns... yes checking whether generic_setxattr() exists... no checking whether posix_acl_release() is available... yes checking whether posix_acl_release() is GPL-only... yes checking whether set_cached_acl() is usable... yes checking whether __posix_acl_chmod exists... yes checking whether posix_acl_equiv_mode() wants umode_t... yes checking whether posix_acl_valid() wants user namespace... yes checking whether iops->get_acl() exists... yes checking whether iops->set_acl() exists... yes checking whether uncached_acl_sentinel() exists... yes checking whether posix_acl has refcount_t... yes checking whether iops->getattr() takes user_namespace... yes checking whether inode_set_flags() exists... yes checking whether inode_set_iversion() exists... yes checking whether sops->show_options() wants dentry... yes checking whether file_inode() is available... yes checking whether file_dentry() is available... yes checking whether fops->fsync() wants no dentry... no checking whether fops->fsync() wants range... range checking whether fops->aio_fsync() exists... no checking whether sops->evict_inode() exists... yes checking whether sops->dirty_inode() wants flags... yes checking whether super_block has s_shrink... yes checking whether shrink_control has nid... yes checking whether new 2-argument shrinker exists... no checking whether ->count_objects callback exists... yes checking whether struct shrink_control exists... yes checking whether iops->mkdir() takes struct user_namespace*... yes checking whether iops->lookup() passes flags... yes checking whether iops->create() takes struct user_namespace*... yes checking whether iops->get_link() passes delayed... yes checking whether i_op->tmpfile() exists... yes checking whether dops->d_automount() exists... yes checking whether eops->encode_fh() wants inode... yes checking whether eops->commit_metadata() exists... yes checking whether clear_inode() is available... yes checking whether setattr_prepare() is available and accepts struct user_namespace*... yes checking whether insert_inode_locked() is available... yes checking whether d_make_root() is available... yes checking whether d_obtain_alias() is available... yes checking whether d_prune_aliases() is available... yes checking whether d_set_d_op() is available... yes checking whether dops->d_revalidate() takes struct nameidata... no checking whether dentry uses const struct dentry_operations... yes checking whether super_block has s_d_op... yes checking whether truncate_setsize() is available... yes checking whether security_inode_init_security wants callback... yes checking whether fst->mount() exists... yes checking whether super_setup_bdi_name() exists... yes checking whether set_nlink() is available... yes checking whether sget() wants 5 args... yes checking whether lseek_execute() is available... no checking whether vfs_getattr() wants 4 args... yes checking whether vfs_getattr() wants 2 args... no checking whether vfs_getattr() wants 3 args... no checking whether vfs_fsync() wants 2 args... yes checking whether fops->iterate_shared() is available... yes checking whether aops->direct_IO() uses iov_iter... yes checking whether fops->read/write_iter() are available... yes checking whether new_sync_read/write() are available... no checking whether generic_write_checks() takes kiocb... yes checking whether iov_iter types are available... yes checking whether iov_iter_init() is available... yes checking whether iov_iter_advance() is available... yes checking whether iov_iter_revert() is available... yes checking whether iov_iter_fault_in_readable() is available... yes checking whether iov_iter_count() is available... yes checking whether copy_to_iter() is available... yes checking whether copy_from_iter() is available... yes checking whether kmap_atomic wants 1 args... yes checking whether follow_down_one() is available... yes checking whether submit_bio is member of struct block_device_operations... yes checking whether generic disk_*_io_acct() are available... yes checking whether kernel fpu is available... internal checking whether kernel defines fmode_t... yes checking whether kuid_t/kgid_t is available... yes checking whether i_(uid|gid)_(read|write) exist... yes checking whether module_param_call() is hardened... yes checking whether iops->rename() takes struct user_namespace*... yes checking whether current_time() exists... yes checking whether ns_capable exists... yes checking whether has_capability() is available... yes checking whether cred_t->user_ns exists... yes checking whether kuid_has_mapping/kgid_has_mapping exist... yes checking whether in_compat_syscall() is available... yes checking whether ktime_get_coarse_real_ts64() exists... yes checking whether ktime_get_raw_ts64() exists... yes checking whether totalram_pages() exists... yes checking whether totalhigh_pages() exists... yes checking whether kstrtoul() exists... yes checking whether percpu_counter_init() wants gfp_t... yes checking whether is inside percpu_ref.data... yes checking whether generic_fillattr requres struct user_namespace*... yes checking whether iops->mknod() takes struct user_namespace*... yes checking whether iops->symlink() takes struct user_namespace*... yes checking whether bio_max_segs() exists... yes checking os distribution... ubuntu checking default package type... deb checking default init directory... /etc/rc.d/init.d checking default init script type and shell... lsb:/bin/sh checking default nfs server init script... nfs checking default init config directory... /etc/default checking whether initramfs-tools is available... no checking whether rpm is available... yes (4.16.1.3) checking whether rpmbuild is available... yes (4.16.1.3) ./configure[101506]: dpkg-architecture: inaccessible or not found checking whether spec files are available... yes (rpm/generic/*.spec.in) checking whether dpkg is available... no checking whether dpkg-buildpackage is available... no checking whether alien is available... no checking whether assertion support will be enabled... no checking whether debuginfo support will be forced... no checking whether basic kmem accounting is enabled... no checking whether detailed kmem tracking is enabled... no checking that generated files are newer than configure... done configure: creating ./config.status config.status: creating Makefile config.status: creating cmd/Makefile config.status: creating cmd/arc_summary/Makefile config.status: creating cmd/arcstat/Makefile config.status: creating cmd/dbufstat/Makefile config.status: creating cmd/fsck_zfs/Makefile config.status: creating cmd/mount_zfs/Makefile config.status: creating cmd/raidz_test/Makefile config.status: creating cmd/vdev_id/Makefile config.status: creating cmd/zdb/Makefile config.status: creating cmd/zed/Makefile config.status: creating cmd/zed/zed.d/Makefile config.status: creating cmd/zfs/Makefile config.status: creating cmd/zfs_ids_to_path/Makefile config.status: creating cmd/zgenhostid/Makefile config.status: creating cmd/zhack/Makefile config.status: creating cmd/zinject/Makefile config.status: creating cmd/zpool/Makefile config.status: creating cmd/zstream/Makefile config.status: creating cmd/zstreamdump/Makefile config.status: creating cmd/ztest/Makefile config.status: creating cmd/zvol_id/Makefile config.status: creating cmd/zvol_wait/Makefile config.status: creating contrib/Makefile config.status: creating contrib/bash_completion.d/Makefile config.status: creating contrib/bpftrace/Makefile config.status: creating contrib/dracut/02zfsexpandknowledge/Makefile config.status: creating contrib/dracut/90zfs/Makefile config.status: creating contrib/dracut/Makefile config.status: creating contrib/initramfs/Makefile config.status: creating contrib/initramfs/conf.d/Makefile config.status: creating contrib/initramfs/conf-hooks.d/Makefile config.status: creating contrib/initramfs/hooks/Makefile config.status: creating contrib/initramfs/scripts/Makefile config.status: creating contrib/initramfs/scripts/local-top/Makefile config.status: creating contrib/pam_zfs_key/Makefile config.status: creating contrib/pyzfs/Makefile config.status: creating contrib/pyzfs/setup.py config.status: creating contrib/zcp/Makefile config.status: creating etc/Makefile config.status: creating etc/default/Makefile config.status: creating etc/init.d/Makefile config.status: creating etc/modules-load.d/Makefile config.status: creating etc/sudoers.d/Makefile config.status: creating etc/systemd/Makefile config.status: creating etc/systemd/system-generators/Makefile config.status: creating etc/systemd/system/Makefile config.status: creating etc/zfs/Makefile config.status: creating include/Makefile config.status: creating include/os/Makefile config.status: creating include/os/freebsd/Makefile config.status: creating include/os/freebsd/linux/Makefile config.status: creating include/os/freebsd/spl/Makefile config.status: creating include/os/freebsd/spl/acl/Makefile config.status: creating include/os/freebsd/spl/rpc/Makefile config.status: creating include/os/freebsd/spl/sys/Makefile config.status: creating include/os/freebsd/zfs/Makefile config.status: creating include/os/freebsd/zfs/sys/Makefile config.status: creating include/os/linux/Makefile config.status: creating include/os/linux/kernel/Makefile config.status: creating include/os/linux/kernel/linux/Makefile config.status: creating include/os/linux/spl/Makefile config.status: creating include/os/linux/spl/rpc/Makefile config.status: creating include/os/linux/spl/sys/Makefile config.status: creating include/os/linux/zfs/Makefile config.status: creating include/os/linux/zfs/sys/Makefile config.status: creating include/sys/Makefile config.status: creating include/sys/crypto/Makefile config.status: creating include/sys/fm/Makefile config.status: creating include/sys/fm/fs/Makefile config.status: creating include/sys/fs/Makefile config.status: creating include/sys/lua/Makefile config.status: creating include/sys/sysevent/Makefile config.status: creating include/sys/zstd/Makefile config.status: creating lib/Makefile config.status: creating lib/libavl/Makefile config.status: creating lib/libefi/Makefile config.status: creating lib/libicp/Makefile config.status: creating lib/libnvpair/Makefile config.status: creating lib/libshare/Makefile config.status: creating lib/libspl/Makefile config.status: creating lib/libspl/include/Makefile config.status: creating lib/libspl/include/ia32/Makefile config.status: creating lib/libspl/include/ia32/sys/Makefile config.status: creating lib/libspl/include/os/Makefile config.status: creating lib/libspl/include/os/freebsd/Makefile config.status: creating lib/libspl/include/os/freebsd/sys/Makefile config.status: creating lib/libspl/include/os/linux/Makefile config.status: creating lib/libspl/include/os/linux/sys/Makefile config.status: creating lib/libspl/include/rpc/Makefile config.status: creating lib/libspl/include/sys/Makefile config.status: creating lib/libspl/include/sys/dktp/Makefile config.status: creating lib/libspl/include/util/Makefile config.status: creating lib/libtpool/Makefile config.status: creating lib/libunicode/Makefile config.status: creating lib/libuutil/Makefile config.status: creating lib/libzfs/Makefile config.status: creating lib/libzfs/libzfs.pc config.status: creating lib/libzfsbootenv/Makefile config.status: creating lib/libzfsbootenv/libzfsbootenv.pc config.status: creating lib/libzfs_core/Makefile config.status: creating lib/libzfs_core/libzfs_core.pc config.status: creating lib/libzpool/Makefile config.status: creating lib/libzstd/Makefile config.status: creating lib/libzutil/Makefile config.status: creating man/Makefile config.status: creating man/man1/Makefile config.status: creating man/man5/Makefile config.status: creating man/man8/Makefile config.status: creating module/Kbuild config.status: creating module/Makefile config.status: creating module/avl/Makefile config.status: creating module/icp/Makefile config.status: creating module/lua/Makefile config.status: creating module/nvpair/Makefile config.status: creating module/os/linux/spl/Makefile config.status: creating module/os/linux/zfs/Makefile config.status: creating module/spl/Makefile config.status: creating module/unicode/Makefile config.status: creating module/zcommon/Makefile config.status: creating module/zfs/Makefile config.status: creating module/zstd/Makefile config.status: creating rpm/Makefile config.status: creating rpm/generic/Makefile config.status: creating rpm/generic/zfs-dkms.spec config.status: creating rpm/generic/zfs-kmod.spec config.status: creating rpm/generic/zfs.spec config.status: creating rpm/redhat/Makefile config.status: creating rpm/redhat/zfs-dkms.spec config.status: creating rpm/redhat/zfs-kmod.spec config.status: creating rpm/redhat/zfs.spec config.status: creating scripts/Makefile config.status: creating tests/Makefile config.status: creating tests/runfiles/Makefile config.status: creating tests/test-runner/Makefile config.status: creating tests/test-runner/bin/Makefile config.status: creating tests/test-runner/include/Makefile config.status: creating tests/test-runner/man/Makefile config.status: creating tests/zfs-tests/Makefile config.status: creating tests/zfs-tests/callbacks/Makefile config.status: creating tests/zfs-tests/cmd/Makefile config.status: creating tests/zfs-tests/cmd/badsend/Makefile config.status: creating tests/zfs-tests/cmd/btree_test/Makefile config.status: creating tests/zfs-tests/cmd/chg_usr_exec/Makefile config.status: creating tests/zfs-tests/cmd/devname2devid/Makefile config.status: creating tests/zfs-tests/cmd/dir_rd_update/Makefile config.status: creating tests/zfs-tests/cmd/file_check/Makefile config.status: creating tests/zfs-tests/cmd/file_trunc/Makefile config.status: creating tests/zfs-tests/cmd/file_write/Makefile config.status: creating tests/zfs-tests/cmd/get_diff/Makefile config.status: creating tests/zfs-tests/cmd/largest_file/Makefile config.status: creating tests/zfs-tests/cmd/libzfs_input_check/Makefile config.status: creating tests/zfs-tests/cmd/mkbusy/Makefile config.status: creating tests/zfs-tests/cmd/mkfile/Makefile config.status: creating tests/zfs-tests/cmd/mkfiles/Makefile config.status: creating tests/zfs-tests/cmd/mktree/Makefile config.status: creating tests/zfs-tests/cmd/mmap_exec/Makefile config.status: creating tests/zfs-tests/cmd/mmap_libaio/Makefile config.status: creating tests/zfs-tests/cmd/mmapwrite/Makefile config.status: creating tests/zfs-tests/cmd/nvlist_to_lua/Makefile config.status: creating tests/zfs-tests/cmd/randfree_file/Makefile config.status: creating tests/zfs-tests/cmd/randwritecomp/Makefile config.status: creating tests/zfs-tests/cmd/readmmap/Makefile config.status: creating tests/zfs-tests/cmd/rename_dir/Makefile config.status: creating tests/zfs-tests/cmd/rm_lnkcnt_zero_file/Makefile config.status: creating tests/zfs-tests/cmd/send_doall/Makefile config.status: creating tests/zfs-tests/cmd/stride_dd/Makefile config.status: creating tests/zfs-tests/cmd/threadsappend/Makefile config.status: creating tests/zfs-tests/cmd/user_ns_exec/Makefile config.status: creating tests/zfs-tests/cmd/xattrtest/Makefile config.status: creating tests/zfs-tests/include/Makefile config.status: creating tests/zfs-tests/tests/Makefile config.status: creating tests/zfs-tests/tests/functional/Makefile config.status: creating tests/zfs-tests/tests/functional/acl/Makefile config.status: creating tests/zfs-tests/tests/functional/acl/off/Makefile config.status: creating tests/zfs-tests/tests/functional/acl/posix/Makefile config.status: creating tests/zfs-tests/tests/functional/acl/posix-sa/Makefile config.status: creating tests/zfs-tests/tests/functional/alloc_class/Makefile config.status: creating tests/zfs-tests/tests/functional/arc/Makefile config.status: creating tests/zfs-tests/tests/functional/atime/Makefile config.status: creating tests/zfs-tests/tests/functional/bootfs/Makefile config.status: creating tests/zfs-tests/tests/functional/btree/Makefile config.status: creating tests/zfs-tests/tests/functional/cache/Makefile config.status: creating tests/zfs-tests/tests/functional/cachefile/Makefile config.status: creating tests/zfs-tests/tests/functional/casenorm/Makefile config.status: creating tests/zfs-tests/tests/functional/channel_program/Makefile config.status: creating tests/zfs-tests/tests/functional/channel_program/lua_core/Makefile config.status: creating tests/zfs-tests/tests/functional/channel_program/synctask_core/Makefile config.status: creating tests/zfs-tests/tests/functional/chattr/Makefile config.status: creating tests/zfs-tests/tests/functional/checksum/Makefile config.status: creating tests/zfs-tests/tests/functional/clean_mirror/Makefile config.status: creating tests/zfs-tests/tests/functional/cli_root/Makefile config.status: creating tests/zfs-tests/tests/functional/cli_root/zdb/Makefile config.status: creating tests/zfs-tests/tests/functional/cli_root/zfs/Makefile config.status: creating tests/zfs-tests/tests/functional/cli_root/zfs_bookmark/Makefile config.status: creating tests/zfs-tests/tests/functional/cli_root/zfs_change-key/Makefile config.status: creating tests/zfs-tests/tests/functional/cli_root/zfs_clone/Makefile config.status: creating tests/zfs-tests/tests/functional/cli_root/zfs_copies/Makefile config.status: creating tests/zfs-tests/tests/functional/cli_root/zfs_create/Makefile config.status: creating tests/zfs-tests/tests/functional/cli_root/zfs_destroy/Makefile config.status: creating tests/zfs-tests/tests/functional/cli_root/zfs_diff/Makefile config.status: creating tests/zfs-tests/tests/functional/cli_root/zfs_get/Makefile config.status: creating tests/zfs-tests/tests/functional/cli_root/zfs_ids_to_path/Makefile config.status: creating tests/zfs-tests/tests/functional/cli_root/zfs_inherit/Makefile config.status: creating tests/zfs-tests/tests/functional/cli_root/zfs_jail/Makefile config.status: creating tests/zfs-tests/tests/functional/cli_root/zfs_load-key/Makefile config.status: creating tests/zfs-tests/tests/functional/cli_root/zfs_mount/Makefile config.status: creating tests/zfs-tests/tests/functional/cli_root/zfs_program/Makefile config.status: creating tests/zfs-tests/tests/functional/cli_root/zfs_promote/Makefile config.status: creating tests/zfs-tests/tests/functional/cli_root/zfs_property/Makefile config.status: creating tests/zfs-tests/tests/functional/cli_root/zfs_receive/Makefile config.status: creating tests/zfs-tests/tests/functional/cli_root/zfs_rename/Makefile config.status: creating tests/zfs-tests/tests/functional/cli_root/zfs_reservation/Makefile config.status: creating tests/zfs-tests/tests/functional/cli_root/zfs_rollback/Makefile config.status: creating tests/zfs-tests/tests/functional/cli_root/zfs_send/Makefile config.status: creating tests/zfs-tests/tests/functional/cli_root/zfs_set/Makefile config.status: creating tests/zfs-tests/tests/functional/cli_root/zfs_share/Makefile config.status: creating tests/zfs-tests/tests/functional/cli_root/zfs_snapshot/Makefile config.status: creating tests/zfs-tests/tests/functional/cli_root/zfs_sysfs/Makefile config.status: creating tests/zfs-tests/tests/functional/cli_root/zfs_unload-key/Makefile config.status: creating tests/zfs-tests/tests/functional/cli_root/zfs_unmount/Makefile config.status: creating tests/zfs-tests/tests/functional/cli_root/zfs_unshare/Makefile config.status: creating tests/zfs-tests/tests/functional/cli_root/zfs_upgrade/Makefile config.status: creating tests/zfs-tests/tests/functional/cli_root/zfs_wait/Makefile config.status: creating tests/zfs-tests/tests/functional/cli_root/zpool/Makefile config.status: creating tests/zfs-tests/tests/functional/cli_root/zpool_add/Makefile config.status: creating tests/zfs-tests/tests/functional/cli_root/zpool_attach/Makefile config.status: creating tests/zfs-tests/tests/functional/cli_root/zpool_clear/Makefile config.status: creating tests/zfs-tests/tests/functional/cli_root/zpool_create/Makefile config.status: creating tests/zfs-tests/tests/functional/cli_root/zpool_destroy/Makefile config.status: creating tests/zfs-tests/tests/functional/cli_root/zpool_detach/Makefile config.status: creating tests/zfs-tests/tests/functional/cli_root/zpool_events/Makefile config.status: creating tests/zfs-tests/tests/functional/cli_root/zpool_expand/Makefile config.status: creating tests/zfs-tests/tests/functional/cli_root/zpool_export/Makefile config.status: creating tests/zfs-tests/tests/functional/cli_root/zpool_get/Makefile config.status: creating tests/zfs-tests/tests/functional/cli_root/zpool_history/Makefile config.status: creating tests/zfs-tests/tests/functional/cli_root/zpool_import/Makefile config.status: creating tests/zfs-tests/tests/functional/cli_root/zpool_import/blockfiles/Makefile config.status: creating tests/zfs-tests/tests/functional/cli_root/zpool_initialize/Makefile config.status: creating tests/zfs-tests/tests/functional/cli_root/zpool_labelclear/Makefile config.status: creating tests/zfs-tests/tests/functional/cli_root/zpool_offline/Makefile config.status: creating tests/zfs-tests/tests/functional/cli_root/zpool_online/Makefile config.status: creating tests/zfs-tests/tests/functional/cli_root/zpool_remove/Makefile config.status: creating tests/zfs-tests/tests/functional/cli_root/zpool_reopen/Makefile config.status: creating tests/zfs-tests/tests/functional/cli_root/zpool_replace/Makefile config.status: creating tests/zfs-tests/tests/functional/cli_root/zpool_resilver/Makefile config.status: creating tests/zfs-tests/tests/functional/cli_root/zpool_scrub/Makefile config.status: creating tests/zfs-tests/tests/functional/cli_root/zpool_set/Makefile config.status: creating tests/zfs-tests/tests/functional/cli_root/zpool_split/Makefile config.status: creating tests/zfs-tests/tests/functional/cli_root/zpool_status/Makefile config.status: creating tests/zfs-tests/tests/functional/cli_root/zpool_sync/Makefile config.status: creating tests/zfs-tests/tests/functional/cli_root/zpool_trim/Makefile config.status: creating tests/zfs-tests/tests/functional/cli_root/zpool_upgrade/Makefile config.status: creating tests/zfs-tests/tests/functional/cli_root/zpool_upgrade/blockfiles/Makefile config.status: creating tests/zfs-tests/tests/functional/cli_root/zpool_wait/Makefile config.status: creating tests/zfs-tests/tests/functional/cli_root/zpool_wait/scan/Makefile config.status: creating tests/zfs-tests/tests/functional/cli_user/Makefile config.status: creating tests/zfs-tests/tests/functional/cli_user/misc/Makefile config.status: creating tests/zfs-tests/tests/functional/cli_user/zfs_list/Makefile config.status: creating tests/zfs-tests/tests/functional/cli_user/zpool_iostat/Makefile config.status: creating tests/zfs-tests/tests/functional/cli_user/zpool_list/Makefile config.status: creating tests/zfs-tests/tests/functional/cli_user/zpool_status/Makefile config.status: creating tests/zfs-tests/tests/functional/compression/Makefile config.status: creating tests/zfs-tests/tests/functional/cp_files/Makefile config.status: creating tests/zfs-tests/tests/functional/ctime/Makefile config.status: creating tests/zfs-tests/tests/functional/deadman/Makefile config.status: creating tests/zfs-tests/tests/functional/delegate/Makefile config.status: creating tests/zfs-tests/tests/functional/devices/Makefile config.status: creating tests/zfs-tests/tests/functional/events/Makefile config.status: creating tests/zfs-tests/tests/functional/exec/Makefile config.status: creating tests/zfs-tests/tests/functional/fallocate/Makefile config.status: creating tests/zfs-tests/tests/functional/fault/Makefile config.status: creating tests/zfs-tests/tests/functional/features/Makefile config.status: creating tests/zfs-tests/tests/functional/features/async_destroy/Makefile config.status: creating tests/zfs-tests/tests/functional/features/large_dnode/Makefile config.status: creating tests/zfs-tests/tests/functional/grow/Makefile config.status: creating tests/zfs-tests/tests/functional/history/Makefile config.status: creating tests/zfs-tests/tests/functional/hkdf/Makefile config.status: creating tests/zfs-tests/tests/functional/inheritance/Makefile config.status: creating tests/zfs-tests/tests/functional/inuse/Makefile config.status: creating tests/zfs-tests/tests/functional/io/Makefile config.status: creating tests/zfs-tests/tests/functional/large_files/Makefile config.status: creating tests/zfs-tests/tests/functional/largest_pool/Makefile config.status: creating tests/zfs-tests/tests/functional/libzfs/Makefile config.status: creating tests/zfs-tests/tests/functional/limits/Makefile config.status: creating tests/zfs-tests/tests/functional/link_count/Makefile config.status: creating tests/zfs-tests/tests/functional/log_spacemap/Makefile config.status: creating tests/zfs-tests/tests/functional/migration/Makefile config.status: creating tests/zfs-tests/tests/functional/mmap/Makefile config.status: creating tests/zfs-tests/tests/functional/mmp/Makefile config.status: creating tests/zfs-tests/tests/functional/mount/Makefile config.status: creating tests/zfs-tests/tests/functional/mv_files/Makefile config.status: creating tests/zfs-tests/tests/functional/nestedfs/Makefile config.status: creating tests/zfs-tests/tests/functional/no_space/Makefile config.status: creating tests/zfs-tests/tests/functional/nopwrite/Makefile config.status: creating tests/zfs-tests/tests/functional/online_offline/Makefile config.status: creating tests/zfs-tests/tests/functional/pam/Makefile config.status: creating tests/zfs-tests/tests/functional/persist_l2arc/Makefile config.status: creating tests/zfs-tests/tests/functional/pool_checkpoint/Makefile config.status: creating tests/zfs-tests/tests/functional/pool_names/Makefile config.status: creating tests/zfs-tests/tests/functional/poolversion/Makefile config.status: creating tests/zfs-tests/tests/functional/privilege/Makefile config.status: creating tests/zfs-tests/tests/functional/procfs/Makefile config.status: creating tests/zfs-tests/tests/functional/projectquota/Makefile config.status: creating tests/zfs-tests/tests/functional/pyzfs/Makefile config.status: creating tests/zfs-tests/tests/functional/quota/Makefile config.status: creating tests/zfs-tests/tests/functional/raidz/Makefile config.status: creating tests/zfs-tests/tests/functional/redacted_send/Makefile config.status: creating tests/zfs-tests/tests/functional/redundancy/Makefile config.status: creating tests/zfs-tests/tests/functional/refquota/Makefile config.status: creating tests/zfs-tests/tests/functional/refreserv/Makefile config.status: creating tests/zfs-tests/tests/functional/removal/Makefile config.status: creating tests/zfs-tests/tests/functional/rename_dirs/Makefile config.status: creating tests/zfs-tests/tests/functional/replacement/Makefile config.status: creating tests/zfs-tests/tests/functional/reservation/Makefile config.status: creating tests/zfs-tests/tests/functional/rootpool/Makefile config.status: creating tests/zfs-tests/tests/functional/rsend/Makefile config.status: creating tests/zfs-tests/tests/functional/scrub_mirror/Makefile config.status: creating tests/zfs-tests/tests/functional/slog/Makefile config.status: creating tests/zfs-tests/tests/functional/snapshot/Makefile config.status: creating tests/zfs-tests/tests/functional/snapused/Makefile config.status: creating tests/zfs-tests/tests/functional/sparse/Makefile config.status: creating tests/zfs-tests/tests/functional/suid/Makefile config.status: creating tests/zfs-tests/tests/functional/threadsappend/Makefile config.status: creating tests/zfs-tests/tests/functional/tmpfile/Makefile config.status: creating tests/zfs-tests/tests/functional/trim/Makefile config.status: creating tests/zfs-tests/tests/functional/truncate/Makefile config.status: creating tests/zfs-tests/tests/functional/upgrade/Makefile config.status: creating tests/zfs-tests/tests/functional/user_namespace/Makefile config.status: creating tests/zfs-tests/tests/functional/userquota/Makefile config.status: creating tests/zfs-tests/tests/functional/vdev_zaps/Makefile config.status: creating tests/zfs-tests/tests/functional/write_dirs/Makefile config.status: creating tests/zfs-tests/tests/functional/xattr/Makefile config.status: creating tests/zfs-tests/tests/functional/zvol/Makefile config.status: creating tests/zfs-tests/tests/functional/zvol/zvol_ENOSPC/Makefile config.status: creating tests/zfs-tests/tests/functional/zvol/zvol_cli/Makefile config.status: creating tests/zfs-tests/tests/functional/zvol/zvol_misc/Makefile config.status: creating tests/zfs-tests/tests/functional/zvol/zvol_swap/Makefile config.status: creating tests/zfs-tests/tests/perf/Makefile config.status: creating tests/zfs-tests/tests/perf/fio/Makefile config.status: creating tests/zfs-tests/tests/perf/regression/Makefile config.status: creating tests/zfs-tests/tests/perf/scripts/Makefile config.status: creating tests/zfs-tests/tests/stress/Makefile config.status: creating udev/Makefile config.status: creating udev/rules.d/Makefile config.status: creating zfs.release config.status: creating zfs_config.h config.status: executing depfiles commands config.status: executing libtool commands config.status: executing po-directories commands + /usr/bin/make -Otarget -j9 clean Making clean in include Making clean in sys Making clean in fm Making clean in fs make[4]: Entering directory '/tmp/B.u6el52es/BUILD/zfs-2.0.5/include/sys/fm/fs' rm -rf .libs _libs make[4]: Leaving directory '/tmp/B.u6el52es/BUILD/zfs-2.0.5/include/sys/fm/fs' make[4]: Entering directory '/tmp/B.u6el52es/BUILD/zfs-2.0.5/include/sys/fm/fs' rm -f *.lo make[4]: Leaving directory '/tmp/B.u6el52es/BUILD/zfs-2.0.5/include/sys/fm/fs' make[4]: Entering directory '/tmp/B.u6el52es/BUILD/zfs-2.0.5/include/sys/fm' rm -rf .libs _libs make[4]: Leaving directory '/tmp/B.u6el52es/BUILD/zfs-2.0.5/include/sys/fm' make[4]: Entering directory '/tmp/B.u6el52es/BUILD/zfs-2.0.5/include/sys/fm' rm -f *.lo make[4]: Leaving directory '/tmp/B.u6el52es/BUILD/zfs-2.0.5/include/sys/fm' Making clean in fs make[3]: Entering directory '/tmp/B.u6el52es/BUILD/zfs-2.0.5/include/sys/fs' rm -rf .libs _libs make[3]: Leaving directory '/tmp/B.u6el52es/BUILD/zfs-2.0.5/include/sys/fs' make[3]: Entering directory '/tmp/B.u6el52es/BUILD/zfs-2.0.5/include/sys/fs' rm -f *.lo make[3]: Leaving directory '/tmp/B.u6el52es/BUILD/zfs-2.0.5/include/sys/fs' Making clean in crypto make[3]: Entering directory '/tmp/B.u6el52es/BUILD/zfs-2.0.5/include/sys/crypto' rm -rf .libs _libs make[3]: Leaving directory '/tmp/B.u6el52es/BUILD/zfs-2.0.5/include/sys/crypto' make[3]: Entering directory '/tmp/B.u6el52es/BUILD/zfs-2.0.5/include/sys/crypto' rm -f *.lo make[3]: Leaving directory '/tmp/B.u6el52es/BUILD/zfs-2.0.5/include/sys/crypto' Making clean in lua make[3]: Entering directory '/tmp/B.u6el52es/BUILD/zfs-2.0.5/include/sys/lua' rm -rf .libs _libs make[3]: Leaving directory '/tmp/B.u6el52es/BUILD/zfs-2.0.5/include/sys/lua' make[3]: Entering directory '/tmp/B.u6el52es/BUILD/zfs-2.0.5/include/sys/lua' rm -f *.lo make[3]: Leaving directory '/tmp/B.u6el52es/BUILD/zfs-2.0.5/include/sys/lua' Making clean in sysevent make[3]: Entering directory '/tmp/B.u6el52es/BUILD/zfs-2.0.5/include/sys/sysevent' rm -rf .libs _libs make[3]: Leaving directory '/tmp/B.u6el52es/BUILD/zfs-2.0.5/include/sys/sysevent' make[3]: Entering directory '/tmp/B.u6el52es/BUILD/zfs-2.0.5/include/sys/sysevent' rm -f *.lo make[3]: Leaving directory '/tmp/B.u6el52es/BUILD/zfs-2.0.5/include/sys/sysevent' Making clean in zstd make[3]: Entering directory '/tmp/B.u6el52es/BUILD/zfs-2.0.5/include/sys/zstd' rm -rf .libs _libs make[3]: Leaving directory '/tmp/B.u6el52es/BUILD/zfs-2.0.5/include/sys/zstd' make[3]: Entering directory '/tmp/B.u6el52es/BUILD/zfs-2.0.5/include/sys/zstd' rm -f *.lo make[3]: Leaving directory '/tmp/B.u6el52es/BUILD/zfs-2.0.5/include/sys/zstd' make[3]: Entering directory '/tmp/B.u6el52es/BUILD/zfs-2.0.5/include/sys' rm -rf .libs _libs make[3]: Leaving directory '/tmp/B.u6el52es/BUILD/zfs-2.0.5/include/sys' make[3]: Entering directory '/tmp/B.u6el52es/BUILD/zfs-2.0.5/include/sys' rm -f *.lo make[3]: Leaving directory '/tmp/B.u6el52es/BUILD/zfs-2.0.5/include/sys' Making clean in os Making clean in linux Making clean in kernel Making clean in linux make[5]: Entering directory '/tmp/B.u6el52es/BUILD/zfs-2.0.5/include/os/linux/kernel/linux' rm -rf .libs _libs make[5]: Leaving directory '/tmp/B.u6el52es/BUILD/zfs-2.0.5/include/os/linux/kernel/linux' make[5]: Entering directory '/tmp/B.u6el52es/BUILD/zfs-2.0.5/include/os/linux/kernel/linux' rm -f *.lo make[5]: Leaving directory '/tmp/B.u6el52es/BUILD/zfs-2.0.5/include/os/linux/kernel/linux' make[5]: Entering directory '/tmp/B.u6el52es/BUILD/zfs-2.0.5/include/os/linux/kernel' rm -rf .libs _libs make[5]: Leaving directory '/tmp/B.u6el52es/BUILD/zfs-2.0.5/include/os/linux/kernel' make[5]: Entering directory '/tmp/B.u6el52es/BUILD/zfs-2.0.5/include/os/linux/kernel' rm -f *.lo make[5]: Leaving directory '/tmp/B.u6el52es/BUILD/zfs-2.0.5/include/os/linux/kernel' Making clean in spl Making clean in rpc make[5]: Entering directory '/tmp/B.u6el52es/BUILD/zfs-2.0.5/include/os/linux/spl/rpc' rm -rf .libs _libs make[5]: Leaving directory '/tmp/B.u6el52es/BUILD/zfs-2.0.5/include/os/linux/spl/rpc' make[5]: Entering directory '/tmp/B.u6el52es/BUILD/zfs-2.0.5/include/os/linux/spl/rpc' rm -f *.lo make[5]: Leaving directory '/tmp/B.u6el52es/BUILD/zfs-2.0.5/include/os/linux/spl/rpc' Making clean in sys make[5]: Entering directory '/tmp/B.u6el52es/BUILD/zfs-2.0.5/include/os/linux/spl/sys' rm -rf .libs _libs make[5]: Leaving directory '/tmp/B.u6el52es/BUILD/zfs-2.0.5/include/os/linux/spl/sys' make[5]: Entering directory '/tmp/B.u6el52es/BUILD/zfs-2.0.5/include/os/linux/spl/sys' rm -f *.lo make[5]: Leaving directory '/tmp/B.u6el52es/BUILD/zfs-2.0.5/include/os/linux/spl/sys' make[5]: Entering directory '/tmp/B.u6el52es/BUILD/zfs-2.0.5/include/os/linux/spl' rm -rf .libs _libs make[5]: Leaving directory '/tmp/B.u6el52es/BUILD/zfs-2.0.5/include/os/linux/spl' make[5]: Entering directory '/tmp/B.u6el52es/BUILD/zfs-2.0.5/include/os/linux/spl' rm -f *.lo make[5]: Leaving directory '/tmp/B.u6el52es/BUILD/zfs-2.0.5/include/os/linux/spl' Making clean in zfs Making clean in sys make[5]: Entering directory '/tmp/B.u6el52es/BUILD/zfs-2.0.5/include/os/linux/zfs/sys' rm -rf .libs _libs make[5]: Leaving directory '/tmp/B.u6el52es/BUILD/zfs-2.0.5/include/os/linux/zfs/sys' make[5]: Entering directory '/tmp/B.u6el52es/BUILD/zfs-2.0.5/include/os/linux/zfs/sys' rm -f *.lo make[5]: Leaving directory '/tmp/B.u6el52es/BUILD/zfs-2.0.5/include/os/linux/zfs/sys' make[5]: Entering directory '/tmp/B.u6el52es/BUILD/zfs-2.0.5/include/os/linux/zfs' rm -rf .libs _libs make[5]: Leaving directory '/tmp/B.u6el52es/BUILD/zfs-2.0.5/include/os/linux/zfs' make[5]: Entering directory '/tmp/B.u6el52es/BUILD/zfs-2.0.5/include/os/linux/zfs' rm -f *.lo make[5]: Leaving directory '/tmp/B.u6el52es/BUILD/zfs-2.0.5/include/os/linux/zfs' make[4]: Entering directory '/tmp/B.u6el52es/BUILD/zfs-2.0.5/include/os/linux' rm -rf .libs _libs make[4]: Leaving directory '/tmp/B.u6el52es/BUILD/zfs-2.0.5/include/os/linux' make[4]: Entering directory '/tmp/B.u6el52es/BUILD/zfs-2.0.5/include/os/linux' rm -f *.lo make[4]: Leaving directory '/tmp/B.u6el52es/BUILD/zfs-2.0.5/include/os/linux' make[3]: Entering directory '/tmp/B.u6el52es/BUILD/zfs-2.0.5/include/os' rm -rf .libs _libs make[3]: Leaving directory '/tmp/B.u6el52es/BUILD/zfs-2.0.5/include/os' make[3]: Entering directory '/tmp/B.u6el52es/BUILD/zfs-2.0.5/include/os' rm -f *.lo make[3]: Leaving directory '/tmp/B.u6el52es/BUILD/zfs-2.0.5/include/os' make[2]: Entering directory '/tmp/B.u6el52es/BUILD/zfs-2.0.5/include' rm -rf .libs _libs make[2]: Leaving directory '/tmp/B.u6el52es/BUILD/zfs-2.0.5/include' make[2]: Entering directory '/tmp/B.u6el52es/BUILD/zfs-2.0.5/include' rm -f *.lo make[2]: Leaving directory '/tmp/B.u6el52es/BUILD/zfs-2.0.5/include' Making clean in rpm Making clean in generic make[2]: Entering directory '/tmp/B.u6el52es/BUILD/zfs-2.0.5/rpm/generic' rm -rf .libs _libs make[2]: Leaving directory '/tmp/B.u6el52es/BUILD/zfs-2.0.5/rpm/generic' make[2]: Entering directory '/tmp/B.u6el52es/BUILD/zfs-2.0.5/rpm/generic' rm -f *.lo make[2]: Leaving directory '/tmp/B.u6el52es/BUILD/zfs-2.0.5/rpm/generic' Making clean in redhat make[2]: Entering directory '/tmp/B.u6el52es/BUILD/zfs-2.0.5/rpm/redhat' rm -rf .libs _libs make[2]: Leaving directory '/tmp/B.u6el52es/BUILD/zfs-2.0.5/rpm/redhat' make[2]: Entering directory '/tmp/B.u6el52es/BUILD/zfs-2.0.5/rpm/redhat' rm -f *.lo make[2]: Leaving directory '/tmp/B.u6el52es/BUILD/zfs-2.0.5/rpm/redhat' make[2]: Entering directory '/tmp/B.u6el52es/BUILD/zfs-2.0.5/rpm' rm -rf .libs _libs make[2]: Leaving directory '/tmp/B.u6el52es/BUILD/zfs-2.0.5/rpm' make[2]: Entering directory '/tmp/B.u6el52es/BUILD/zfs-2.0.5/rpm' rm -f *.lo make[2]: Leaving directory '/tmp/B.u6el52es/BUILD/zfs-2.0.5/rpm' Making clean in scripts make[1]: Entering directory '/tmp/B.u6el52es/BUILD/zfs-2.0.5/scripts' rm -rf .libs _libs make[1]: Leaving directory '/tmp/B.u6el52es/BUILD/zfs-2.0.5/scripts' make[1]: Entering directory '/tmp/B.u6el52es/BUILD/zfs-2.0.5/scripts' rm -f common.sh make[1]: Leaving directory '/tmp/B.u6el52es/BUILD/zfs-2.0.5/scripts' make[1]: Entering directory '/tmp/B.u6el52es/BUILD/zfs-2.0.5/scripts' rm -f *.lo make[1]: Leaving directory '/tmp/B.u6el52es/BUILD/zfs-2.0.5/scripts' Making clean in module /usr/bin/make -C /usr/src/linux M=`pwd` clean make[2]: Entering directory '/usr/src/linux-5.14.1' CLEAN /tmp/B.u6el52es/BUILD/zfs-2.0.5/module/Module.symvers make[2]: Leaving directory '/usr/src/linux-5.14.1' make[1]: Entering directory '/tmp/B.u6el52es/BUILD/zfs-2.0.5/module' if [ -f Module.symvers ]; then rm -f Module.symvers; fi if [ -f Module.markers ]; then rm -f Module.markers; fi find . -name '*.ur-safe' -type f -print | xargs rm -f make[1]: Leaving directory '/tmp/B.u6el52es/BUILD/zfs-2.0.5/module' make[1]: Entering directory '/tmp/B.u6el52es/BUILD/zfs-2.0.5' rm -rf .libs _libs make[1]: Leaving directory '/tmp/B.u6el52es/BUILD/zfs-2.0.5' make[1]: Entering directory '/tmp/B.u6el52es/BUILD/zfs-2.0.5' rm -f *.lo make[1]: Leaving directory '/tmp/B.u6el52es/BUILD/zfs-2.0.5' + /usr/bin/make -Otarget -j9 ./scripts/make_gitrev.sh include/zfs_gitrev.h /usr/bin/make all-recursive Making all in include Making all in sys Making all in fm Making all in fs make[5]: Nothing to be done for 'all'. make[5]: Nothing to be done for 'all-am'. Making all in fs make[4]: Nothing to be done for 'all'. Making all in crypto make[4]: Nothing to be done for 'all'. Making all in lua make[4]: Nothing to be done for 'all'. Making all in sysevent make[4]: Nothing to be done for 'all'. Making all in zstd make[4]: Nothing to be done for 'all'. make[4]: Nothing to be done for 'all-am'. Making all in os Making all in linux Making all in kernel Making all in linux make[6]: Nothing to be done for 'all'. make[6]: Nothing to be done for 'all-am'. Making all in spl Making all in rpc make[6]: Nothing to be done for 'all'. Making all in sys make[6]: Nothing to be done for 'all'. make[6]: Nothing to be done for 'all-am'. Making all in zfs Making all in sys make[6]: Nothing to be done for 'all'. make[6]: Nothing to be done for 'all-am'. make[5]: Nothing to be done for 'all-am'. make[4]: Nothing to be done for 'all-am'. make[3]: Nothing to be done for 'all-am'. Making all in rpm Making all in generic make[3]: Nothing to be done for 'all'. Making all in redhat make[3]: Nothing to be done for 'all'. make[3]: Nothing to be done for 'all-am'. Making all in scripts make[2]: Entering directory '/tmp/B.u6el52es/BUILD/zfs-2.0.5/scripts' /bin/sed -e '\|^export BIN_DIR=|s|$|/tmp/B.u6el52es/BUILD/zfs-2.0.5/bin|' \ -e '\|^export SBIN_DIR=|s|$|/tmp/B.u6el52es/BUILD/zfs-2.0.5/bin|' \ -e '\|^export ZTS_DIR=|s|$|/tmp/B.u6el52es/BUILD/zfs-2.0.5/tests|' \ -e '\|^export SCRIPT_DIR=|s|$|/tmp/B.u6el52es/BUILD/zfs-2.0.5/scripts|' \ /tmp/B.u6el52es/BUILD/zfs-2.0.5/scripts/common.sh.in >common.sh echo "$EXTRA_ENVIRONMENT" >>common.sh make[2]: Leaving directory '/tmp/B.u6el52es/BUILD/zfs-2.0.5/scripts' Making all in module list='icp lua zstd'; for targetdir in $list; do \ /usr/bin/make -C $targetdir; \ done make[3]: Entering directory '/tmp/B.u6el52es/BUILD/zfs-2.0.5/module/icp' mkdir -p api core spi io os algs algs/aes algs/edonr algs/modes algs/sha1 algs/sha2 algs/skein asm-x86_64 asm-x86_64/aes asm-x86_64/modes asm-x86_64/sha1 asm-x86_64/sha2 asm-i386 asm-generic make[3]: Leaving directory '/tmp/B.u6el52es/BUILD/zfs-2.0.5/module/icp' make[3]: Entering directory '/tmp/B.u6el52es/BUILD/zfs-2.0.5/module/lua' mkdir -p setjmp make[3]: Leaving directory '/tmp/B.u6el52es/BUILD/zfs-2.0.5/module/lua' make[3]: Entering directory '/tmp/B.u6el52es/BUILD/zfs-2.0.5/module/zstd' mkdir -p lib make[3]: Leaving directory '/tmp/B.u6el52es/BUILD/zfs-2.0.5/module/zstd' /usr/bin/make -C /usr/src/linux M=`pwd` CONFIG_ZFS=m modules CC [M] /tmp/B.u6el52es/BUILD/zfs-2.0.5/module/spl/../os/linux/spl/spl-atomic.o CC [M] /tmp/B.u6el52es/BUILD/zfs-2.0.5/module/icp/illumos-crypto.o CC [M] /tmp/B.u6el52es/BUILD/zfs-2.0.5/module/avl/avl.o LD [M] /tmp/B.u6el52es/BUILD/zfs-2.0.5/module/avl/zavl.o CC [M] /tmp/B.u6el52es/BUILD/zfs-2.0.5/module/zcommon/cityhash.o CC [M] /tmp/B.u6el52es/BUILD/zfs-2.0.5/module/zstd/zfs_zstd.o CC [M] /tmp/B.u6el52es/BUILD/zfs-2.0.5/module/zfs/abd.o /tmp/B.u6el52es/BUILD/zfs-2.0.5/module/zfs/abd.c: In function 'abd_raidz_gen_iterate': /tmp/B.u6el52es/BUILD/zfs-2.0.5/module/zfs/abd.c:1066:37: warning: this statement may fall through [-Wimplicit-fallthrough=] 1066 | len = MIN(caiters[2].iter_mapsize, len); /tmp/B.u6el52es/BUILD/zfs-2.0.5/module/zfs/abd.c:1068:25: note: here 1068 | case 2: | ^~~~ /tmp/B.u6el52es/BUILD/zfs-2.0.5/module/zfs/abd.c:1069:37: warning: this statement may fall through [-Wimplicit-fallthrough=] 1069 | len = MIN(caiters[1].iter_mapsize, len); /tmp/B.u6el52es/BUILD/zfs-2.0.5/module/zfs/abd.c:1071:25: note: here 1071 | case 1: | ^~~~ /tmp/B.u6el52es/BUILD/zfs-2.0.5/module/zfs/abd.c: In function 'abd_raidz_rec_iterate': /tmp/B.u6el52es/BUILD/zfs-2.0.5/module/zfs/abd.c:1179:37: warning: this statement may fall through [-Wimplicit-fallthrough=] 1179 | len = MIN(citers[2].iter_mapsize, len); /tmp/B.u6el52es/BUILD/zfs-2.0.5/module/zfs/abd.c:1181:25: note: here 1181 | case 2: | ^~~~ /tmp/B.u6el52es/BUILD/zfs-2.0.5/module/zfs/abd.c:1183:37: warning: this statement may fall through [-Wimplicit-fallthrough=] 1183 | len = MIN(citers[1].iter_mapsize, len); /tmp/B.u6el52es/BUILD/zfs-2.0.5/module/zfs/abd.c:1185:25: note: here 1185 | case 1: | ^~~~ CC [M] /tmp/B.u6el52es/BUILD/zfs-2.0.5/module/spl/../os/linux/spl/spl-condvar.o CC [M] /tmp/B.u6el52es/BUILD/zfs-2.0.5/module/zcommon/zfeature_common.o CC [M] /tmp/B.u6el52es/BUILD/zfs-2.0.5/module/lua/lapi.o CC [M] /tmp/B.u6el52es/BUILD/zfs-2.0.5/module/zfs/aggsum.o CC [M] /tmp/B.u6el52es/BUILD/zfs-2.0.5/module/unicode/u8_textprep.o CC [M] /tmp/B.u6el52es/BUILD/zfs-2.0.5/module/icp/api/kcf_cipher.o CC [M] /tmp/B.u6el52es/BUILD/zfs-2.0.5/module/nvpair/nvpair.o CC [M] /tmp/B.u6el52es/BUILD/zfs-2.0.5/module/spl/../os/linux/spl/spl-cred.o CC [M] /tmp/B.u6el52es/BUILD/zfs-2.0.5/module/icp/api/kcf_digest.o CC [M] /tmp/B.u6el52es/BUILD/zfs-2.0.5/module/zcommon/zfs_comutil.o CC [M] /tmp/B.u6el52es/BUILD/zfs-2.0.5/module/spl/../os/linux/spl/spl-err.o CC [M] /tmp/B.u6el52es/BUILD/zfs-2.0.5/module/nvpair/nvpair_alloc_spl.o CC [M] /tmp/B.u6el52es/BUILD/zfs-2.0.5/module/lua/lauxlib.o CC [M] /tmp/B.u6el52es/BUILD/zfs-2.0.5/module/nvpair/fnvpair.o CC [M] /tmp/B.u6el52es/BUILD/zfs-2.0.5/module/unicode/uconv.o LD [M] /tmp/B.u6el52es/BUILD/zfs-2.0.5/module/unicode/zunicode.o CC [M] /tmp/B.u6el52es/BUILD/zfs-2.0.5/module/icp/api/kcf_mac.o CC [M] /tmp/B.u6el52es/BUILD/zfs-2.0.5/module/zcommon/zfs_deleg.o CC [M] /tmp/B.u6el52es/BUILD/zfs-2.0.5/module/nvpair/nvpair_alloc_fixed.o LD [M] /tmp/B.u6el52es/BUILD/zfs-2.0.5/module/nvpair/znvpair.o CC [M] /tmp/B.u6el52es/BUILD/zfs-2.0.5/module/spl/../os/linux/spl/spl-generic.o CC [M] /tmp/B.u6el52es/BUILD/zfs-2.0.5/module/icp/api/kcf_miscapi.o /tmp/B.u6el52es/BUILD/zfs-2.0.5/module/icp/api/kcf_miscapi.c:65:22: warning: argument 1 of type 'char *' declared as a pointer [-Warray-parameter=] 65 | crypto_mech2id(char *mechname) | ~~~~~~^~~~~~~~ In file included from /tmp/B.u6el52es/BUILD/zfs-2.0.5/module/icp/api/kcf_miscapi.c:28: /tmp/B.u6el52es/BUILD/zfs-2.0.5/include/sys/crypto/api.h:61:61: note: previously declared as an array 'char[32]' 61 | extern crypto_mech_type_t crypto_mech2id(crypto_mech_name_t name); | ~~~~~~~~~~~~~~~~~~~^~~~ CC [M] /tmp/B.u6el52es/BUILD/zfs-2.0.5/module/lua/lbaselib.o CC [M] /tmp/B.u6el52es/BUILD/zfs-2.0.5/module/icp/api/kcf_ctxops.o CC [M] /tmp/B.u6el52es/BUILD/zfs-2.0.5/module/icp/core/kcf_callprov.o CC [M] /tmp/B.u6el52es/BUILD/zfs-2.0.5/module/spl/../os/linux/spl/spl-kmem.o CC [M] /tmp/B.u6el52es/BUILD/zfs-2.0.5/module/lua/lcode.o CC [M] /tmp/B.u6el52es/BUILD/zfs-2.0.5/module/zcommon/zfs_fletcher.o CC [M] /tmp/B.u6el52es/BUILD/zfs-2.0.5/module/spl/../os/linux/spl/spl-proc.o CC [M] /tmp/B.u6el52es/BUILD/zfs-2.0.5/module/zcommon/zfs_fletcher_superscalar.o CC [M] /tmp/B.u6el52es/BUILD/zfs-2.0.5/module/spl/../os/linux/spl/spl-kstat.o CC [M] /tmp/B.u6el52es/BUILD/zfs-2.0.5/module/zcommon/zfs_fletcher_superscalar4.o CC [M] /tmp/B.u6el52es/BUILD/zfs-2.0.5/module/spl/../os/linux/spl/spl-kmem-cache.o CC [M] /tmp/B.u6el52es/BUILD/zfs-2.0.5/module/lua/lcompat.o CC [M] /tmp/B.u6el52es/BUILD/zfs-2.0.5/module/icp/core/kcf_prov_tabs.o /tmp/B.u6el52es/BUILD/zfs-2.0.5/module/icp/core/kcf_prov_tabs.c: In function 'kcf_provider_zero_refcnt': /tmp/B.u6el52es/BUILD/zfs-2.0.5/module/icp/core/kcf_prov_tabs.c:373:20: warning: this statement may fall through [-Wimplicit-fallthrough=] 373 | if (desc->pd_state == KCF_PROV_REMOVED || | ^ /tmp/B.u6el52es/BUILD/zfs-2.0.5/module/icp/core/kcf_prov_tabs.c:382:9: note: here 382 | case CRYPTO_HW_PROVIDER: | ^~~~ CC [M] /tmp/B.u6el52es/BUILD/zfs-2.0.5/module/spl/../os/linux/spl/spl-procfs-list.o CC [M] /tmp/B.u6el52es/BUILD/zfs-2.0.5/module/zfs/arc.o CC [M] /tmp/B.u6el52es/BUILD/zfs-2.0.5/module/icp/core/kcf_sched.o CC [M] /tmp/B.u6el52es/BUILD/zfs-2.0.5/module/zcommon/zfs_namecheck.o CC [M] /tmp/B.u6el52es/BUILD/zfs-2.0.5/module/icp/core/kcf_mech_tabs.o CC [M] /tmp/B.u6el52es/BUILD/zfs-2.0.5/module/zcommon/zfs_prop.o CC [M] /tmp/B.u6el52es/BUILD/zfs-2.0.5/module/lua/lcorolib.o CC [M] /tmp/B.u6el52es/BUILD/zfs-2.0.5/module/zfs/blkptr.o CC [M] /tmp/B.u6el52es/BUILD/zfs-2.0.5/module/spl/../os/linux/spl/spl-taskq.o CC [M] /tmp/B.u6el52es/BUILD/zfs-2.0.5/module/spl/../os/linux/spl/spl-thread.o CC [M] /tmp/B.u6el52es/BUILD/zfs-2.0.5/module/zfs/bplist.o CC [M] /tmp/B.u6el52es/BUILD/zfs-2.0.5/module/lua/lctype.o CC [M] /tmp/B.u6el52es/BUILD/zfs-2.0.5/module/icp/core/kcf_prov_lib.o CC [M] /tmp/B.u6el52es/BUILD/zfs-2.0.5/module/spl/../os/linux/spl/spl-trace.o CC [M] /tmp/B.u6el52es/BUILD/zfs-2.0.5/module/icp/spi/kcf_spi.o CC [M] /tmp/B.u6el52es/BUILD/zfs-2.0.5/module/zfs/bptree.o CC [M] /tmp/B.u6el52es/BUILD/zfs-2.0.5/module/spl/../os/linux/spl/spl-tsd.o CC [M] /tmp/B.u6el52es/BUILD/zfs-2.0.5/module/zfs/bpobj.o CC [M] /tmp/B.u6el52es/BUILD/zfs-2.0.5/module/lua/ldebug.o CC [M] /tmp/B.u6el52es/BUILD/zfs-2.0.5/module/zcommon/zpool_prop.o CC [M] /tmp/B.u6el52es/BUILD/zfs-2.0.5/module/spl/../os/linux/spl/spl-vmem.o CC [M] /tmp/B.u6el52es/BUILD/zfs-2.0.5/module/zcommon/zfs_fletcher_intel.o CC [M] /tmp/B.u6el52es/BUILD/zfs-2.0.5/module/zfs/bqueue.o CC [M] /tmp/B.u6el52es/BUILD/zfs-2.0.5/module/icp/io/aes.o /tmp/B.u6el52es/BUILD/zfs-2.0.5/module/icp/io/aes.c: In function 'aes_encrypt_atomic': /tmp/B.u6el52es/BUILD/zfs-2.0.5/module/icp/io/aes.c:977:20: warning: this statement may fall through [-Wimplicit-fallthrough=] 977 | if (plaintext->cd_length != 0) | ^ /tmp/B.u6el52es/BUILD/zfs-2.0.5/module/icp/io/aes.c:980:9: note: here 980 | case AES_GCM_MECH_INFO_TYPE: | ^~~~ CC [M] /tmp/B.u6el52es/BUILD/zfs-2.0.5/module/zfs/dataset_kstats.o CC [M] /tmp/B.u6el52es/BUILD/zfs-2.0.5/module/lua/ldo.o CC [M] /tmp/B.u6el52es/BUILD/zfs-2.0.5/module/spl/../os/linux/spl/spl-xdr.o CC [M] /tmp/B.u6el52es/BUILD/zfs-2.0.5/module/zcommon/zprop_common.o CC [M] /tmp/B.u6el52es/BUILD/zfs-2.0.5/module/zfs/btree.o CC [M] /tmp/B.u6el52es/BUILD/zfs-2.0.5/module/zcommon/zfs_fletcher_sse.o CC [M] /tmp/B.u6el52es/BUILD/zfs-2.0.5/module/spl/../os/linux/spl/spl-zlib.o LD [M] /tmp/B.u6el52es/BUILD/zfs-2.0.5/module/spl/spl.o CC [M] /tmp/B.u6el52es/BUILD/zfs-2.0.5/module/icp/io/edonr_mod.o CC [M] /tmp/B.u6el52es/BUILD/zfs-2.0.5/module/zcommon/zfs_fletcher_avx512.o LD [M] /tmp/B.u6el52es/BUILD/zfs-2.0.5/module/zcommon/zcommon.o CC [M] /tmp/B.u6el52es/BUILD/zfs-2.0.5/module/lua/lfunc.o CC [M] /tmp/B.u6el52es/BUILD/zfs-2.0.5/module/lua/lmem.o CC [M] /tmp/B.u6el52es/BUILD/zfs-2.0.5/module/lua/llex.o /tmp/B.u6el52es/BUILD/zfs-2.0.5/module/lua/llex.c: In function 'llex': /tmp/B.u6el52es/BUILD/zfs-2.0.5/module/lua/llex.c:477:17: warning: this statement may fall through [-Wimplicit-fallthrough=] 477 | else if (!lisdigit(ls->current)) return '.'; | ^ /tmp/B.u6el52es/BUILD/zfs-2.0.5/module/lua/llex.c:481:7: note: here 481 | case '0': case '1': case '2': case '3': case '4': | ^~~~ CC [M] /tmp/B.u6el52es/BUILD/zfs-2.0.5/module/lua/lgc.o /tmp/B.u6el52es/BUILD/zfs-2.0.5/module/lua/lgc.c: In function 'freeobj': /tmp/B.u6el52es/BUILD/zfs-2.0.5/module/lua/lgc.c:678:22: warning: this statement may fall through [-Wimplicit-fallthrough=] 678 | G(L)->strt.nuse--; /tmp/B.u6el52es/BUILD/zfs-2.0.5/module/lua/lgc.c:680:5: note: here 680 | case LUA_TLNGSTR: { | ^~~~ CC [M] /tmp/B.u6el52es/BUILD/zfs-2.0.5/module/zfs/dbuf_stats.o CC [M] /tmp/B.u6el52es/BUILD/zfs-2.0.5/module/lua/lobject.o CC [M] /tmp/B.u6el52es/BUILD/zfs-2.0.5/module/icp/io/sha1_mod.o CC [M] /tmp/B.u6el52es/BUILD/zfs-2.0.5/module/lua/lopcodes.o CC [M] /tmp/B.u6el52es/BUILD/zfs-2.0.5/module/zfs/ddt.o CC [M] /tmp/B.u6el52es/BUILD/zfs-2.0.5/module/zfs/ddt_zap.o CC [M] /tmp/B.u6el52es/BUILD/zfs-2.0.5/module/lua/lstate.o CC [M] /tmp/B.u6el52es/BUILD/zfs-2.0.5/module/lua/lstring.o CC [M] /tmp/B.u6el52es/BUILD/zfs-2.0.5/module/lua/lparser.o CC [M] /tmp/B.u6el52es/BUILD/zfs-2.0.5/module/icp/io/sha2_mod.o CC [M] /tmp/B.u6el52es/BUILD/zfs-2.0.5/module/zfs/dbuf.o CC [M] /tmp/B.u6el52es/BUILD/zfs-2.0.5/module/icp/io/skein_mod.o CC [M] /tmp/B.u6el52es/BUILD/zfs-2.0.5/module/lua/ltable.o /tmp/B.u6el52es/BUILD/zfs-2.0.5/module/lua/ltable.c: In function 'luaH_get': /tmp/B.u6el52es/BUILD/zfs-2.0.5/module/lua/ltable.c:487:23: warning: this statement may fall through [-Wimplicit-fallthrough=] 487 | case LUA_TNUMBER: { | ^ /tmp/B.u6el52es/BUILD/zfs-2.0.5/module/lua/ltable.c:496:5: note: here 496 | default: { | ^~~~~~~ CC [M] /tmp/B.u6el52es/BUILD/zfs-2.0.5/module/icp/os/modconf.o CC [M] /tmp/B.u6el52es/BUILD/zfs-2.0.5/module/icp/os/modhash.o CC [M] /tmp/B.u6el52es/BUILD/zfs-2.0.5/module/lua/lstrlib.o /tmp/B.u6el52es/BUILD/zfs-2.0.5/module/lua/lstrlib.c: In function 'match': /tmp/B.u6el52es/BUILD/zfs-2.0.5/module/lua/lstrlib.c:503:16: warning: this statement may fall through [-Wimplicit-fallthrough=] 503 | s++; /* 1 match already done */ | ~^~ /tmp/B.u6el52es/BUILD/zfs-2.0.5/module/lua/lstrlib.c:505:13: note: here 505 | case '*': /* 0 or more repetitions */ | ^~~~ CC [M] /tmp/B.u6el52es/BUILD/zfs-2.0.5/module/icp/algs/modes/cbc.o CC [M] /tmp/B.u6el52es/BUILD/zfs-2.0.5/module/icp/algs/modes/ccm.o CC [M] /tmp/B.u6el52es/BUILD/zfs-2.0.5/module/lua/ltablib.o CC [M] /tmp/B.u6el52es/BUILD/zfs-2.0.5/module/icp/algs/modes/ctr.o CC [M] /tmp/B.u6el52es/BUILD/zfs-2.0.5/module/icp/algs/modes/ecb.o AS [M] /tmp/B.u6el52es/BUILD/zfs-2.0.5/module/lua/setjmp/setjmp.o CC [M] /tmp/B.u6el52es/BUILD/zfs-2.0.5/module/zfs/dmu.o CC [M] /tmp/B.u6el52es/BUILD/zfs-2.0.5/module/lua/ltm.o CC [M] /tmp/B.u6el52es/BUILD/zfs-2.0.5/module/zfs/dmu_diff.o CC [M] /tmp/B.u6el52es/BUILD/zfs-2.0.5/module/lua/lzio.o CC [M] /tmp/B.u6el52es/BUILD/zfs-2.0.5/module/icp/algs/modes/gcm_generic.o CC [M] /tmp/B.u6el52es/BUILD/zfs-2.0.5/module/lua/lvm.o CC [M] /tmp/B.u6el52es/BUILD/zfs-2.0.5/module/zfs/dmu_object.o LD [M] /tmp/B.u6el52es/BUILD/zfs-2.0.5/module/lua/zlua.o CC [M] /tmp/B.u6el52es/BUILD/zfs-2.0.5/module/icp/algs/modes/modes.o CC [M] /tmp/B.u6el52es/BUILD/zfs-2.0.5/module/icp/algs/modes/gcm.o CC [M] /tmp/B.u6el52es/BUILD/zfs-2.0.5/module/icp/algs/aes/aes_impl_generic.o CC [M] /tmp/B.u6el52es/BUILD/zfs-2.0.5/module/icp/algs/aes/aes_impl.o CC [M] /tmp/B.u6el52es/BUILD/zfs-2.0.5/module/icp/algs/aes/aes_modes.o CC [M] /tmp/B.u6el52es/BUILD/zfs-2.0.5/module/zfs/dmu_recv.o CC [M] /tmp/B.u6el52es/BUILD/zfs-2.0.5/module/icp/algs/sha1/sha1.o CC [M] /tmp/B.u6el52es/BUILD/zfs-2.0.5/module/zfs/dmu_objset.o CC [M] /tmp/B.u6el52es/BUILD/zfs-2.0.5/module/zfs/dmu_redact.o CC [M] /tmp/B.u6el52es/BUILD/zfs-2.0.5/module/icp/algs/edonr/edonr.o CC [M] /tmp/B.u6el52es/BUILD/zfs-2.0.5/module/icp/algs/skein/skein_iv.o CC [M] /tmp/B.u6el52es/BUILD/zfs-2.0.5/module/icp/algs/skein/skein_block.o CC [M] /tmp/B.u6el52es/BUILD/zfs-2.0.5/module/icp/algs/skein/skein.o CC [M] /tmp/B.u6el52es/BUILD/zfs-2.0.5/module/icp/algs/sha2/sha2.o AS [M] /tmp/B.u6el52es/BUILD/zfs-2.0.5/module/icp/asm-x86_64/aes/aes_amd64.o CC [M] /tmp/B.u6el52es/BUILD/zfs-2.0.5/module/zfs/dmu_zfetch.o AS [M] /tmp/B.u6el52es/BUILD/zfs-2.0.5/module/icp/asm-x86_64/aes/aes_aesni.o CC [M] /tmp/B.u6el52es/BUILD/zfs-2.0.5/module/icp/asm-x86_64/aes/aeskey.o AS [M] /tmp/B.u6el52es/BUILD/zfs-2.0.5/module/icp/asm-x86_64/modes/gcm_pclmulqdq.o CC [M] /tmp/B.u6el52es/BUILD/zfs-2.0.5/module/zfs/dmu_send.o AS [M] /tmp/B.u6el52es/BUILD/zfs-2.0.5/module/icp/asm-x86_64/modes/aesni-gcm-x86_64.o CC [M] /tmp/B.u6el52es/BUILD/zfs-2.0.5/module/zfs/dmu_traverse.o CC [M] /tmp/B.u6el52es/BUILD/zfs-2.0.5/module/zfs/dnode_sync.o AS [M] /tmp/B.u6el52es/BUILD/zfs-2.0.5/module/icp/asm-x86_64/modes/ghash-x86_64.o CC [M] /tmp/B.u6el52es/BUILD/zfs-2.0.5/module/zfs/dmu_tx.o AS [M] /tmp/B.u6el52es/BUILD/zfs-2.0.5/module/icp/asm-x86_64/sha1/sha1-x86_64.o /tmp/B.u6el52es/BUILD/zfs-2.0.5/module/icp/asm-x86_64/sha1/sha1-x86_64.o: warning: objtool: sha1_block_data_order()+0x11: unsupported stack pointer realignment AS [M] /tmp/B.u6el52es/BUILD/zfs-2.0.5/module/icp/asm-x86_64/sha2/sha256_impl.o /tmp/B.u6el52es/BUILD/zfs-2.0.5/module/icp/asm-x86_64/sha2/sha256_impl.o: warning: objtool: SHA256TransformBlocks()+0x19: unsupported stack pointer realignment AS [M] /tmp/B.u6el52es/BUILD/zfs-2.0.5/module/icp/asm-x86_64/sha2/sha512_impl.o /tmp/B.u6el52es/BUILD/zfs-2.0.5/module/icp/asm-x86_64/sha2/sha512_impl.o: warning: objtool: SHA512TransformBlocks()+0x1c: unsupported stack pointer realignment CC [M] /tmp/B.u6el52es/BUILD/zfs-2.0.5/module/zfs/dsl_bookmark.o CC [M] /tmp/B.u6el52es/BUILD/zfs-2.0.5/module/zfs/dnode.o CC [M] /tmp/B.u6el52es/BUILD/zfs-2.0.5/module/icp/algs/modes/gcm_pclmulqdq.o CC [M] /tmp/B.u6el52es/BUILD/zfs-2.0.5/module/zfs/dsl_deadlist.o CC [M] /tmp/B.u6el52es/BUILD/zfs-2.0.5/module/icp/algs/aes/aes_impl_aesni.o CC [M] /tmp/B.u6el52es/BUILD/zfs-2.0.5/module/zfs/dsl_deleg.o CC [M] /tmp/B.u6el52es/BUILD/zfs-2.0.5/module/zfs/dsl_crypt.o CC [M] /tmp/B.u6el52es/BUILD/zfs-2.0.5/module/zfs/dsl_destroy.o CC [M] /tmp/B.u6el52es/BUILD/zfs-2.0.5/module/icp/algs/aes/aes_impl_x86-64.o LD [M] /tmp/B.u6el52es/BUILD/zfs-2.0.5/module/icp/icp.o CC [M] /tmp/B.u6el52es/BUILD/zfs-2.0.5/module/zfs/dsl_userhold.o CC [M] /tmp/B.u6el52es/BUILD/zfs-2.0.5/module/zfs/edonr_zfs.o CC [M] /tmp/B.u6el52es/BUILD/zfs-2.0.5/module/zfs/dsl_pool.o CC [M] /tmp/B.u6el52es/BUILD/zfs-2.0.5/module/zfs/dsl_dataset.o CC [M] /tmp/B.u6el52es/BUILD/zfs-2.0.5/module/zfs/dsl_synctask.o CC [M] /tmp/B.u6el52es/BUILD/zfs-2.0.5/module/zfs/dsl_dir.o CC [M] /tmp/B.u6el52es/BUILD/zfs-2.0.5/module/zfs/dsl_prop.o /tmp/B.u6el52es/BUILD/zfs-2.0.5/module/zfs/dsl_prop.c: In function 'dsl_prop_set_sync_impl': /tmp/B.u6el52es/BUILD/zfs-2.0.5/module/zfs/dsl_prop.c:750:23: warning: this statement may fall through [-Wimplicit-fallthrough=] 750 | err = zap_remove(mos, zapobj, inheritstr, tx); | ^~~~~~~~~~~~~~~~~~~~~~~~~~~~~~~~~~~~~~~ /tmp/B.u6el52es/BUILD/zfs-2.0.5/module/zfs/dsl_prop.c:753:9: note: here 753 | case (ZPROP_SRC_NONE | ZPROP_SRC_RECEIVED): | ^~~~ CC [M] /tmp/B.u6el52es/BUILD/zfs-2.0.5/module/zfs/hkdf.o CC [M] /tmp/B.u6el52es/BUILD/zfs-2.0.5/module/zfs/lzjb.o CC [M] /tmp/B.u6el52es/BUILD/zfs-2.0.5/module/zfs/gzip.o CC [M] /tmp/B.u6el52es/BUILD/zfs-2.0.5/module/zfs/lz4.o CC [M] /tmp/B.u6el52es/BUILD/zfs-2.0.5/module/zfs/dsl_scan.o CC [M] /tmp/B.u6el52es/BUILD/zfs-2.0.5/module/zfs/fm.o CC [M] /tmp/B.u6el52es/BUILD/zfs-2.0.5/module/zfs/mmp.o CC [M] /tmp/B.u6el52es/BUILD/zfs-2.0.5/module/zfs/pathname.o CC [M] /tmp/B.u6el52es/BUILD/zfs-2.0.5/module/zfs/objlist.o CC [M] /tmp/B.u6el52es/BUILD/zfs-2.0.5/module/zfs/multilist.o CC [M] /tmp/B.u6el52es/BUILD/zfs-2.0.5/module/zfs/refcount.o CC [M] /tmp/B.u6el52es/BUILD/zfs-2.0.5/module/zfs/rrwlock.o CC [M] /tmp/B.u6el52es/BUILD/zfs-2.0.5/module/zfs/sha256.o CC [M] /tmp/B.u6el52es/BUILD/zfs-2.0.5/module/zfs/skein_zfs.o CC [M] /tmp/B.u6el52es/BUILD/zfs-2.0.5/module/zfs/range_tree.o CC [M] /tmp/B.u6el52es/BUILD/zfs-2.0.5/module/zfs/spa_boot.o CC [M] /tmp/B.u6el52es/BUILD/zfs-2.0.5/module/zfs/metaslab.o CC [M] /tmp/B.u6el52es/BUILD/zfs-2.0.5/module/zfs/spa_checkpoint.o CC [M] /tmp/B.u6el52es/BUILD/zfs-2.0.5/module/zfs/sa.o CC [M] /tmp/B.u6el52es/BUILD/zfs-2.0.5/module/zfs/spa_config.o CC [M] /tmp/B.u6el52es/BUILD/zfs-2.0.5/module/zfs/spa_log_spacemap.o CC [M] /tmp/B.u6el52es/BUILD/zfs-2.0.5/module/zfs/spa_errlog.o CC [M] /tmp/B.u6el52es/BUILD/zfs-2.0.5/module/zfs/spa_history.o CC [M] /tmp/B.u6el52es/BUILD/zfs-2.0.5/module/zfs/spa_stats.o CC [M] /tmp/B.u6el52es/BUILD/zfs-2.0.5/module/zfs/space_reftree.o CC [M] /tmp/B.u6el52es/BUILD/zfs-2.0.5/module/zfs/uberblock.o CC [M] /tmp/B.u6el52es/BUILD/zfs-2.0.5/module/zfs/space_map.o CC [M] /tmp/B.u6el52es/BUILD/zfs-2.0.5/module/zfs/unique.o CC [M] /tmp/B.u6el52es/BUILD/zfs-2.0.5/module/zfs/spa_misc.o CC [M] /tmp/B.u6el52es/BUILD/zfs-2.0.5/module/zfs/txg.o CC [M] /tmp/B.u6el52es/BUILD/zfs-2.0.5/module/zfs/vdev_cache.o CC [M] /tmp/B.u6el52es/BUILD/zfs-2.0.5/module/zfs/spa.o /tmp/B.u6el52es/BUILD/zfs-2.0.5/module/zfs/spa.c: In function 'spa_activity_in_progress': /tmp/B.u6el52es/BUILD/zfs-2.0.5/module/zfs/spa.c:9534:20: warning: this statement may fall through [-Wimplicit-fallthrough=] 9534 | if ((*in_progress = vdev_rebuild_active(spa->spa_root_vdev))) | ^ /tmp/B.u6el52es/BUILD/zfs-2.0.5/module/zfs/spa.c:9537:9: note: here 9537 | case ZPOOL_WAIT_SCRUB: | ^~~~ CC [M] /tmp/B.u6el52es/BUILD/zfs-2.0.5/module/zfs/vdev_indirect_births.o CC [M] /tmp/B.u6el52es/BUILD/zfs-2.0.5/module/zfs/vdev_indirect_mapping.o CC [M] /tmp/B.u6el52es/BUILD/zfs-2.0.5/module/zfs/vdev_indirect.o CC [M] /tmp/B.u6el52es/BUILD/zfs-2.0.5/module/zfs/vdev_mirror.o CC [M] /tmp/B.u6el52es/BUILD/zfs-2.0.5/module/zfs/vdev_initialize.o CC [M] /tmp/B.u6el52es/BUILD/zfs-2.0.5/module/zfs/vdev_missing.o CC [M] /tmp/B.u6el52es/BUILD/zfs-2.0.5/module/zfs/vdev_label.o /tmp/B.u6el52es/BUILD/zfs-2.0.5/module/zfs/vdev_label.c: In function 'vdev_label_read_bootenv': /tmp/B.u6el52es/BUILD/zfs-2.0.5/module/zfs/vdev_label.c:1286:28: warning: this statement may fall through [-Wimplicit-fallthrough=] 1286 | if (err == 0) { | ^ /tmp/B.u6el52es/BUILD/zfs-2.0.5/module/zfs/vdev_label.c:1292:17: note: here 1292 | default: | ^~~~~~~ CC [M] /tmp/B.u6el52es/BUILD/zfs-2.0.5/module/zfs/vdev_queue.o CC [M] /tmp/B.u6el52es/BUILD/zfs-2.0.5/module/zfs/vdev.o CC [M] /tmp/B.u6el52es/BUILD/zfs-2.0.5/module/zfs/vdev_raidz_math.o CC [M] /tmp/B.u6el52es/BUILD/zfs-2.0.5/module/zfs/vdev_rebuild.o CC [M] /tmp/B.u6el52es/BUILD/zfs-2.0.5/module/zfs/vdev_root.o CC [M] /tmp/B.u6el52es/BUILD/zfs-2.0.5/module/zfs/vdev_raidz_math_scalar.o /tmp/B.u6el52es/BUILD/zfs-2.0.5/module/zfs/vdev_raidz_math_impl.h: In function 'raidz_rec_pqr_abd': /tmp/B.u6el52es/BUILD/zfs-2.0.5/module/zfs/vdev_raidz_math_scalar.c:144:24: warning: this statement may fall through [-Wimplicit-fallthrough=] 144 | a.b[4] = mul_lt[a.b[4]]; \ | ^ /tmp/B.u6el52es/BUILD/zfs-2.0.5/module/zfs/vdev_raidz_math_impl.h:1357:17: note: in expansion of macro 'MUL' 1357 | MUL(mul[MUL_PQR_XP], REC_PQR_X); /* Xp = Pxyz * xp */ | ^~~ /tmp/B.u6el52es/BUILD/zfs-2.0.5/module/zfs/vdev_raidz_math_scalar.c:146:9: note: here 146 | case 4: \ | ^~~~ /tmp/B.u6el52es/BUILD/zfs-2.0.5/module/zfs/vdev_raidz_math_impl.h:1357:17: note: in expansion of macro 'MUL' 1357 | MUL(mul[MUL_PQR_XP], REC_PQR_X); /* Xp = Pxyz * xp */ | ^~~ /tmp/B.u6el52es/BUILD/zfs-2.0.5/module/zfs/vdev_raidz_math_scalar.c:144:24: warning: this statement may fall through [-Wimplicit-fallthrough=] 144 | a.b[4] = mul_lt[a.b[4]]; \ | ^ /tmp/B.u6el52es/BUILD/zfs-2.0.5/module/zfs/vdev_raidz_math_impl.h:1358:17: note: in expansion of macro 'MUL' 1358 | MUL(mul[MUL_PQR_XQ], REC_PQR_Y); /* Xq = Qxyz * xq */ | ^~~ /tmp/B.u6el52es/BUILD/zfs-2.0.5/module/zfs/vdev_raidz_math_scalar.c:146:9: note: here 146 | case 4: \ | ^~~~ /tmp/B.u6el52es/BUILD/zfs-2.0.5/module/zfs/vdev_raidz_math_impl.h:1358:17: note: in expansion of macro 'MUL' 1358 | MUL(mul[MUL_PQR_XQ], REC_PQR_Y); /* Xq = Qxyz * xq */ | ^~~ /tmp/B.u6el52es/BUILD/zfs-2.0.5/module/zfs/vdev_raidz_math_scalar.c:144:24: warning: this statement may fall through [-Wimplicit-fallthrough=] 144 | a.b[4] = mul_lt[a.b[4]]; \ | ^ /tmp/B.u6el52es/BUILD/zfs-2.0.5/module/zfs/vdev_raidz_math_impl.h:1360:17: note: in expansion of macro 'MUL' 1360 | MUL(mul[MUL_PQR_XR], REC_PQR_Z); /* Xr = Rxyz * xr */ | ^~~ /tmp/B.u6el52es/BUILD/zfs-2.0.5/module/zfs/vdev_raidz_math_scalar.c:146:9: note: here 146 | case 4: \ | ^~~~ /tmp/B.u6el52es/BUILD/zfs-2.0.5/module/zfs/vdev_raidz_math_impl.h:1360:17: note: in expansion of macro 'MUL' 1360 | MUL(mul[MUL_PQR_XR], REC_PQR_Z); /* Xr = Rxyz * xr */ | ^~~ /tmp/B.u6el52es/BUILD/zfs-2.0.5/module/zfs/vdev_raidz_math_scalar.c:144:24: warning: this statement may fall through [-Wimplicit-fallthrough=] 144 | a.b[4] = mul_lt[a.b[4]]; \ | ^ /tmp/B.u6el52es/BUILD/zfs-2.0.5/module/zfs/vdev_raidz_math_impl.h:1366:17: note: in expansion of macro 'MUL' 1366 | MUL(mul[MUL_PQR_YU], REC_PQR_X); /* Xq = X * upd_q */ | ^~~ /tmp/B.u6el52es/BUILD/zfs-2.0.5/module/zfs/vdev_raidz_math_scalar.c:146:9: note: here 146 | case 4: \ | ^~~~ /tmp/B.u6el52es/BUILD/zfs-2.0.5/module/zfs/vdev_raidz_math_impl.h:1366:17: note: in expansion of macro 'MUL' 1366 | MUL(mul[MUL_PQR_YU], REC_PQR_X); /* Xq = X * upd_q */ | ^~~ /tmp/B.u6el52es/BUILD/zfs-2.0.5/module/zfs/vdev_raidz_math_scalar.c:144:24: warning: this statement may fall through [-Wimplicit-fallthrough=] 144 | a.b[4] = mul_lt[a.b[4]]; \ | ^ /tmp/B.u6el52es/BUILD/zfs-2.0.5/module/zfs/vdev_raidz_math_impl.h:1369:17: note: in expansion of macro 'MUL' 1369 | MUL(mul[MUL_PQR_YP], REC_PQR_X); /* Yp = Pyz * yp */ | ^~~ /tmp/B.u6el52es/BUILD/zfs-2.0.5/module/zfs/vdev_raidz_math_scalar.c:146:9: note: here 146 | case 4: \ | ^~~~ /tmp/B.u6el52es/BUILD/zfs-2.0.5/module/zfs/vdev_raidz_math_impl.h:1369:17: note: in expansion of macro 'MUL' 1369 | MUL(mul[MUL_PQR_YP], REC_PQR_X); /* Yp = Pyz * yp */ | ^~~ /tmp/B.u6el52es/BUILD/zfs-2.0.5/module/zfs/vdev_raidz_math_scalar.c:144:24: warning: this statement may fall through [-Wimplicit-fallthrough=] 144 | a.b[4] = mul_lt[a.b[4]]; \ | ^ /tmp/B.u6el52es/BUILD/zfs-2.0.5/module/zfs/vdev_raidz_math_impl.h:1370:17: note: in expansion of macro 'MUL' 1370 | MUL(mul[MUL_PQR_YQ], REC_PQR_YS); /* Yq = Qyz * yq */ | ^~~ /tmp/B.u6el52es/BUILD/zfs-2.0.5/module/zfs/vdev_raidz_math_scalar.c:146:9: note: here 146 | case 4: \ | ^~~~ /tmp/B.u6el52es/BUILD/zfs-2.0.5/module/zfs/vdev_raidz_math_impl.h:1370:17: note: in expansion of macro 'MUL' 1370 | MUL(mul[MUL_PQR_YQ], REC_PQR_YS); /* Yq = Qyz * yq */ | ^~~ /tmp/B.u6el52es/BUILD/zfs-2.0.5/module/zfs/vdev_raidz_math_impl.h: In function 'raidz_rec_qr_abd': /tmp/B.u6el52es/BUILD/zfs-2.0.5/module/zfs/vdev_raidz_math_scalar.c:144:24: warning: this statement may fall through [-Wimplicit-fallthrough=] 144 | a.b[4] = mul_lt[a.b[4]]; \ | ^ /tmp/B.u6el52es/BUILD/zfs-2.0.5/module/zfs/vdev_raidz_math_impl.h:1184:17: note: in expansion of macro 'MUL' 1184 | MUL(mul[MUL_QR_XQ], REC_QR_X); /* X = Q * xqm */ | ^~~ /tmp/B.u6el52es/BUILD/zfs-2.0.5/module/zfs/vdev_raidz_math_scalar.c:146:9: note: here 146 | case 4: \ | ^~~~ /tmp/B.u6el52es/BUILD/zfs-2.0.5/module/zfs/vdev_raidz_math_impl.h:1184:17: note: in expansion of macro 'MUL' 1184 | MUL(mul[MUL_QR_XQ], REC_QR_X); /* X = Q * xqm */ | ^~~ /tmp/B.u6el52es/BUILD/zfs-2.0.5/module/zfs/vdev_raidz_math_scalar.c:144:24: warning: this statement may fall through [-Wimplicit-fallthrough=] 144 | a.b[4] = mul_lt[a.b[4]]; \ | ^ /tmp/B.u6el52es/BUILD/zfs-2.0.5/module/zfs/vdev_raidz_math_impl.h:1186:17: note: in expansion of macro 'MUL' 1186 | MUL(mul[MUL_QR_X], REC_QR_X); /* X = X * xm */ | ^~~ /tmp/B.u6el52es/BUILD/zfs-2.0.5/module/zfs/vdev_raidz_math_scalar.c:146:9: note: here 146 | case 4: \ | ^~~~ /tmp/B.u6el52es/BUILD/zfs-2.0.5/module/zfs/vdev_raidz_math_impl.h:1186:17: note: in expansion of macro 'MUL' 1186 | MUL(mul[MUL_QR_X], REC_QR_X); /* X = X * xm */ | ^~~ /tmp/B.u6el52es/BUILD/zfs-2.0.5/module/zfs/vdev_raidz_math_scalar.c:144:24: warning: this statement may fall through [-Wimplicit-fallthrough=] 144 | a.b[4] = mul_lt[a.b[4]]; \ | ^ /tmp/B.u6el52es/BUILD/zfs-2.0.5/module/zfs/vdev_raidz_math_impl.h:1190:17: note: in expansion of macro 'MUL' 1190 | MUL(mul[MUL_QR_YQ], REC_QR_T); /* X = Q * xqm */ | ^~~ /tmp/B.u6el52es/BUILD/zfs-2.0.5/module/zfs/vdev_raidz_math_scalar.c:146:9: note: here 146 | case 4: \ | ^~~~ /tmp/B.u6el52es/BUILD/zfs-2.0.5/module/zfs/vdev_raidz_math_impl.h:1190:17: note: in expansion of macro 'MUL' 1190 | MUL(mul[MUL_QR_YQ], REC_QR_T); /* X = Q * xqm */ | ^~~ /tmp/B.u6el52es/BUILD/zfs-2.0.5/module/zfs/vdev_raidz_math_scalar.c:144:24: warning: this statement may fall through [-Wimplicit-fallthrough=] 144 | a.b[4] = mul_lt[a.b[4]]; \ | ^ /tmp/B.u6el52es/BUILD/zfs-2.0.5/module/zfs/vdev_raidz_math_impl.h:1192:17: note: in expansion of macro 'MUL' 1192 | MUL(mul[MUL_QR_Y], REC_QR_T); /* X = X * xm */ | ^~~ /tmp/B.u6el52es/BUILD/zfs-2.0.5/module/zfs/vdev_raidz_math_scalar.c:146:9: note: here 146 | case 4: \ | ^~~~ /tmp/B.u6el52es/BUILD/zfs-2.0.5/module/zfs/vdev_raidz_math_impl.h:1192:17: note: in expansion of macro 'MUL' 1192 | MUL(mul[MUL_QR_Y], REC_QR_T); /* X = X * xm */ | ^~~ /tmp/B.u6el52es/BUILD/zfs-2.0.5/module/zfs/vdev_raidz_math_impl.h: In function 'raidz_rec_pr_abd': /tmp/B.u6el52es/BUILD/zfs-2.0.5/module/zfs/vdev_raidz_math_scalar.c:144:24: warning: this statement may fall through [-Wimplicit-fallthrough=] 144 | a.b[4] = mul_lt[a.b[4]]; \ | ^ /tmp/B.u6el52es/BUILD/zfs-2.0.5/module/zfs/vdev_raidz_math_impl.h:1023:17: note: in expansion of macro 'MUL' 1023 | MUL(mul[MUL_PR_X], REC_PR_X); | ^~~ /tmp/B.u6el52es/BUILD/zfs-2.0.5/module/zfs/vdev_raidz_math_scalar.c:146:9: note: here 146 | case 4: \ | ^~~~ /tmp/B.u6el52es/BUILD/zfs-2.0.5/module/zfs/vdev_raidz_math_impl.h:1023:17: note: in expansion of macro 'MUL' 1023 | MUL(mul[MUL_PR_X], REC_PR_X); | ^~~ /tmp/B.u6el52es/BUILD/zfs-2.0.5/module/zfs/vdev_raidz_math_scalar.c:144:24: warning: this statement may fall through [-Wimplicit-fallthrough=] 144 | a.b[4] = mul_lt[a.b[4]]; \ | ^ /tmp/B.u6el52es/BUILD/zfs-2.0.5/module/zfs/vdev_raidz_math_impl.h:1024:17: note: in expansion of macro 'MUL' 1024 | MUL(mul[MUL_PR_Y], REC_PR_Y); | ^~~ /tmp/B.u6el52es/BUILD/zfs-2.0.5/module/zfs/vdev_raidz_math_scalar.c:146:9: note: here 146 | case 4: \ | ^~~~ /tmp/B.u6el52es/BUILD/zfs-2.0.5/module/zfs/vdev_raidz_math_impl.h:1024:17: note: in expansion of macro 'MUL' 1024 | MUL(mul[MUL_PR_Y], REC_PR_Y); | ^~~ /tmp/B.u6el52es/BUILD/zfs-2.0.5/module/zfs/vdev_raidz_math_impl.h: In function 'raidz_rec_pq_abd': /tmp/B.u6el52es/BUILD/zfs-2.0.5/module/zfs/vdev_raidz_math_scalar.c:144:24: warning: this statement may fall through [-Wimplicit-fallthrough=] 144 | a.b[4] = mul_lt[a.b[4]]; \ | ^ /tmp/B.u6el52es/BUILD/zfs-2.0.5/module/zfs/vdev_raidz_math_impl.h:866:17: note: in expansion of macro 'MUL' 866 | MUL(mul[MUL_PQ_X], REC_PQ_X); | ^~~ /tmp/B.u6el52es/BUILD/zfs-2.0.5/module/zfs/vdev_raidz_math_scalar.c:146:9: note: here 146 | case 4: \ | ^~~~ /tmp/B.u6el52es/BUILD/zfs-2.0.5/module/zfs/vdev_raidz_math_impl.h:866:17: note: in expansion of macro 'MUL' 866 | MUL(mul[MUL_PQ_X], REC_PQ_X); | ^~~ /tmp/B.u6el52es/BUILD/zfs-2.0.5/module/zfs/vdev_raidz_math_scalar.c:144:24: warning: this statement may fall through [-Wimplicit-fallthrough=] 144 | a.b[4] = mul_lt[a.b[4]]; \ | ^ /tmp/B.u6el52es/BUILD/zfs-2.0.5/module/zfs/vdev_raidz_math_impl.h:867:17: note: in expansion of macro 'MUL' 867 | MUL(mul[MUL_PQ_Y], REC_PQ_Y); | ^~~ /tmp/B.u6el52es/BUILD/zfs-2.0.5/module/zfs/vdev_raidz_math_scalar.c:146:9: note: here 146 | case 4: \ | ^~~~ /tmp/B.u6el52es/BUILD/zfs-2.0.5/module/zfs/vdev_raidz_math_impl.h:867:17: note: in expansion of macro 'MUL' 867 | MUL(mul[MUL_PQ_Y], REC_PQ_Y); | ^~~ /tmp/B.u6el52es/BUILD/zfs-2.0.5/module/zfs/vdev_raidz_math_impl.h: In function 'raidz_mul_abd_cb': /tmp/B.u6el52es/BUILD/zfs-2.0.5/module/zfs/vdev_raidz_math_scalar.c:144:24: warning: this statement may fall through [-Wimplicit-fallthrough=] 144 | a.b[4] = mul_lt[a.b[4]]; \ | ^ /tmp/B.u6el52es/BUILD/zfs-2.0.5/module/zfs/vdev_raidz_math_impl.h:281:17: note: in expansion of macro 'MUL' 281 | MUL(mul, MUL_D); | ^~~ /tmp/B.u6el52es/BUILD/zfs-2.0.5/module/zfs/vdev_raidz_math_scalar.c:146:9: note: here 146 | case 4: \ | ^~~~ /tmp/B.u6el52es/BUILD/zfs-2.0.5/module/zfs/vdev_raidz_math_impl.h:281:17: note: in expansion of macro 'MUL' 281 | MUL(mul, MUL_D); | ^~~ /tmp/B.u6el52es/BUILD/zfs-2.0.5/module/zfs/vdev_raidz_math_scalar.c:144:24: warning: this statement may fall through [-Wimplicit-fallthrough=] 144 | a.b[4] = mul_lt[a.b[4]]; \ | ^ /tmp/B.u6el52es/BUILD/zfs-2.0.5/module/zfs/vdev_raidz_math_impl.h:285:17: note: in expansion of macro 'MUL' 285 | MUL(mul, MUL_D); | ^~~ /tmp/B.u6el52es/BUILD/zfs-2.0.5/module/zfs/vdev_raidz_math_scalar.c:146:9: note: here 146 | case 4: \ | ^~~~ /tmp/B.u6el52es/BUILD/zfs-2.0.5/module/zfs/vdev_raidz_math_impl.h:285:17: note: in expansion of macro 'MUL' 285 | MUL(mul, MUL_D); | ^~~ CC [M] /tmp/B.u6el52es/BUILD/zfs-2.0.5/module/zfs/vdev_raidz.o CC [M] /tmp/B.u6el52es/BUILD/zfs-2.0.5/module/zfs/zap.o CC [M] /tmp/B.u6el52es/BUILD/zfs-2.0.5/module/zfs/zcp_global.o CC [M] /tmp/B.u6el52es/BUILD/zfs-2.0.5/module/zfs/zcp_get.o CC [M] /tmp/B.u6el52es/BUILD/zfs-2.0.5/module/zfs/zap_leaf.o CC [M] /tmp/B.u6el52es/BUILD/zfs-2.0.5/module/zfs/vdev_removal.o CC [M] /tmp/B.u6el52es/BUILD/zfs-2.0.5/module/zfs/zcp.o CC [M] /tmp/B.u6el52es/BUILD/zfs-2.0.5/module/zfs/vdev_trim.o CC [M] /tmp/B.u6el52es/BUILD/zfs-2.0.5/module/zfs/zcp_set.o CC [M] /tmp/B.u6el52es/BUILD/zfs-2.0.5/module/zfs/zcp_iter.o CC [M] /tmp/B.u6el52es/BUILD/zfs-2.0.5/module/zfs/zcp_synctask.o CC [M] /tmp/B.u6el52es/BUILD/zfs-2.0.5/module/zfs/zfeature.o CC [M] /tmp/B.u6el52es/BUILD/zfs-2.0.5/module/zfs/zap_micro.o CC [M] /tmp/B.u6el52es/BUILD/zfs-2.0.5/module/zfs/zfs_byteswap.o CC [M] /tmp/B.u6el52es/BUILD/zfs-2.0.5/module/zfs/zfs_fuid.o CC [M] /tmp/B.u6el52es/BUILD/zfs-2.0.5/module/zfs/zfs_fm.o CC [M] /tmp/B.u6el52es/BUILD/zfs-2.0.5/module/zfs/zfs_onexit.o CC [M] /tmp/B.u6el52es/BUILD/zfs-2.0.5/module/zfs/zfs_log.o CC [M] /tmp/B.u6el52es/BUILD/zfs-2.0.5/module/zfs/zfs_ratelimit.o CC [M] /tmp/B.u6el52es/BUILD/zfs-2.0.5/module/zfs/zfs_quota.o CC [M] /tmp/B.u6el52es/BUILD/zfs-2.0.5/module/zfs/zfs_replay.o /tmp/B.u6el52es/BUILD/zfs-2.0.5/module/zfs/zfs_replay.c: In function 'zfs_replay_create_acl': /tmp/B.u6el52es/BUILD/zfs-2.0.5/module/zfs/zfs_replay.c:362:39: warning: this statement may fall through [-Wimplicit-fallthrough=] 362 | zfsvfs->z_fuid_replay = zfs_replay_fuids(fuidstart, | ~~~~~~~~~~~~~~~~~~~~~~^~~~~~~~~~~~~~~~~~~~~~~~~~~~~ 363 | (void *)&name, lracl->lr_fuidcnt, lracl->lr_domcnt, | ~~~~~~~~~~~~~~~~~~~~~~~~~~~~~~~~~~~~~~~~~~~~~~~~~~~ 364 | lr->lr_uid, lr->lr_gid); | ~~~~~~~~~~~~~~~~~~~~~~~ /tmp/B.u6el52es/BUILD/zfs-2.0.5/module/zfs/zfs_replay.c:366:9: note: here 366 | case TX_CREATE_ACL_ATTR: | ^~~~ /tmp/B.u6el52es/BUILD/zfs-2.0.5/module/zfs/zfs_replay.c:394:39: warning: this statement may fall through [-Wimplicit-fallthrough=] 394 | zfsvfs->z_fuid_replay = zfs_replay_fuids(fuidstart, | ~~~~~~~~~~~~~~~~~~~~~~^~~~~~~~~~~~~~~~~~~~~~~~~~~~~ 395 | (void *)&name, lracl->lr_fuidcnt, lracl->lr_domcnt, | ~~~~~~~~~~~~~~~~~~~~~~~~~~~~~~~~~~~~~~~~~~~~~~~~~~~ 396 | lr->lr_uid, lr->lr_gid); | ~~~~~~~~~~~~~~~~~~~~~~~ /tmp/B.u6el52es/BUILD/zfs-2.0.5/module/zfs/zfs_replay.c:398:9: note: here 398 | case TX_MKDIR_ACL_ATTR: | ^~~~ /tmp/B.u6el52es/BUILD/zfs-2.0.5/module/zfs/zfs_replay.c: In function 'zfs_replay_create': /tmp/B.u6el52es/BUILD/zfs-2.0.5/module/zfs/zfs_replay.c:521:22: warning: this statement may fall through [-Wimplicit-fallthrough=] 521 | name = (char *)start; | ~~~~~^~~~~~~~~~~~~~~ /tmp/B.u6el52es/BUILD/zfs-2.0.5/module/zfs/zfs_replay.c:524:9: note: here 524 | case TX_CREATE: | ^~~~ /tmp/B.u6el52es/BUILD/zfs-2.0.5/module/zfs/zfs_replay.c:539:22: warning: this statement may fall through [-Wimplicit-fallthrough=] 539 | name = (char *)start; | ~~~~~^~~~~~~~~~~~~~~ /tmp/B.u6el52es/BUILD/zfs-2.0.5/module/zfs/zfs_replay.c:542:9: note: here 542 | case TX_MKDIR: | ^~~~ CC [M] /tmp/B.u6el52es/BUILD/zfs-2.0.5/module/zfs/zfs_rlock.o CC [M] /tmp/B.u6el52es/BUILD/zfs-2.0.5/module/zfs/zfs_sa.o CC [M] /tmp/B.u6el52es/BUILD/zfs-2.0.5/module/zfs/zfs_vnops.o CC [M] /tmp/B.u6el52es/BUILD/zfs-2.0.5/module/zfs/zio_compress.o CC [M] /tmp/B.u6el52es/BUILD/zfs-2.0.5/module/zfs/zio_checksum.o CC [M] /tmp/B.u6el52es/BUILD/zfs-2.0.5/module/zfs/zfs_ioctl.o CC [M] /tmp/B.u6el52es/BUILD/zfs-2.0.5/module/zfs/zle.o CC [M] /tmp/B.u6el52es/BUILD/zfs-2.0.5/module/zfs/zthr.o CC [M] /tmp/B.u6el52es/BUILD/zfs-2.0.5/module/zfs/zil.o CC [M] /tmp/B.u6el52es/BUILD/zfs-2.0.5/module/zfs/zio_inject.o CC [M] /tmp/B.u6el52es/BUILD/zfs-2.0.5/module/zfs/zrlock.o CC [M] /tmp/B.u6el52es/BUILD/zfs-2.0.5/module/zfs/../os/linux/zfs/qat.o CC [M] /tmp/B.u6el52es/BUILD/zfs-2.0.5/module/zfs/zvol.o CC [M] /tmp/B.u6el52es/BUILD/zfs-2.0.5/module/zfs/../os/linux/zfs/abd_os.o CC [M] /tmp/B.u6el52es/BUILD/zfs-2.0.5/module/zfs/../os/linux/zfs/qat_compress.o CC [M] /tmp/B.u6el52es/BUILD/zfs-2.0.5/module/zfs/zio.o CC [M] /tmp/B.u6el52es/BUILD/zfs-2.0.5/module/zfs/../os/linux/zfs/qat_crypt.o CC [M] /tmp/B.u6el52es/BUILD/zfs-2.0.5/module/zfs/../os/linux/zfs/mmp_os.o CC [M] /tmp/B.u6el52es/BUILD/zfs-2.0.5/module/zfs/../os/linux/zfs/arc_os.o CC [M] /tmp/B.u6el52es/BUILD/zfs-2.0.5/module/zfs/../os/linux/zfs/policy.o CC [M] /tmp/B.u6el52es/BUILD/zfs-2.0.5/module/zfs/../os/linux/zfs/trace.o CC [M] /tmp/B.u6el52es/BUILD/zfs-2.0.5/module/zfs/../os/linux/zfs/spa_misc_os.o CC [M] /tmp/B.u6el52es/BUILD/zfs-2.0.5/module/zfs/../os/linux/zfs/vdev_file.o CC [M] /tmp/B.u6el52es/BUILD/zfs-2.0.5/module/zfs/../os/linux/zfs/zfs_debug.o CC [M] /tmp/B.u6el52es/BUILD/zfs-2.0.5/module/zfs/../os/linux/zfs/vdev_disk.o CC [M] /tmp/B.u6el52es/BUILD/zfs-2.0.5/module/zfs/../os/linux/zfs/zfs_ctldir.o CC [M] /tmp/B.u6el52es/BUILD/zfs-2.0.5/module/zfs/../os/linux/zfs/zfs_dir.o CC [M] /tmp/B.u6el52es/BUILD/zfs-2.0.5/module/zfs/../os/linux/zfs/zfs_file_os.o CC [M] /tmp/B.u6el52es/BUILD/zfs-2.0.5/module/zfs/../os/linux/zfs/zfs_racct.o CC [M] /tmp/B.u6el52es/BUILD/zfs-2.0.5/module/zfs/../os/linux/zfs/zfs_ioctl_os.o CC [M] /tmp/B.u6el52es/BUILD/zfs-2.0.5/module/zstd/lib/zstd.o CC [M] /tmp/B.u6el52es/BUILD/zfs-2.0.5/module/zfs/../os/linux/zfs/zfs_acl.o /tmp/B.u6el52es/BUILD/zfs-2.0.5/module/zfs/../os/linux/zfs/zfs_acl.c: In function 'zfs_ace_fuid_size': /tmp/B.u6el52es/BUILD/zfs-2.0.5/module/zfs/../os/linux/zfs/zfs_acl.c:269:48: warning: this statement may fall through [-Wimplicit-fallthrough=] 269 | entry_type == OWNING_GROUP || /tmp/B.u6el52es/BUILD/zfs-2.0.5/module/zfs/../os/linux/zfs/zfs_acl.c:273:9: note: here 273 | default: | ^~~~~~~ /tmp/B.u6el52es/BUILD/zfs-2.0.5/module/zfs/../os/linux/zfs/zfs_acl.c: In function 'zfs_zaccess_aces_check': /tmp/B.u6el52es/BUILD/zfs-2.0.5/module/zfs/../os/linux/zfs/zfs_acl.c:2319:29: warning: this statement may fall through [-Wimplicit-fallthrough=] 2319 | who = gowner; | ~~~~^~~~~~~~ /tmp/B.u6el52es/BUILD/zfs-2.0.5/module/zfs/../os/linux/zfs/zfs_acl.c:2321:17: note: here 2321 | case ACE_IDENTIFIER_GROUP: | ^~~~ LD [M] /tmp/B.u6el52es/BUILD/zfs-2.0.5/module/zstd/zzstd.o CC [M] /tmp/B.u6el52es/BUILD/zfs-2.0.5/module/zfs/../os/linux/zfs/zfs_sysfs.o CC [M] /tmp/B.u6el52es/BUILD/zfs-2.0.5/module/zfs/../os/linux/zfs/zfs_uio.o CC [M] /tmp/B.u6el52es/BUILD/zfs-2.0.5/module/zfs/../os/linux/zfs/zpl_ctldir.o CC [M] /tmp/B.u6el52es/BUILD/zfs-2.0.5/module/zfs/../os/linux/zfs/zpl_export.o CC [M] /tmp/B.u6el52es/BUILD/zfs-2.0.5/module/zfs/../os/linux/zfs/zio_crypt.o CC [M] /tmp/B.u6el52es/BUILD/zfs-2.0.5/module/zfs/../os/linux/zfs/zpl_file.o CC [M] /tmp/B.u6el52es/BUILD/zfs-2.0.5/module/zfs/../os/linux/zfs/zpl_super.o CC [M] /tmp/B.u6el52es/BUILD/zfs-2.0.5/module/zfs/../os/linux/zfs/zfs_vfsops.o CC [M] /tmp/B.u6el52es/BUILD/zfs-2.0.5/module/zfs/../os/linux/zfs/zpl_inode.o CC [M] /tmp/B.u6el52es/BUILD/zfs-2.0.5/module/zfs/../os/linux/zfs/zfs_znode.o /tmp/B.u6el52es/BUILD/zfs-2.0.5/module/zfs/../os/linux/zfs/zfs_znode.c: In function 'zfs_inode_set_ops': /tmp/B.u6el52es/BUILD/zfs-2.0.5/module/zfs/../os/linux/zfs/zfs_znode.c:431:24: warning: this statement may fall through [-Wimplicit-fallthrough=] 431 | (void) sa_lookup(ITOZ(ip)->z_sa_hdl, SA_ZPL_RDEV(zfsvfs), &rdev, | ^~~~~~~~~~~~~~~~~~~~~~~~~~~~~~~~~~~~~~~~~~~~~~~~~~~~~~~~~ 432 | sizeof (rdev)); | ~~~~~~~~~~~~~~ /tmp/B.u6el52es/BUILD/zfs-2.0.5/module/zfs/../os/linux/zfs/zfs_znode.c:434:9: note: here 434 | case S_IFIFO: | ^~~~ CC [M] /tmp/B.u6el52es/BUILD/zfs-2.0.5/module/zfs/../os/linux/zfs/zpl_xattr.o CC [M] /tmp/B.u6el52es/BUILD/zfs-2.0.5/module/zfs/../os/linux/zfs/zvol_os.o /tmp/B.u6el52es/BUILD/zfs-2.0.5/module/zfs/../os/linux/zfs/zvol_os.c: In function 'zvol_alloc': /tmp/B.u6el52es/BUILD/zfs-2.0.5/module/zfs/../os/linux/zfs/zvol_os.c:763:26: error: implicit declaration of function 'blk_alloc_queue'; did you mean 'blk_sync_queue'? [-Werror=implicit-function-declaration] 763 | zso->zvo_queue = blk_alloc_queue(NUMA_NO_NODE); | ^~~~~~~~~~~~~~~ | blk_sync_queue /tmp/B.u6el52es/BUILD/zfs-2.0.5/module/zfs/../os/linux/zfs/zvol_os.c:763:24: warning: assignment to 'struct request_queue *' from 'int' makes pointer from integer without a cast [-Wint-conversion] 763 | zso->zvo_queue = blk_alloc_queue(NUMA_NO_NODE); | ^ cc1: some warnings being treated as errors make[5]: *** [scripts/Makefile.build:271: /tmp/B.u6el52es/BUILD/zfs-2.0.5/module/zfs/../os/linux/zfs/zvol_os.o] Error 1 make[5]: *** Waiting for unfinished jobs.... CC [M] /tmp/B.u6el52es/BUILD/zfs-2.0.5/module/zfs/../os/linux/zfs/zfs_vnops_os.o CC [M] /tmp/B.u6el52es/BUILD/zfs-2.0.5/module/zfs/vdev_raidz_math_ssse3.o CC [M] /tmp/B.u6el52es/BUILD/zfs-2.0.5/module/zfs/vdev_raidz_math_avx2.o CC [M] /tmp/B.u6el52es/BUILD/zfs-2.0.5/module/zfs/vdev_raidz_math_avx512bw.o CC [M] /tmp/B.u6el52es/BUILD/zfs-2.0.5/module/zfs/vdev_raidz_math_sse2.o CC [M] /tmp/B.u6el52es/BUILD/zfs-2.0.5/module/zfs/vdev_raidz_math_avx512f.o make[4]: *** [scripts/Makefile.build:514: /tmp/B.u6el52es/BUILD/zfs-2.0.5/module/zfs] Error 2 make[3]: *** [Makefile:1851: /tmp/B.u6el52es/BUILD/zfs-2.0.5/module] Error 2 make[2]: *** [Makefile:49: modules-Linux] Error 2 make[1]: *** [Makefile:892: all-recursive] Error 1 make: *** [Makefile:753: all] Error 2 error: Bad exit status from /tmp/B.u6el52es/BUILD/tmp/rpm-tmp.5dAh4w (%build) RPM build errors: Could not canonicalize hostname: ymir Bad exit status from /tmp/B.u6el52es/BUILD/tmp/rpm-tmp.5dAh4w (%build) ended at: Tue Sep 7 09:48:18 2021, done in 0:05:16.358564 error: No files produced. + chmod -R u+rwX /tmp/B.u6el52es/BUILD + rm -rf /tmp/B.u6el52es/tmp /tmp/B.u6el52es/BUILD + rm -rf /tmp/B.u6el52es Begin-PLD-Builder-Info Build-Time: user:1090.32s sys:200.83s real:336.71s (faults io:1110 non-io:40111693) End-PLD-Builder-Info
[Back to list of logs] [View rpm -qa of builder]