FailedOk

th/SRPMS[OK]
th/x32[OK]
th/i686[OK]
th/x86_64[OK]

ac/SRPMS[OK]
ac/i386[OK]
ac/i586[OK]
ac/i686[OK]
ac/alpha[OK]
ac/amd64[OK]
ac/athlon[OK]
ac/ppc[OK]
ac/sparc[OK]
ac/sparc64[OK]

Advanced Search
main()
Powered by PLD Linux
(c) 2002-2021 PLD Team
$Revision: 1.37 $
Powered by electricity.
Your IP: 44.192.254.246

zfs 945e193e-5c59-4319-a82f-6f99c05a6fbf

Status:Failed
Source URL:https://buildlogs.pld-linux.org/pld/th/x86_64/FAIL/zfs,945e193e-5c59-4319-a82f-6f99c05a6fbf.bz2
text/plain URL:View!
full text:View!
rpm -qa of builder:View!
Date:2021/09/07 09:48:18
Runtime:0:05:16.358564

Toc:

  • error 1
  • /tmp/B.u6el52es/BUILD/zfs-2.0.5/module/zfs/../os/linux/zfs/zvol_os.c:763:26: error: implicit declaration of function 'blk_alloc_queue'; did you mean 'blk_sync_queue'? [-Werror=implicit-function-declaration]
  • error 2
  • make[5]: *** [scripts/Makefile.build:271: /tmp/B.u6el52es/BUILD/zfs-2.0.5/module/zfs/../os/linux/zfs/zvol_os.o] Error 1
  • error 3
  • make[4]: *** [scripts/Makefile.build:514: /tmp/B.u6el52es/BUILD/zfs-2.0.5/module/zfs] Error 2
  • error 4
  • make[3]: *** [Makefile:1851: /tmp/B.u6el52es/BUILD/zfs-2.0.5/module] Error 2
  • error 5
  • make[2]: *** [Makefile:49: modules-Linux] Error 2
  • error 6
  • make[1]: *** [Makefile:892: all-recursive] Error 1
  • error 7
  • error: Bad exit status from /tmp/B.u6el52es/BUILD/tmp/rpm-tmp.5dAh4w (%build)
  • error 8
  • RPM build errors:
  • error 9
  • error: No files produced.

Content:

      |                 ~~~~~~~~~~~~~~~~~~~~~~^~~~~~~~~~~~~~~~~~~~~~~~~~~~~
  363 |                     (void *)&name, lracl->lr_fuidcnt, lracl->lr_domcnt,
      |                     ~~~~~~~~~~~~~~~~~~~~~~~~~~~~~~~~~~~~~~~~~~~~~~~~~~~
  364 |                     lr->lr_uid, lr->lr_gid);
      |                     ~~~~~~~~~~~~~~~~~~~~~~~
/tmp/B.u6el52es/BUILD/zfs-2.0.5/module/zfs/zfs_replay.c:366:9: note: here
  366 |         case TX_CREATE_ACL_ATTR:
      |         ^~~~
/tmp/B.u6el52es/BUILD/zfs-2.0.5/module/zfs/zfs_replay.c:394:39: warning: this statement may fall through [-Wimplicit-fallthrough=]
  394 |                 zfsvfs->z_fuid_replay = zfs_replay_fuids(fuidstart,
      |                 ~~~~~~~~~~~~~~~~~~~~~~^~~~~~~~~~~~~~~~~~~~~~~~~~~~~
  395 |                     (void *)&name, lracl->lr_fuidcnt, lracl->lr_domcnt,
      |                     ~~~~~~~~~~~~~~~~~~~~~~~~~~~~~~~~~~~~~~~~~~~~~~~~~~~
  396 |                     lr->lr_uid, lr->lr_gid);
      |                     ~~~~~~~~~~~~~~~~~~~~~~~
/tmp/B.u6el52es/BUILD/zfs-2.0.5/module/zfs/zfs_replay.c:398:9: note: here
  398 |         case TX_MKDIR_ACL_ATTR:
      |         ^~~~
/tmp/B.u6el52es/BUILD/zfs-2.0.5/module/zfs/zfs_replay.c: In function 'zfs_replay_create':
/tmp/B.u6el52es/BUILD/zfs-2.0.5/module/zfs/zfs_replay.c:521:22: warning: this statement may fall through [-Wimplicit-fallthrough=]
  521 |                 name = (char *)start;
      |                 ~~~~~^~~~~~~~~~~~~~~
/tmp/B.u6el52es/BUILD/zfs-2.0.5/module/zfs/zfs_replay.c:524:9: note: here
  524 |         case TX_CREATE:
      |         ^~~~
/tmp/B.u6el52es/BUILD/zfs-2.0.5/module/zfs/zfs_replay.c:539:22: warning: this statement may fall through [-Wimplicit-fallthrough=]
  539 |                 name = (char *)start;
      |                 ~~~~~^~~~~~~~~~~~~~~
/tmp/B.u6el52es/BUILD/zfs-2.0.5/module/zfs/zfs_replay.c:542:9: note: here
  542 |         case TX_MKDIR:
      |         ^~~~
  CC [M]  /tmp/B.u6el52es/BUILD/zfs-2.0.5/module/zfs/zfs_rlock.o
  CC [M]  /tmp/B.u6el52es/BUILD/zfs-2.0.5/module/zfs/zfs_sa.o
  CC [M]  /tmp/B.u6el52es/BUILD/zfs-2.0.5/module/zfs/zfs_vnops.o
  CC [M]  /tmp/B.u6el52es/BUILD/zfs-2.0.5/module/zfs/zio_compress.o
  CC [M]  /tmp/B.u6el52es/BUILD/zfs-2.0.5/module/zfs/zio_checksum.o
  CC [M]  /tmp/B.u6el52es/BUILD/zfs-2.0.5/module/zfs/zfs_ioctl.o
  CC [M]  /tmp/B.u6el52es/BUILD/zfs-2.0.5/module/zfs/zle.o
  CC [M]  /tmp/B.u6el52es/BUILD/zfs-2.0.5/module/zfs/zthr.o
  CC [M]  /tmp/B.u6el52es/BUILD/zfs-2.0.5/module/zfs/zil.o
  CC [M]  /tmp/B.u6el52es/BUILD/zfs-2.0.5/module/zfs/zio_inject.o
  CC [M]  /tmp/B.u6el52es/BUILD/zfs-2.0.5/module/zfs/zrlock.o
  CC [M]  /tmp/B.u6el52es/BUILD/zfs-2.0.5/module/zfs/../os/linux/zfs/qat.o
  CC [M]  /tmp/B.u6el52es/BUILD/zfs-2.0.5/module/zfs/zvol.o
  CC [M]  /tmp/B.u6el52es/BUILD/zfs-2.0.5/module/zfs/../os/linux/zfs/abd_os.o
  CC [M]  /tmp/B.u6el52es/BUILD/zfs-2.0.5/module/zfs/../os/linux/zfs/qat_compress.o
  CC [M]  /tmp/B.u6el52es/BUILD/zfs-2.0.5/module/zfs/zio.o
  CC [M]  /tmp/B.u6el52es/BUILD/zfs-2.0.5/module/zfs/../os/linux/zfs/qat_crypt.o
  CC [M]  /tmp/B.u6el52es/BUILD/zfs-2.0.5/module/zfs/../os/linux/zfs/mmp_os.o
  CC [M]  /tmp/B.u6el52es/BUILD/zfs-2.0.5/module/zfs/../os/linux/zfs/arc_os.o
  CC [M]  /tmp/B.u6el52es/BUILD/zfs-2.0.5/module/zfs/../os/linux/zfs/policy.o
  CC [M]  /tmp/B.u6el52es/BUILD/zfs-2.0.5/module/zfs/../os/linux/zfs/trace.o
  CC [M]  /tmp/B.u6el52es/BUILD/zfs-2.0.5/module/zfs/../os/linux/zfs/spa_misc_os.o
  CC [M]  /tmp/B.u6el52es/BUILD/zfs-2.0.5/module/zfs/../os/linux/zfs/vdev_file.o
  CC [M]  /tmp/B.u6el52es/BUILD/zfs-2.0.5/module/zfs/../os/linux/zfs/zfs_debug.o
  CC [M]  /tmp/B.u6el52es/BUILD/zfs-2.0.5/module/zfs/../os/linux/zfs/vdev_disk.o
  CC [M]  /tmp/B.u6el52es/BUILD/zfs-2.0.5/module/zfs/../os/linux/zfs/zfs_ctldir.o
  CC [M]  /tmp/B.u6el52es/BUILD/zfs-2.0.5/module/zfs/../os/linux/zfs/zfs_dir.o
  CC [M]  /tmp/B.u6el52es/BUILD/zfs-2.0.5/module/zfs/../os/linux/zfs/zfs_file_os.o
  CC [M]  /tmp/B.u6el52es/BUILD/zfs-2.0.5/module/zfs/../os/linux/zfs/zfs_racct.o
  CC [M]  /tmp/B.u6el52es/BUILD/zfs-2.0.5/module/zfs/../os/linux/zfs/zfs_ioctl_os.o
  CC [M]  /tmp/B.u6el52es/BUILD/zfs-2.0.5/module/zstd/lib/zstd.o
  CC [M]  /tmp/B.u6el52es/BUILD/zfs-2.0.5/module/zfs/../os/linux/zfs/zfs_acl.o
/tmp/B.u6el52es/BUILD/zfs-2.0.5/module/zfs/../os/linux/zfs/zfs_acl.c: In function 'zfs_ace_fuid_size':
/tmp/B.u6el52es/BUILD/zfs-2.0.5/module/zfs/../os/linux/zfs/zfs_acl.c:269:48: warning: this statement may fall through [-Wimplicit-fallthrough=]
  269 |                     entry_type == OWNING_GROUP ||
/tmp/B.u6el52es/BUILD/zfs-2.0.5/module/zfs/../os/linux/zfs/zfs_acl.c:273:9: note: here
  273 |         default:
      |         ^~~~~~~
/tmp/B.u6el52es/BUILD/zfs-2.0.5/module/zfs/../os/linux/zfs/zfs_acl.c: In function 'zfs_zaccess_aces_check':
/tmp/B.u6el52es/BUILD/zfs-2.0.5/module/zfs/../os/linux/zfs/zfs_acl.c:2319:29: warning: this statement may fall through [-Wimplicit-fallthrough=]
 2319 |                         who = gowner;
      |                         ~~~~^~~~~~~~
/tmp/B.u6el52es/BUILD/zfs-2.0.5/module/zfs/../os/linux/zfs/zfs_acl.c:2321:17: note: here
 2321 |                 case ACE_IDENTIFIER_GROUP:
      |                 ^~~~
  LD [M]  /tmp/B.u6el52es/BUILD/zfs-2.0.5/module/zstd/zzstd.o
  CC [M]  /tmp/B.u6el52es/BUILD/zfs-2.0.5/module/zfs/../os/linux/zfs/zfs_sysfs.o
  CC [M]  /tmp/B.u6el52es/BUILD/zfs-2.0.5/module/zfs/../os/linux/zfs/zfs_uio.o
  CC [M]  /tmp/B.u6el52es/BUILD/zfs-2.0.5/module/zfs/../os/linux/zfs/zpl_ctldir.o
  CC [M]  /tmp/B.u6el52es/BUILD/zfs-2.0.5/module/zfs/../os/linux/zfs/zpl_export.o
  CC [M]  /tmp/B.u6el52es/BUILD/zfs-2.0.5/module/zfs/../os/linux/zfs/zio_crypt.o
  CC [M]  /tmp/B.u6el52es/BUILD/zfs-2.0.5/module/zfs/../os/linux/zfs/zpl_file.o
  CC [M]  /tmp/B.u6el52es/BUILD/zfs-2.0.5/module/zfs/../os/linux/zfs/zpl_super.o
  CC [M]  /tmp/B.u6el52es/BUILD/zfs-2.0.5/module/zfs/../os/linux/zfs/zfs_vfsops.o
  CC [M]  /tmp/B.u6el52es/BUILD/zfs-2.0.5/module/zfs/../os/linux/zfs/zpl_inode.o
  CC [M]  /tmp/B.u6el52es/BUILD/zfs-2.0.5/module/zfs/../os/linux/zfs/zfs_znode.o
/tmp/B.u6el52es/BUILD/zfs-2.0.5/module/zfs/../os/linux/zfs/zfs_znode.c: In function 'zfs_inode_set_ops':
/tmp/B.u6el52es/BUILD/zfs-2.0.5/module/zfs/../os/linux/zfs/zfs_znode.c:431:24: warning: this statement may fall through [-Wimplicit-fallthrough=]
  431 |                 (void) sa_lookup(ITOZ(ip)->z_sa_hdl, SA_ZPL_RDEV(zfsvfs), &rdev,
      |                        ^~~~~~~~~~~~~~~~~~~~~~~~~~~~~~~~~~~~~~~~~~~~~~~~~~~~~~~~~
  432 |                     sizeof (rdev));
      |                     ~~~~~~~~~~~~~~
/tmp/B.u6el52es/BUILD/zfs-2.0.5/module/zfs/../os/linux/zfs/zfs_znode.c:434:9: note: here
  434 |         case S_IFIFO:
      |         ^~~~
  CC [M]  /tmp/B.u6el52es/BUILD/zfs-2.0.5/module/zfs/../os/linux/zfs/zpl_xattr.o
  CC [M]  /tmp/B.u6el52es/BUILD/zfs-2.0.5/module/zfs/../os/linux/zfs/zvol_os.o
/tmp/B.u6el52es/BUILD/zfs-2.0.5/module/zfs/../os/linux/zfs/zvol_os.c: In function 'zvol_alloc':
/tmp/B.u6el52es/BUILD/zfs-2.0.5/module/zfs/../os/linux/zfs/zvol_os.c:763:26: error: implicit declaration of function 'blk_alloc_queue'; did you mean 'blk_sync_queue'? [-Werror=implicit-function-declaration]
  763 |         zso->zvo_queue = blk_alloc_queue(NUMA_NO_NODE);
      |                          ^~~~~~~~~~~~~~~
      |                          blk_sync_queue
/tmp/B.u6el52es/BUILD/zfs-2.0.5/module/zfs/../os/linux/zfs/zvol_os.c:763:24: warning: assignment to 'struct request_queue *' from 'int' makes pointer from integer without a cast [-Wint-conversion]
  763 |         zso->zvo_queue = blk_alloc_queue(NUMA_NO_NODE);
      |                        ^
cc1: some warnings being treated as errors
make[5]: *** [scripts/Makefile.build:271: /tmp/B.u6el52es/BUILD/zfs-2.0.5/module/zfs/../os/linux/zfs/zvol_os.o] Error 1
make[5]: *** Waiting for unfinished jobs....
  CC [M]  /tmp/B.u6el52es/BUILD/zfs-2.0.5/module/zfs/../os/linux/zfs/zfs_vnops_os.o
  CC [M]  /tmp/B.u6el52es/BUILD/zfs-2.0.5/module/zfs/vdev_raidz_math_ssse3.o
  CC [M]  /tmp/B.u6el52es/BUILD/zfs-2.0.5/module/zfs/vdev_raidz_math_avx2.o
  CC [M]  /tmp/B.u6el52es/BUILD/zfs-2.0.5/module/zfs/vdev_raidz_math_avx512bw.o
  CC [M]  /tmp/B.u6el52es/BUILD/zfs-2.0.5/module/zfs/vdev_raidz_math_sse2.o
  CC [M]  /tmp/B.u6el52es/BUILD/zfs-2.0.5/module/zfs/vdev_raidz_math_avx512f.o
make[4]: *** [scripts/Makefile.build:514: /tmp/B.u6el52es/BUILD/zfs-2.0.5/module/zfs] Error 2
make[3]: *** [Makefile:1851: /tmp/B.u6el52es/BUILD/zfs-2.0.5/module] Error 2
make[2]: *** [Makefile:49: modules-Linux] Error 2
make[1]: *** [Makefile:892: all-recursive] Error 1
make: *** [Makefile:753: all] Error 2
error: Bad exit status from /tmp/B.u6el52es/BUILD/tmp/rpm-tmp.5dAh4w (%build)


RPM build errors:
    Could not canonicalize hostname: ymir
    Bad exit status from /tmp/B.u6el52es/BUILD/tmp/rpm-tmp.5dAh4w (%build)
ended at: Tue Sep  7 09:48:18 2021, done in 0:05:16.358564
error: No files produced.
+ chmod -R u+rwX /tmp/B.u6el52es/BUILD
+ rm -rf /tmp/B.u6el52es/tmp /tmp/B.u6el52es/BUILD
+ rm -rf /tmp/B.u6el52es
Begin-PLD-Builder-Info
Build-Time: user:1090.32s sys:200.83s real:336.71s (faults io:1110 non-io:40111693)

End-PLD-Builder-Info
[Back to list of logs] [View rpm -qa of builder]